You are viewing a plain text version of this content. The canonical link for it is here.
Posted to commits@karaf.apache.org by Apache Jenkins Server <je...@builds.apache.org> on 2011/12/12 00:18:14 UTC

Build failed in Jenkins: Karaf-2.2.x #306

See <https://builds.apache.org/job/Karaf-2.2.x/306/changes>

Changes:

[jgoodyear] [KARAF-1085] Add Kar deployer demo using features-maven-plugin

Clean up pom to remove commented out parent.

[jgoodyear] [KARAF-1085] Add Kar deployer demo using features-maven-plugin

Adding Karaf Archive demo.

------------------------------------------
[...truncated 32702 lines...]
246791/?
247302/?
247915/?
248485/?
248996/?
249508/?
250020/?
250483/?
250507/?
251071/?
251581/?
252149/?
252606/?
253108/?
253619/?
254130/?
254694/?
255205/?
255718/?
256262/?
256812/?
257366/?
258030/?
258643/?
259154/?
259665/?
260176/?
260687/?
261303/?
261813/?
262324/?
262700/?
263472/?
263584/?
263608/?
264119/?
264629/?
265140/?
265651/?
266274/?
266784/?
267295/?
267861/?
268372/?
268883/?
269423/?
270407/?
271689/?
273409/?
275252/?
277071/?
278960/?
[ maven embedder INFO] [bundle:bundle]
[ maven embedder WARNING] Warning building bundle org.apache.karaf.archetypes:archetypes-command:bundle:2.2.5-SNAPSHOT : Did not find matching referal for !archetypes-command*
Tests run: 1, Failures: 0, Errors: 0, Skipped: 0, Time elapsed: 30.555 sec

Results :

Tests run: 1, Failures: 0, Errors: 0, Skipped: 0

[JENKINS] Recording test results
[INFO] [jar:jar {execution: default-jar}]
[INFO] Building jar: <https://builds.apache.org/job/Karaf-2.2.x/ws/karaf/archetypes/itests/target/archetypes-itests-2.2.5-SNAPSHOT.jar>
[INFO] [install:install {execution: default-install}]
[INFO] Installing <https://builds.apache.org/job/Karaf-2.2.x/ws/karaf/archetypes/itests/target/archetypes-itests-2.2.5-SNAPSHOT.jar> to <https://builds.apache.org/job/Karaf-2.2.x/ws/.repository/org/apache/karaf/archetypes/archetypes-itests/2.2.5-SNAPSHOT/archetypes-itests-2.2.5-SNAPSHOT.jar>
[JENKINS] Archiving <https://builds.apache.org/job/Karaf-2.2.x/ws/karaf/archetypes/itests/pom.xml> to /home/hudson/hudson/jobs/Karaf-2.2.x/modules/org.apache.karaf.archetypes$archetypes-itests/builds/2011-12-11_23-02-14/archive/org.apache.karaf.archetypes/archetypes-itests/2.2.5-SNAPSHOT/archetypes-itests-2.2.5-SNAPSHOT.pom
[JENKINS] Archiving <https://builds.apache.org/job/Karaf-2.2.x/ws/karaf/archetypes/itests/target/archetypes-itests-2.2.5-SNAPSHOT.jar> to /home/hudson/hudson/jobs/Karaf-2.2.x/modules/org.apache.karaf.archetypes$archetypes-itests/builds/2011-12-11_23-02-14/archive/org.apache.karaf.archetypes/archetypes-itests/2.2.5-SNAPSHOT/archetypes-itests-2.2.5-SNAPSHOT.jar
[INFO] 
[INFO] 
[INFO] ------------------------------------------------------------------------
[INFO] Reactor Summary:
[INFO] ------------------------------------------------------------------------
[INFO] Apache Karaf .......................................... SUCCESS [1:25.885s]
[INFO] Apache Karaf :: Util .................................. SUCCESS [35.205s]
[INFO] Apache Karaf :: Main .................................. SUCCESS [27.555s]
[INFO] Apache Karaf :: JAAS .................................. SUCCESS [0.190s]
[INFO] Apache Karaf :: JAAS :: Boot .......................... SUCCESS [1.890s]
[INFO] Apache Karaf :: JAAS :: Config ........................ SUCCESS [14.862s]
[INFO] Apache Karaf :: JAAS :: Modules ....................... SUCCESS [3.168s]
[INFO] Apache Karaf :: Shell ................................. SUCCESS [0.143s]
[INFO] Apache Karaf :: Shell :: Console ...................... SUCCESS [9.649s]
[INFO] Apache Karaf :: Shell :: OBR Commands ................. SUCCESS [4.104s]
[INFO] Apache Karaf :: Features .............................. SUCCESS [0.157s]
[INFO] Apache Karaf :: Features :: Core ...................... SUCCESS [9.611s]
[INFO] Apache Karaf :: Features :: Command ................... SUCCESS [3.015s]
[INFO] Apache Karaf :: Management ............................ SUCCESS [0.132s]
[INFO] Apache Karaf :: Management ............................ SUCCESS [3.227s]
[INFO] Apache Karaf :: Features :: Management ................ SUCCESS [2.658s]
[INFO] Apache Karaf :: Features :: OBR Resolver .............. SUCCESS [1.483s]
[INFO] Apache Karaf :: Admin ................................. SUCCESS [0.127s]
[INFO] Apache Karaf :: Admin :: Core ......................... SUCCESS [3.956s]
[INFO] Apache Karaf :: Admin :: Command ...................... SUCCESS [5.014s]
[INFO] Apache Karaf :: Admin :: Management ................... SUCCESS [1.405s]
[INFO] Apache Karaf :: Deployer .............................. SUCCESS [0.121s]
[INFO] Apache Karaf :: Deployer :: Spring .................... SUCCESS [2.352s]
[INFO] Apache Karaf :: Deployer :: Blueprint ................. SUCCESS [1.457s]
[INFO] Apache Karaf :: Deployer :: Features .................. SUCCESS [1.030s]
[INFO] Apache Karaf :: Deployer :: Karaf Archive (.kar) ...... SUCCESS [1.356s]
[INFO] Apache Karaf :: Deployer :: Wrap Non OSGi Jar ......... SUCCESS [0.839s]
[INFO] Apache Karaf :: Shell :: Various Commands ............. SUCCESS [2.473s]
[INFO] Apache Karaf :: Shell :: ConfigAdmin Commands ......... SUCCESS [1.521s]
[INFO] Apache Karaf :: Shell :: Log Commands ................. SUCCESS [5.371s]
[INFO] Apache Karaf :: Shell :: OSGi Commands ................ SUCCESS [9.709s]
[INFO] Apache Karaf :: Shell :: PackageAdmin Commands ........ SUCCESS [0.871s]
[INFO] Apache Karaf :: Shell :: SSH .......................... SUCCESS [4.009s]
[INFO] Apache Karaf :: Shell :: Service Wrapper .............. SUCCESS [2.967s]
[INFO] Apache Karaf :: Shell :: Development Commands ......... SUCCESS [4.505s]
[INFO] Apache Karaf :: Shell :: Web Commands ................. SUCCESS [2.443s]
[INFO] Apache Karaf :: JAAS :: Jasypt Encryption ............. SUCCESS [13.068s]
[INFO] Apache Karaf :: Jaas :: Command ....................... SUCCESS [0.983s]
[INFO] Apache Karaf :: Client ................................ SUCCESS [12.606s]
[INFO] Apache Karaf :: Management :: MBeans .................. SUCCESS [0.090s]
[INFO] Apache Karaf :: Management :: MBeans :: Bundles ....... SUCCESS [0.737s]
[INFO] Apache Karaf :: Management :: MBeans :: Services ...... SUCCESS [0.864s]
[INFO] Apache Karaf :: Management :: MBeans :: System ........ SUCCESS [0.851s]
[INFO] Apache Karaf :: Management :: MBeans :: Packages ...... SUCCESS [0.920s]
[INFO] Apache Karaf :: Management :: MBeans :: Config ........ SUCCESS [0.963s]
[INFO] Apache Karaf :: Management :: MBeans :: Dev ........... SUCCESS [0.866s]
[INFO] Apache Karaf :: Management :: MBeans :: Log ........... SUCCESS [0.867s]
[INFO] Apache Karaf :: Management :: MBeans :: OBR ........... SUCCESS [0.978s]
[INFO] Apache Karaf :: Management :: MBeans :: Web ........... SUCCESS [0.772s]
[INFO] Apache Karaf :: Web Console ........................... SUCCESS [0.123s]
[INFO] Apache Karaf :: Web Console :: Console ................ SUCCESS [8.045s]
[INFO] Apache Karaf :: Web Console :: Branding ............... SUCCESS [1.779s]
[INFO] Apache Karaf :: Web Console :: Features Plugin ........ SUCCESS [2.055s]
[INFO] Apache Karaf :: Web Console :: Gogo Plugin ............ SUCCESS [1.417s]
[INFO] Apache Karaf :: Web Console :: Admin Plugin ........... SUCCESS [2.825s]
[INFO] Apache Karaf :: Exception ............................. SUCCESS [0.790s]
[INFO] Apache Karaf :: Assemblies ............................ SUCCESS [0.170s]
[INFO] Apache Karaf :: Assemblies :: Features ................ SUCCESS [0.111s]
[INFO] Apache Karaf :: Assemblies :: Features :: Standard .... SUCCESS [4.122s]
[INFO] Apache Karaf :: Assemblies :: Features :: Enterprise .. SUCCESS [5.033s]
[INFO] Apache Karaf :: Diagnostic ............................ SUCCESS [0.132s]
[INFO] Apache Karaf :: Diagnostic :: Core .................... SUCCESS [1.813s]
[INFO] Apache Karaf :: Diagnostic :: Common .................. SUCCESS [2.096s]
[INFO] Apache Karaf :: Diagnostic :: Command ................. SUCCESS [0.931s]
[INFO] Apache Karaf :: Diagnostic :: Management .............. SUCCESS [0.876s]
[INFO] Apache Karaf :: Tooling ............................... SUCCESS [0.087s]
[INFO] Apache Karaf :: Tooling :: Maven2 Features plugin ..... SUCCESS [45.559s]
[INFO] Apache Karaf :: Assembly .............................. SUCCESS [3:01.928s]
[INFO] Apache Karaf :: Demos ................................. SUCCESS [0.125s]
[INFO] Apache Karaf :: Demos :: Web .......................... SUCCESS [11.349s]
[INFO] Apache Karaf :: Demos :: Branding ..................... SUCCESS [0.161s]
[INFO] Apache Karaf :: Demos :: Branding :: Shell ............ SUCCESS [0.598s]
[INFO] Apache Karaf :: Demos :: Demo Dump provider ........... SUCCESS [0.811s]
[INFO] Apache Karaf :: Demos :: Extend Console Command ....... SUCCESS [2.391s]
[INFO] Apache Karaf :: Demos :: Deployer :: Kar .............. SUCCESS [49.454s]
[INFO] Apache Karaf :: Demos :: Deployer ..................... SUCCESS [0.115s]
[INFO] Apache Karaf :: Integration Tests ..................... SUCCESS [0.114s]
[INFO] Apache Karaf :: Integration Tests :: Dependencies ..... SUCCESS [9.989s]
[INFO] Apache Karaf :: Tooling :: Testing environment ........ SUCCESS [9.085s]
[INFO] Apache Karaf :: Integration Tests :: ITests ........... SUCCESS [1:07.934s]
[INFO] Apache Karaf :: Integration Tests :: Kit Tests ........ SUCCESS [6.453s]
[INFO] Apache Karaf :: Tooling :: Maven2 Command Help plugin . SUCCESS [3.533s]
[INFO] Apache Karaf :: Archetypes ............................ SUCCESS [0.097s]
[INFO] Apache Karaf :: Command Archetype ..................... SUCCESS [19.039s]
[INFO] Apache Karaf :: Archetypes :: ITests .................. SUCCESS [48.468s]
[INFO] ------------------------------------------------------------------------
[INFO] ------------------------------------------------------------------------
[INFO] BUILD SUCCESSFUL
[INFO] ------------------------------------------------------------------------
[INFO] Total time: 15 minutes 31 seconds
[INFO] Finished at: Sun Dec 11 23:17:51 GMT 2011
[INFO] Final Memory: 287M/984M
[INFO] ------------------------------------------------------------------------
channel stopped
Maven RedeployPublished use remote ubuntu3 maven settings from : /home/jenkins/.m2/settings.xml
[INFO] Deployment in https://repository.apache.org/content/repositories/snapshots (id=apache.snapshots.https,uniqueVersion=false)
Deploying the main artifact apache-karaf-2.2.5-SNAPSHOT.pom
Deploying the main artifact apache-karaf-2.2.5-SNAPSHOT-jettyconfig.xml
Deploying the main artifact apache-karaf-2.2.5-SNAPSHOT-minimal.tar.gz
Deploying the main artifact apache-karaf-2.2.5-SNAPSHOT.tar.gz
Deploying the main artifact apache-karaf-2.2.5-SNAPSHOT-minimal.zip
Deploying the main artifact apache-karaf-2.2.5-SNAPSHOT.zip
Deploying the main artifact apache-karaf-2.2.5-SNAPSHOT-src.tar.gz
Deploying the main artifact apache-karaf-2.2.5-SNAPSHOT-src.zip
[INFO] Deployment in https://repository.apache.org/content/repositories/snapshots (id=apache.snapshots.https,uniqueVersion=false)
Deploying the main artifact archetypes-2.2.5-SNAPSHOT.pom
[INFO] Deployment in https://repository.apache.org/content/repositories/snapshots (id=apache.snapshots.https,uniqueVersion=false)
Deploying the main artifact karaf-2.2.5-SNAPSHOT.pom
[INFO] Deployment in https://repository.apache.org/content/repositories/snapshots (id=apache.snapshots.https,uniqueVersion=false)
Deploying the main artifact org.apache.karaf.client-2.2.5-SNAPSHOT.jar
[INFO] Deployment in https://repository.apache.org/content/repositories/snapshots (id=apache.snapshots.https,uniqueVersion=false)
Deploying the main artifact org.apache.karaf.exception-2.2.5-SNAPSHOT.jar
[INFO] Deployment in https://repository.apache.org/content/repositories/snapshots (id=apache.snapshots.https,uniqueVersion=false)
Deploying the main artifact org.apache.karaf.main-2.2.5-SNAPSHOT.jar
[INFO] Deployment in https://repository.apache.org/content/repositories/snapshots (id=apache.snapshots.https,uniqueVersion=false)
Deploying the main artifact org.apache.karaf.util-2.2.5-SNAPSHOT.jar
[INFO] Deployment in https://repository.apache.org/content/repositories/snapshots (id=apache.snapshots.https,uniqueVersion=false)
Deploying the main artifact admin-2.2.5-SNAPSHOT.pom
[INFO] Deployment in https://repository.apache.org/content/repositories/snapshots (id=apache.snapshots.https,uniqueVersion=false)
Deploying the main artifact org.apache.karaf.admin.command-2.2.5-SNAPSHOT.jar
[INFO] Deployment in https://repository.apache.org/content/repositories/snapshots (id=apache.snapshots.https,uniqueVersion=false)
Deploying the main artifact org.apache.karaf.admin.core-2.2.5-SNAPSHOT.jar
[INFO] Deployment in https://repository.apache.org/content/repositories/snapshots (id=apache.snapshots.https,uniqueVersion=false)
Deploying the main artifact org.apache.karaf.admin.management-2.2.5-SNAPSHOT.jar
[INFO] Deployment in https://repository.apache.org/content/repositories/snapshots (id=apache.snapshots.https,uniqueVersion=false)
Deploying the main artifact archetypes-command-2.2.5-SNAPSHOT.jar
[INFO] Deployment in https://repository.apache.org/content/repositories/snapshots (id=apache.snapshots.https,uniqueVersion=false)
Deploying the main artifact archetypes-itests-2.2.5-SNAPSHOT.jar
[INFO] Deployment in https://repository.apache.org/content/repositories/snapshots (id=apache.snapshots.https,uniqueVersion=false)
Deploying the main artifact assemblies-2.2.5-SNAPSHOT.pom
[INFO] Deployment in https://repository.apache.org/content/repositories/snapshots (id=apache.snapshots.https,uniqueVersion=false)
Deploying the main artifact enterprise-2.2.5-SNAPSHOT.jar
Deploying the main artifact enterprise-2.2.5-SNAPSHOT-features.xml
[INFO] Deployment in https://repository.apache.org/content/repositories/snapshots (id=apache.snapshots.https,uniqueVersion=false)
Deploying the main artifact features-2.2.5-SNAPSHOT.pom
[INFO] Deployment in https://repository.apache.org/content/repositories/snapshots (id=apache.snapshots.https,uniqueVersion=false)
Deploying the main artifact standard-2.2.5-SNAPSHOT.jar
Deploying the main artifact standard-2.2.5-SNAPSHOT-features.xml
[INFO] Deployment in https://repository.apache.org/content/repositories/snapshots (id=apache.snapshots.https,uniqueVersion=false)
Deploying the main artifact demos-2.2.5-SNAPSHOT.pom
[INFO] Deployment in https://repository.apache.org/content/repositories/snapshots (id=apache.snapshots.https,uniqueVersion=false)
Deploying the main artifact dump-2.2.5-SNAPSHOT.jar
[INFO] Deployment in https://repository.apache.org/content/repositories/snapshots (id=apache.snapshots.https,uniqueVersion=false)
Deploying the main artifact org.apache.karaf.demos.branding-2.2.5-SNAPSHOT.pom
[INFO] Deployment in https://repository.apache.org/content/repositories/snapshots (id=apache.snapshots.https,uniqueVersion=false)
Deploying the main artifact org.apache.karaf.demos.branding.shell-2.2.5-SNAPSHOT.jar
[INFO] Deployment in https://repository.apache.org/content/repositories/snapshots (id=apache.snapshots.https,uniqueVersion=false)
Deploying the main artifact org.apache.karaf.demos.command-2.2.5-SNAPSHOT.jar
[INFO] Deployment in https://repository.apache.org/content/repositories/snapshots (id=apache.snapshots.https,uniqueVersion=false)
Deploying the main artifact org.apache.karaf.demos.deployer-2.2.5-SNAPSHOT.pom
[INFO] Deployment in https://repository.apache.org/content/repositories/snapshots (id=apache.snapshots.https,uniqueVersion=false)
Deploying the main artifact web-2.2.5-SNAPSHOT.war
[INFO] Deployment in https://repository.apache.org/content/repositories/snapshots (id=apache.snapshots.https,uniqueVersion=false)
Deploying the main artifact my-kar-1.0.pom
ERROR: Error deploying artifact: Failed to transfer file: https://repository.apache.org/content/repositories/snapshots/org/apache/karaf/demos/deployer/kar/my-kar/1.0/my-kar-1.0.pom. Return code is: 400
org.apache.maven.artifact.deployer.ArtifactDeploymentException: Error deploying artifact: Failed to transfer file: https://repository.apache.org/content/repositories/snapshots/org/apache/karaf/demos/deployer/kar/my-kar/1.0/my-kar-1.0.pom. Return code is: 400
	at hudson.maven.artifact.deployer.DefaultArtifactDeployer.deploy(DefaultArtifactDeployer.java:175)
	at hudson.maven.reporters.MavenArtifactRecord.deploy(MavenArtifactRecord.java:189)
	at hudson.maven.RedeployPublisher.perform(RedeployPublisher.java:158)
	at hudson.tasks.BuildStepMonitor$1.perform(BuildStepMonitor.java:19)
	at hudson.model.AbstractBuild$AbstractRunner.perform(AbstractBuild.java:693)
	at hudson.model.AbstractBuild$AbstractRunner.performAllBuildSteps(AbstractBuild.java:668)
	at hudson.maven.MavenModuleSetBuild$RunnerImpl.post2(MavenModuleSetBuild.java:953)
	at hudson.model.AbstractBuild$AbstractRunner.post(AbstractBuild.java:615)
	at hudson.model.Run.run(Run.java:1401)
	at hudson.maven.MavenModuleSetBuild.run(MavenModuleSetBuild.java:474)
	at hudson.model.ResourceController.execute(ResourceController.java:88)
	at hudson.model.Executor.run(Executor.java:230)
Caused by: org.apache.maven.wagon.TransferFailedException: Failed to transfer file: https://repository.apache.org/content/repositories/snapshots/org/apache/karaf/demos/deployer/kar/my-kar/1.0/my-kar-1.0.pom. Return code is: 400
	at org.apache.maven.wagon.shared.http.AbstractHttpClientWagon.put(AbstractHttpClientWagon.java:368)
	at org.apache.maven.wagon.shared.http.AbstractHttpClientWagon.put(AbstractHttpClientWagon.java:280)
	at org.apache.maven.repository.legacy.DefaultWagonManager.putRemoteFile(DefaultWagonManager.java:543)
	at org.apache.maven.repository.legacy.DefaultWagonManager.putArtifact(DefaultWagonManager.java:494)
	at hudson.maven.artifact.deployer.DefaultArtifactDeployer.deploy(DefaultArtifactDeployer.java:160)
	... 11 more
[INFO] Deployment failed after 21 sec
Build step 'Deploy artifacts to Maven repository' changed build result to FAILURE


Build failed in Jenkins: Karaf-2.2.x #307

Posted by Apache Jenkins Server <je...@builds.apache.org>.
See <https://builds.apache.org/job/Karaf-2.2.x/307/changes>

Changes:

[jbonofre] [KARAF-965] Add some comment and log in the add-features-to-repo goal

[jbonofre] Remove attic folder

------------------------------------------
[...truncated 36884 lines...]
246383/?
246895/?
247406/?
248019/?
248589/?
249100/?
249612/?
250124/?
250483/?
250507/?
251071/?
251581/?
252149/?
252606/?
253108/?
253619/?
254130/?
254694/?
255205/?
255718/?
256262/?
256812/?
257366/?
258030/?
258643/?
259130/?
259154/?
259665/?
260176/?
260687/?
261303/?
261813/?
262324/?
262692/?
263459/?
263976/?
264487/?
264998/?
265509/?
266131/?
266641/?
267153/?
267663/?
268229/?
268740/?
269251/?
269942/?
271590/?
272926/?
274807/?
276540/?
278960/?
[ maven embedder INFO] [bundle:bundle]
[ maven embedder WARNING] Warning building bundle org.apache.karaf.archetypes:archetypes-command:bundle:2.2.5-SNAPSHOT : Did not find matching referal for !archetypes-command*
Tests run: 1, Failures: 0, Errors: 0, Skipped: 0, Time elapsed: 32.58 sec

Results :

Tests run: 1, Failures: 0, Errors: 0, Skipped: 0

[JENKINS] Recording test results
[INFO] [jar:jar {execution: default-jar}]
[INFO] Building jar: <https://builds.apache.org/job/Karaf-2.2.x/ws/karaf/archetypes/itests/target/archetypes-itests-2.2.5-SNAPSHOT.jar>
[INFO] [install:install {execution: default-install}]
[INFO] Installing <https://builds.apache.org/job/Karaf-2.2.x/ws/karaf/archetypes/itests/target/archetypes-itests-2.2.5-SNAPSHOT.jar> to <https://builds.apache.org/job/Karaf-2.2.x/ws/.repository/org/apache/karaf/archetypes/archetypes-itests/2.2.5-SNAPSHOT/archetypes-itests-2.2.5-SNAPSHOT.jar>
[JENKINS] Archiving <https://builds.apache.org/job/Karaf-2.2.x/ws/karaf/archetypes/itests/pom.xml> to /home/hudson/hudson/jobs/Karaf-2.2.x/modules/org.apache.karaf.archetypes$archetypes-itests/builds/2011-12-12_08-01-33/archive/org.apache.karaf.archetypes/archetypes-itests/2.2.5-SNAPSHOT/archetypes-itests-2.2.5-SNAPSHOT.pom
[JENKINS] Archiving <https://builds.apache.org/job/Karaf-2.2.x/ws/karaf/archetypes/itests/target/archetypes-itests-2.2.5-SNAPSHOT.jar> to /home/hudson/hudson/jobs/Karaf-2.2.x/modules/org.apache.karaf.archetypes$archetypes-itests/builds/2011-12-12_08-01-33/archive/org.apache.karaf.archetypes/archetypes-itests/2.2.5-SNAPSHOT/archetypes-itests-2.2.5-SNAPSHOT.jar
[INFO] 
[INFO] 
[INFO] ------------------------------------------------------------------------
[INFO] Reactor Summary:
[INFO] ------------------------------------------------------------------------
[INFO] Apache Karaf .......................................... SUCCESS [1:28.886s]
[INFO] Apache Karaf :: Util .................................. SUCCESS [51.354s]
[INFO] Apache Karaf :: Main .................................. SUCCESS [29.063s]
[INFO] Apache Karaf :: JAAS .................................. SUCCESS [0.225s]
[INFO] Apache Karaf :: JAAS :: Boot .......................... SUCCESS [2.347s]
[INFO] Apache Karaf :: JAAS :: Config ........................ SUCCESS [16.667s]
[INFO] Apache Karaf :: JAAS :: Modules ....................... SUCCESS [4.204s]
[INFO] Apache Karaf :: Shell ................................. SUCCESS [0.173s]
[INFO] Apache Karaf :: Shell :: Console ...................... SUCCESS [11.084s]
[INFO] Apache Karaf :: Shell :: OBR Commands ................. SUCCESS [4.794s]
[INFO] Apache Karaf :: Features .............................. SUCCESS [0.187s]
[INFO] Apache Karaf :: Features :: Core ...................... SUCCESS [10.393s]
[INFO] Apache Karaf :: Features :: Command ................... SUCCESS [3.613s]
[INFO] Apache Karaf :: Management ............................ SUCCESS [0.172s]
[INFO] Apache Karaf :: Management ............................ SUCCESS [3.690s]
[INFO] Apache Karaf :: Features :: Management ................ SUCCESS [3.880s]
[INFO] Apache Karaf :: Features :: OBR Resolver .............. SUCCESS [1.853s]
[INFO] Apache Karaf :: Admin ................................. SUCCESS [0.198s]
[INFO] Apache Karaf :: Admin :: Core ......................... SUCCESS [4.529s]
[INFO] Apache Karaf :: Admin :: Command ...................... SUCCESS [9.606s]
[INFO] Apache Karaf :: Admin :: Management ................... SUCCESS [1.921s]
[INFO] Apache Karaf :: Deployer .............................. SUCCESS [0.193s]
[INFO] Apache Karaf :: Deployer :: Spring .................... SUCCESS [3.165s]
[INFO] Apache Karaf :: Deployer :: Blueprint ................. SUCCESS [1.861s]
[INFO] Apache Karaf :: Deployer :: Features .................. SUCCESS [1.177s]
[INFO] Apache Karaf :: Deployer :: Karaf Archive (.kar) ...... SUCCESS [2.070s]
[INFO] Apache Karaf :: Deployer :: Wrap Non OSGi Jar ......... SUCCESS [0.982s]
[INFO] Apache Karaf :: Shell :: Various Commands ............. SUCCESS [3.298s]
[INFO] Apache Karaf :: Shell :: ConfigAdmin Commands ......... SUCCESS [1.905s]
[INFO] Apache Karaf :: Shell :: Log Commands ................. SUCCESS [5.830s]
[INFO] Apache Karaf :: Shell :: OSGi Commands ................ SUCCESS [10.310s]
[INFO] Apache Karaf :: Shell :: PackageAdmin Commands ........ SUCCESS [1.016s]
[INFO] Apache Karaf :: Shell :: SSH .......................... SUCCESS [4.376s]
[INFO] Apache Karaf :: Shell :: Service Wrapper .............. SUCCESS [3.888s]
[INFO] Apache Karaf :: Shell :: Development Commands ......... SUCCESS [5.270s]
[INFO] Apache Karaf :: Shell :: Web Commands ................. SUCCESS [2.540s]
[INFO] Apache Karaf :: JAAS :: Jasypt Encryption ............. SUCCESS [15.633s]
[INFO] Apache Karaf :: Jaas :: Command ....................... SUCCESS [1.123s]
[INFO] Apache Karaf :: Client ................................ SUCCESS [13.136s]
[INFO] Apache Karaf :: Management :: MBeans .................. SUCCESS [0.155s]
[INFO] Apache Karaf :: Management :: MBeans :: Bundles ....... SUCCESS [1.021s]
[INFO] Apache Karaf :: Management :: MBeans :: Services ...... SUCCESS [0.896s]
[INFO] Apache Karaf :: Management :: MBeans :: System ........ SUCCESS [0.831s]
[INFO] Apache Karaf :: Management :: MBeans :: Packages ...... SUCCESS [0.916s]
[INFO] Apache Karaf :: Management :: MBeans :: Config ........ SUCCESS [1.004s]
[INFO] Apache Karaf :: Management :: MBeans :: Dev ........... SUCCESS [0.949s]
[INFO] Apache Karaf :: Management :: MBeans :: Log ........... SUCCESS [0.991s]
[INFO] Apache Karaf :: Management :: MBeans :: OBR ........... SUCCESS [0.894s]
[INFO] Apache Karaf :: Management :: MBeans :: Web ........... SUCCESS [0.900s]
[INFO] Apache Karaf :: Web Console ........................... SUCCESS [0.181s]
[INFO] Apache Karaf :: Web Console :: Console ................ SUCCESS [8.288s]
[INFO] Apache Karaf :: Web Console :: Branding ............... SUCCESS [4.480s]
[INFO] Apache Karaf :: Web Console :: Features Plugin ........ SUCCESS [2.232s]
[INFO] Apache Karaf :: Web Console :: Gogo Plugin ............ SUCCESS [1.447s]
[INFO] Apache Karaf :: Web Console :: Admin Plugin ........... SUCCESS [3.485s]
[INFO] Apache Karaf :: Exception ............................. SUCCESS [1.032s]
[INFO] Apache Karaf :: Assemblies ............................ SUCCESS [0.218s]
[INFO] Apache Karaf :: Assemblies :: Features ................ SUCCESS [0.180s]
[INFO] Apache Karaf :: Assemblies :: Features :: Standard .... SUCCESS [4.490s]
[INFO] Apache Karaf :: Assemblies :: Features :: Enterprise .. SUCCESS [5.261s]
[INFO] Apache Karaf :: Diagnostic ............................ SUCCESS [0.148s]
[INFO] Apache Karaf :: Diagnostic :: Core .................... SUCCESS [0.961s]
[INFO] Apache Karaf :: Diagnostic :: Common .................. SUCCESS [2.951s]
[INFO] Apache Karaf :: Diagnostic :: Command ................. SUCCESS [1.011s]
[INFO] Apache Karaf :: Diagnostic :: Management .............. SUCCESS [2.187s]
[INFO] Apache Karaf :: Tooling ............................... SUCCESS [0.205s]
[INFO] Apache Karaf :: Tooling :: Maven2 Features plugin ..... SUCCESS [46.988s]
[INFO] Apache Karaf :: Assembly .............................. SUCCESS [3:50.667s]
[INFO] Apache Karaf :: Demos ................................. SUCCESS [0.149s]
[INFO] Apache Karaf :: Demos :: Web .......................... SUCCESS [12.166s]
[INFO] Apache Karaf :: Demos :: Branding ..................... SUCCESS [0.159s]
[INFO] Apache Karaf :: Demos :: Branding :: Shell ............ SUCCESS [0.560s]
[INFO] Apache Karaf :: Demos :: Demo Dump provider ........... SUCCESS [0.836s]
[INFO] Apache Karaf :: Demos :: Extend Console Command ....... SUCCESS [2.541s]
[INFO] Apache Karaf :: Demos :: Deployer :: Kar .............. SUCCESS [49.846s]
[INFO] Apache Karaf :: Demos :: Deployer ..................... SUCCESS [0.158s]
[INFO] Apache Karaf :: Integration Tests ..................... SUCCESS [0.152s]
[INFO] Apache Karaf :: Integration Tests :: Dependencies ..... SUCCESS [10.218s]
[INFO] Apache Karaf :: Tooling :: Testing environment ........ SUCCESS [9.683s]
[INFO] Apache Karaf :: Integration Tests :: ITests ........... SUCCESS [1:16.296s]
[INFO] Apache Karaf :: Integration Tests :: Kit Tests ........ SUCCESS [9.006s]
[INFO] Apache Karaf :: Tooling :: Maven2 Command Help plugin . SUCCESS [4.227s]
[INFO] Apache Karaf :: Archetypes ............................ SUCCESS [0.155s]
[INFO] Apache Karaf :: Command Archetype ..................... SUCCESS [19.329s]
[INFO] Apache Karaf :: Archetypes :: ITests .................. SUCCESS [51.218s]
[INFO] ------------------------------------------------------------------------
[INFO] ------------------------------------------------------------------------
[INFO] BUILD SUCCESSFUL
[INFO] ------------------------------------------------------------------------
[INFO] Total time: 21 minutes 22 seconds
[INFO] Finished at: Mon Dec 12 08:23:21 UTC 2011
[INFO] Final Memory: 286M/986M
[INFO] ------------------------------------------------------------------------
channel stopped
Maven RedeployPublished use remote ubuntu1 maven settings from : /home/jenkins/.m2/settings.xml
[INFO] Deployment in https://repository.apache.org/content/repositories/snapshots (id=apache.snapshots.https,uniqueVersion=false)
Deploying the main artifact apache-karaf-2.2.5-SNAPSHOT.pom
Deploying the main artifact apache-karaf-2.2.5-SNAPSHOT-jettyconfig.xml
Deploying the main artifact apache-karaf-2.2.5-SNAPSHOT-minimal.tar.gz
Deploying the main artifact apache-karaf-2.2.5-SNAPSHOT.tar.gz
Deploying the main artifact apache-karaf-2.2.5-SNAPSHOT-minimal.zip
Deploying the main artifact apache-karaf-2.2.5-SNAPSHOT.zip
Deploying the main artifact apache-karaf-2.2.5-SNAPSHOT-src.tar.gz
Deploying the main artifact apache-karaf-2.2.5-SNAPSHOT-src.zip
[INFO] Deployment in https://repository.apache.org/content/repositories/snapshots (id=apache.snapshots.https,uniqueVersion=false)
Deploying the main artifact archetypes-2.2.5-SNAPSHOT.pom
[INFO] Deployment in https://repository.apache.org/content/repositories/snapshots (id=apache.snapshots.https,uniqueVersion=false)
Deploying the main artifact karaf-2.2.5-SNAPSHOT.pom
[INFO] Deployment in https://repository.apache.org/content/repositories/snapshots (id=apache.snapshots.https,uniqueVersion=false)
Deploying the main artifact org.apache.karaf.client-2.2.5-SNAPSHOT.jar
[INFO] Deployment in https://repository.apache.org/content/repositories/snapshots (id=apache.snapshots.https,uniqueVersion=false)
Deploying the main artifact org.apache.karaf.exception-2.2.5-SNAPSHOT.jar
[INFO] Deployment in https://repository.apache.org/content/repositories/snapshots (id=apache.snapshots.https,uniqueVersion=false)
Deploying the main artifact org.apache.karaf.main-2.2.5-SNAPSHOT.jar
[INFO] Deployment in https://repository.apache.org/content/repositories/snapshots (id=apache.snapshots.https,uniqueVersion=false)
Deploying the main artifact org.apache.karaf.util-2.2.5-SNAPSHOT.jar
[INFO] Deployment in https://repository.apache.org/content/repositories/snapshots (id=apache.snapshots.https,uniqueVersion=false)
Deploying the main artifact admin-2.2.5-SNAPSHOT.pom
[INFO] Deployment in https://repository.apache.org/content/repositories/snapshots (id=apache.snapshots.https,uniqueVersion=false)
Deploying the main artifact org.apache.karaf.admin.command-2.2.5-SNAPSHOT.jar
[INFO] Deployment in https://repository.apache.org/content/repositories/snapshots (id=apache.snapshots.https,uniqueVersion=false)
Deploying the main artifact org.apache.karaf.admin.core-2.2.5-SNAPSHOT.jar
[INFO] Deployment in https://repository.apache.org/content/repositories/snapshots (id=apache.snapshots.https,uniqueVersion=false)
Deploying the main artifact org.apache.karaf.admin.management-2.2.5-SNAPSHOT.jar
[INFO] Deployment in https://repository.apache.org/content/repositories/snapshots (id=apache.snapshots.https,uniqueVersion=false)
Deploying the main artifact archetypes-command-2.2.5-SNAPSHOT.jar
[INFO] Deployment in https://repository.apache.org/content/repositories/snapshots (id=apache.snapshots.https,uniqueVersion=false)
Deploying the main artifact archetypes-itests-2.2.5-SNAPSHOT.jar
[INFO] Deployment in https://repository.apache.org/content/repositories/snapshots (id=apache.snapshots.https,uniqueVersion=false)
Deploying the main artifact assemblies-2.2.5-SNAPSHOT.pom
[INFO] Deployment in https://repository.apache.org/content/repositories/snapshots (id=apache.snapshots.https,uniqueVersion=false)
Deploying the main artifact enterprise-2.2.5-SNAPSHOT.jar
Deploying the main artifact enterprise-2.2.5-SNAPSHOT-features.xml
[INFO] Deployment in https://repository.apache.org/content/repositories/snapshots (id=apache.snapshots.https,uniqueVersion=false)
Deploying the main artifact features-2.2.5-SNAPSHOT.pom
[INFO] Deployment in https://repository.apache.org/content/repositories/snapshots (id=apache.snapshots.https,uniqueVersion=false)
Deploying the main artifact standard-2.2.5-SNAPSHOT.jar
Deploying the main artifact standard-2.2.5-SNAPSHOT-features.xml
[INFO] Deployment in https://repository.apache.org/content/repositories/snapshots (id=apache.snapshots.https,uniqueVersion=false)
Deploying the main artifact demos-2.2.5-SNAPSHOT.pom
[INFO] Deployment in https://repository.apache.org/content/repositories/snapshots (id=apache.snapshots.https,uniqueVersion=false)
Deploying the main artifact dump-2.2.5-SNAPSHOT.jar
[INFO] Deployment in https://repository.apache.org/content/repositories/snapshots (id=apache.snapshots.https,uniqueVersion=false)
Deploying the main artifact org.apache.karaf.demos.branding-2.2.5-SNAPSHOT.pom
[INFO] Deployment in https://repository.apache.org/content/repositories/snapshots (id=apache.snapshots.https,uniqueVersion=false)
Deploying the main artifact org.apache.karaf.demos.branding.shell-2.2.5-SNAPSHOT.jar
[INFO] Deployment in https://repository.apache.org/content/repositories/snapshots (id=apache.snapshots.https,uniqueVersion=false)
Deploying the main artifact org.apache.karaf.demos.command-2.2.5-SNAPSHOT.jar
[INFO] Deployment in https://repository.apache.org/content/repositories/snapshots (id=apache.snapshots.https,uniqueVersion=false)
Deploying the main artifact org.apache.karaf.demos.deployer-2.2.5-SNAPSHOT.pom
[INFO] Deployment in https://repository.apache.org/content/repositories/snapshots (id=apache.snapshots.https,uniqueVersion=false)
Deploying the main artifact web-2.2.5-SNAPSHOT.war
[INFO] Deployment in https://repository.apache.org/content/repositories/snapshots (id=apache.snapshots.https,uniqueVersion=false)
Deploying the main artifact my-kar-1.0.pom
ERROR: Error deploying artifact: Failed to transfer file: https://repository.apache.org/content/repositories/snapshots/org/apache/karaf/demos/deployer/kar/my-kar/1.0/my-kar-1.0.pom. Return code is: 400
org.apache.maven.artifact.deployer.ArtifactDeploymentException: Error deploying artifact: Failed to transfer file: https://repository.apache.org/content/repositories/snapshots/org/apache/karaf/demos/deployer/kar/my-kar/1.0/my-kar-1.0.pom. Return code is: 400
	at hudson.maven.artifact.deployer.DefaultArtifactDeployer.deploy(DefaultArtifactDeployer.java:175)
	at hudson.maven.reporters.MavenArtifactRecord.deploy(MavenArtifactRecord.java:189)
	at hudson.maven.RedeployPublisher.perform(RedeployPublisher.java:158)
	at hudson.tasks.BuildStepMonitor$1.perform(BuildStepMonitor.java:19)
	at hudson.model.AbstractBuild$AbstractRunner.perform(AbstractBuild.java:693)
	at hudson.model.AbstractBuild$AbstractRunner.performAllBuildSteps(AbstractBuild.java:668)
	at hudson.maven.MavenModuleSetBuild$RunnerImpl.post2(MavenModuleSetBuild.java:953)
	at hudson.model.AbstractBuild$AbstractRunner.post(AbstractBuild.java:615)
	at hudson.model.Run.run(Run.java:1401)
	at hudson.maven.MavenModuleSetBuild.run(MavenModuleSetBuild.java:474)
	at hudson.model.ResourceController.execute(ResourceController.java:88)
	at hudson.model.Executor.run(Executor.java:230)
Caused by: org.apache.maven.wagon.TransferFailedException: Failed to transfer file: https://repository.apache.org/content/repositories/snapshots/org/apache/karaf/demos/deployer/kar/my-kar/1.0/my-kar-1.0.pom. Return code is: 400
	at org.apache.maven.wagon.shared.http.AbstractHttpClientWagon.put(AbstractHttpClientWagon.java:368)
	at org.apache.maven.wagon.shared.http.AbstractHttpClientWagon.put(AbstractHttpClientWagon.java:280)
	at org.apache.maven.repository.legacy.DefaultWagonManager.putRemoteFile(DefaultWagonManager.java:543)
	at org.apache.maven.repository.legacy.DefaultWagonManager.putArtifact(DefaultWagonManager.java:494)
	at hudson.maven.artifact.deployer.DefaultArtifactDeployer.deploy(DefaultArtifactDeployer.java:160)
	... 11 more
[INFO] Deployment failed after 44 sec
Build step 'Deploy artifacts to Maven repository' changed build result to FAILURE