You are viewing a plain text version of this content. The canonical link for it is here.
Posted to notifications@maven.apache.org by Apache Jenkins Server <je...@builds.apache.org> on 2018/12/29 16:26:32 UTC

Build failed in Jenkins: Maven TLP » maven-deploy-plugin » master #36

See https://builds.apache.org/job/maven-box/job/maven-deploy-plugin/job/master/36/

Changes:

* Removed exclusion for problematic node cause the node is back online.
* reduce the history archiving
* reduce the history archiving
* increase a bit archiving
* increase a bit archiving
* Activate sonarqube on first project
* Disable sonar:sonar for now
* use publisherStrategy: 'EXPLICIT' to avoid non used publishers
* [INFRA-17514] Fix file separator + add other locations for workspaces
* fix indent

All tests passed

Build log:
[...truncated 3.19 MB...]
[windows-jdk11-m3.5.x_build] [INFO] Downloading from central: https://repo.maven.apache.org/maven2/commons-beanutils/commons-beanutils/1.9.2/commons-beanutils-1.9.2.pom
[windows-jdk11-m3.5.x_build] [INFO] Downloaded from central: https://repo.maven.apache.org/maven2/commons-beanutils/commons-beanutils/1.9.2/commons-beanutils-1.9.2.pom (14 kB at 795 kB/s)
[windows-jdk11-m3.5.x_build] [INFO] Downloading from central: https://repo.maven.apache.org/maven2/org/apache/commons/commons-parent/33/commons-parent-33.pom
[windows-jdk11-m3.5.x_build] [INFO] Downloaded from central: https://repo.maven.apache.org/maven2/org/apache/commons/commons-parent/33/commons-parent-33.pom (53 kB at 2.4 MB/s)
[windows-jdk11-m3.5.x_build] [INFO] Downloading from central: https://repo.maven.apache.org/maven2/commons-cli/commons-cli/1.3.1/commons-cli-1.3.1.pom
[windows-jdk11-m3.5.x_build] [INFO] Downloaded from central: https://repo.maven.apache.org/maven2/commons-cli/commons-cli/1.3.1/commons-cli-1.3.1.pom (10 kB at 693 kB/s)
[windows-jdk11-m3.5.x_build] [INFO] Downloading from central: https://repo.maven.apache.org/maven2/com/google/guava/guava/19.0/guava-19.0.pom
[windows-jdk11-m3.5.x_build] [INFO] Downloaded from central: https://repo.maven.apache.org/maven2/com/google/guava/guava/19.0/guava-19.0.pom (6.8 kB at 424 kB/s)
[windows-jdk11-m3.5.x_build] [INFO] Downloading from central: https://repo.maven.apache.org/maven2/com/google/guava/guava-parent/19.0/guava-parent-19.0.pom
[windows-jdk11-m3.5.x_build] [INFO] Downloaded from central: https://repo.maven.apache.org/maven2/com/google/guava/guava-parent/19.0/guava-parent-19.0.pom (9.9 kB at 658 kB/s)
[windows-jdk11-m3.5.x_build] [INFO] Downloading from central: https://repo.maven.apache.org/maven2/org/sonatype/oss/oss-parent/7/oss-parent-7.pom
[windows-jdk11-m3.5.x_build] [INFO] Downloaded from central: https://repo.maven.apache.org/maven2/org/sonatype/oss/oss-parent/7/oss-parent-7.pom (4.8 kB at 302 kB/s)
[windows-jdk11-m3.5.x_build] [INFO] Downloading from central: https://repo.maven.apache.org/maven2/javax/xml/bind/jaxb-api/2.3.0/jaxb-api-2.3.0.pom
[windows-jdk11-m3.5.x_build] [INFO] Downloaded from central: https://repo.maven.apache.org/maven2/javax/xml/bind/jaxb-api/2.3.0/jaxb-api-2.3.0.pom (23 kB at 1.4 MB/s)
[windows-jdk11-m3.5.x_build] [INFO] Downloading from central: https://repo.maven.apache.org/maven2/javax/xml/bind/jaxb-api-parent/2.3.0/jaxb-api-parent-2.3.0.pom
[windows-jdk11-m3.5.x_build] [INFO] Downloaded from central: https://repo.maven.apache.org/maven2/javax/xml/bind/jaxb-api-parent/2.3.0/jaxb-api-parent-2.3.0.pom (5.6 kB at 376 kB/s)
[windows-jdk11-m3.5.x_build] [INFO] Downloading from central: https://repo.maven.apache.org/maven2/net/java/jvnet-parent/5/jvnet-parent-5.pom
[windows-jdk11-m3.5.x_build] [INFO] Downloaded from central: https://repo.maven.apache.org/maven2/net/java/jvnet-parent/5/jvnet-parent-5.pom (8.9 kB at 554 kB/s)
[windows-jdk11-m3.5.x_build] [INFO] Downloading from central: https://repo.maven.apache.org/maven2/org/apache/maven/shared/maven-shared-resources/2/maven-shared-resources-2.jar
[windows-jdk11-m3.5.x_build] [INFO] Downloading from central: https://repo.maven.apache.org/maven2/org/apache/maven/doxia/doxia-core/1.2/doxia-core-1.2.jar
[windows-jdk11-m3.5.x_build] [INFO] Downloading from central: https://repo.maven.apache.org/maven2/org/apache/maven/doxia/doxia-integration-tools/1.6/doxia-integration-tools-1.6.jar
[windows-jdk11-m3.5.x_build] [INFO] Downloading from central: https://repo.maven.apache.org/maven2/commons-digester/commons-digester/1.6/commons-digester-1.6.jar
[windows-jdk11-m3.5.x_build] [INFO] Downloading from central: https://repo.maven.apache.org/maven2/commons-logging/commons-logging/1.0.4/commons-logging-1.0.4.jar
[windows-jdk11-m3.5.x_build] [INFO] Downloaded from central: https://repo.maven.apache.org/maven2/org/apache/maven/doxia/doxia-core/1.2/doxia-core-1.2.jar (154 kB at 5.1 MB/s)
[windows-jdk11-m3.5.x_build] [INFO] Downloading from central: https://repo.maven.apache.org/maven2/commons-io/commons-io/1.4/commons-io-1.4.jar
[windows-jdk11-m3.5.x_build] [INFO] Downloaded from central: https://repo.maven.apache.org/maven2/commons-logging/commons-logging/1.0.4/commons-logging-1.0.4.jar (38 kB at 864 kB/s)
[windows-jdk11-m3.5.x_build] [INFO] Downloading from central: https://repo.maven.apache.org/maven2/org/codehaus/plexus/plexus-resources/1.1.0/plexus-resources-1.1.0.jar
[windows-jdk11-m3.5.x_build] [INFO] Downloaded from central: https://repo.maven.apache.org/maven2/commons-digester/commons-digester/1.6/commons-digester-1.6.jar (168 kB at 3.6 MB/s)
[windows-jdk11-m3.5.x_build] [INFO] Downloading from central: https://repo.maven.apache.org/maven2/com/puppycrawl/tools/checkstyle/6.18/checkstyle-6.18.jar
[windows-jdk11-m3.5.x_build] [INFO] Downloaded from central: https://repo.maven.apache.org/maven2/commons-io/commons-io/1.4/commons-io-1.4.jar (109 kB at 2.1 MB/s)
[windows-jdk11-m3.5.x_build] [INFO] Downloading from central: https://repo.maven.apache.org/maven2/antlr/antlr/2.7.7/antlr-2.7.7.jar
[windows-jdk11-m3.5.x_build] [INFO] Downloaded from central: https://repo.maven.apache.org/maven2/org/apache/maven/shared/maven-shared-resources/2/maven-shared-resources-2.jar (13 kB at 167 kB/s)
[windows-jdk11-m3.5.x_build] [INFO] Downloading from central: https://repo.maven.apache.org/maven2/org/antlr/antlr4-runtime/4.5.3/antlr4-runtime-4.5.3.jar
[windows-jdk11-m3.5.x_build] [INFO] Downloaded from central: https://repo.maven.apache.org/maven2/antlr/antlr/2.7.7/antlr-2.7.7.jar (445 kB at 4.8 MB/s)
[windows-jdk11-m3.5.x_build] [INFO] Downloading from central: https://repo.maven.apache.org/maven2/commons-beanutils/commons-beanutils/1.9.2/commons-beanutils-1.9.2.jar
[windows-jdk11-m3.5.x_build] [INFO] Downloaded from central: https://repo.maven.apache.org/maven2/com/puppycrawl/tools/checkstyle/6.18/checkstyle-6.18.jar (1.2 MB at 12 MB/s)
[windows-jdk11-m3.5.x_build] [INFO] Downloading from central: https://repo.maven.apache.org/maven2/commons-cli/commons-cli/1.3.1/commons-cli-1.3.1.jar
[windows-jdk11-m3.5.x_build] [INFO] Downloaded from central: https://repo.maven.apache.org/maven2/org/antlr/antlr4-runtime/4.5.3/antlr4-runtime-4.5.3.jar (302 kB at 2.9 MB/s)
[windows-jdk11-m3.5.x_build] [INFO] Downloading from central: https://repo.maven.apache.org/maven2/com/google/guava/guava/19.0/guava-19.0.jar
[windows-jdk11-m3.5.x_build] [INFO] Downloaded from central: https://repo.maven.apache.org/maven2/commons-beanutils/commons-beanutils/1.9.2/commons-beanutils-1.9.2.jar (234 kB at 1.8 MB/s)
[windows-jdk11-m3.5.x_build] [INFO] Downloading from central: https://repo.maven.apache.org/maven2/commons-lang/commons-lang/2.1/commons-lang-2.1.jar
[windows-jdk11-m3.5.x_build] [INFO] Downloaded from central: https://repo.maven.apache.org/maven2/commons-cli/commons-cli/1.3.1/commons-cli-1.3.1.jar (53 kB at 373 kB/s)
[windows-jdk11-m3.5.x_build] [INFO] Downloading from central: https://repo.maven.apache.org/maven2/javax/xml/bind/jaxb-api/2.3.0/jaxb-api-2.3.0.jar
[windows-jdk11-m3.5.x_build] [INFO] Downloaded from central: https://repo.maven.apache.org/maven2/commons-lang/commons-lang/2.1/commons-lang-2.1.jar (208 kB at 1.3 MB/s)
[windows-jdk11-m3.5.x_build] [INFO] Downloaded from central: https://repo.maven.apache.org/maven2/javax/xml/bind/jaxb-api/2.3.0/jaxb-api-2.3.0.jar (126 kB at 776 kB/s)
[windows-jdk11-m3.5.x_build] [INFO] Downloaded from central: https://repo.maven.apache.org/maven2/com/google/guava/guava/19.0/guava-19.0.jar (2.3 MB at 14 MB/s)
[windows-jdk11-m3.5.x_build] [INFO] Downloaded from central: https://repo.maven.apache.org/maven2/org/codehaus/plexus/plexus-resources/1.1.0/plexus-resources-1.1.0.jar (23 kB at 129 kB/s)
[windows-jdk11-m3.5.x_build] [INFO] Downloaded from central: https://repo.maven.apache.org/maven2/org/apache/maven/doxia/doxia-integration-tools/1.6/doxia-integration-tools-1.6.jar (45 kB at 212 kB/s)
[windows-jdk11-m3.5.x_build] [INFO] There is 1 error reported by Checkstyle 6.18 with config/maven_checks.xml ruleset.
[windows-jdk11-m3.5.x_build] [INFO] Ignored 1 error, 0 violation remaining.
[windows-jdk11-m3.5.x_build] [INFO] 
[windows-jdk11-m3.5.x_build] [INFO] --- maven-invoker-plugin:3.1.0:verify (integration-test) @ maven-deploy-plugin ---
[windows-jdk11-m3.5.x_build] [INFO] -------------------------------------------------
[windows-jdk11-m3.5.x_build] [INFO] Build Summary:
[windows-jdk11-m3.5.x_build] [INFO]   Passed: 31, Failed: 0, Errors: 0, Skipped: 0
[windows-jdk11-m3.5.x_build] [INFO] -------------------------------------------------
[windows-jdk11-m3.5.x_build] [INFO] ------------------------------------------------------------------------
[windows-jdk11-m3.5.x_build] [INFO] BUILD SUCCESS
[windows-jdk11-m3.5.x_build] [INFO] ------------------------------------------------------------------------
[windows-jdk11-m3.5.x_build] [INFO] Total time: 02:40 min
[windows-jdk11-m3.5.x_build] [INFO] Finished at: 2018-12-29T16:24:34Z
[windows-jdk11-m3.5.x_build] [INFO] Final Memory: 47M/164M
[windows-jdk11-m3.5.x_build] [INFO] ------------------------------------------------------------------------
[windows-jdk11-m3.5.x_build] [INFO] [jenkins-event-spy] Generated F:\jenkins\jenkins-slave\workspace\_maven-deploy-plugin_master-JYYWFCSTMK7R3RLALPYMGWVZ2B7UDDIH43DEPJ46EVHB4LZTULEA@2@tmp\withMaven09fb01a1\maven-spy-20181229-162154-485861192138514013147.log
[Pipeline] [windows-jdk11-m3.5.x_build] }
[Pipeline] [windows-jdk11-m3.5.x_build] // dir
[windows-jdk8-m3.5.x_build] [INFO] run post-build script verify.groovy
[windows-jdk8-m3.5.x_build] [INFO]           MDEPLOY-178_deployfile-with-embedded-pom\pom.xml . SUCCESS (8.4 s)
[windows-jdk8-m3.5.x_build] [INFO] Building: MDEPLOY-202_deployfile-with-multiple-executions\pom.xml
[windows-jdk8-m3.5.x_build] [INFO] run post-build script verify.groovy
[windows-jdk8-m3.5.x_build] [INFO]           MDEPLOY-202_deployfile-with-multiple-executions\pom.xml SUCCESS (6.5 s)
[windows-jdk8-m3.5.x_build] [INFO] Building: MDEPLOY-212\pom.xml
[windows-jdk8-m3.5.x_build] [INFO] run post-build script verify.bsh
[windows-jdk8-m3.5.x_build] [INFO]           MDEPLOY-212\pom.xml .............................. SUCCESS (12.9 s)
[windows-jdk8-m3.5.x_build] [INFO] Building: MDEPLOY-213\pom.xml
[Pipeline] [windows-jdk11-m3.5.x_build] }
[windows-jdk11-m3.5.x_build] [withMaven] artifactsPublisher - Archive artifact windows-jdk11-m3.5.x_build\pom.xml under org\apache\maven\plugins\maven-deploy-plugin\3.0.0-M2-SNAPSHOT\maven-deploy-plugin-3.0.0-M2-SNAPSHOT.pom
[windows-jdk11-m3.5.x_build] [withMaven] artifactsPublisher - Archive artifact windows-jdk11-m3.5.x_build\target\maven-deploy-plugin-3.0.0-M2-SNAPSHOT.jar under org\apache\maven\plugins\maven-deploy-plugin\3.0.0-M2-SNAPSHOT\maven-deploy-plugin-3.0.0-M2-SNAPSHOT.jar
[windows-jdk11-m3.5.x_build] [withMaven] junitPublisher - Archive test results for Maven artifact org.apache.maven.plugins:maven-deploy-plugin:3.0.0-M2-SNAPSHOT generated by maven-surefire-plugin:test (default-test): windows-jdk11-m3.5.x_build\target\surefire-reports\*.xml
[windows-jdk11-m3.5.x_build] Recording test results
[windows-jdk11-m3.5.x_build] [withMaven] openTasksPublisher - Scan Tasks for Maven artifact org.apache.maven.plugins:maven-deploy-plugin:3.0.0-M2-SNAPSHOT in source directory windows-jdk11-m3.5.x_build\src\main\java
[windows-jdk11-m3.5.x_build] [TASKS] Scanning folder 'f:\jenkins\jenkins-slave\workspace\_maven-deploy-plugin_master-JYYWFCSTMK7R3RLALPYMGWVZ2B7UDDIH43DEPJ46EVHB4LZTULEA@2' for files matching the pattern 'windows-jdk11-m3.5.x_build\src\main\java\**\*' - excludes: null
[windows-jdk11-m3.5.x_build] [TASKS] Found 3 files to scan for tasks
[windows-jdk11-m3.5.x_build] [TASKS] Found 0 open tasks.
[windows-jdk11-m3.5.x_build] Skipping warnings blame since pipelines do not have an SCM link.%n
[windows-jdk11-m3.5.x_build] [TASKS] Computing warning deltas based on reference build #35
[windows-jdk11-m3.5.x_build] [withMaven] invokerPublisher - Archive invoker results for Maven artifact MavenArtifact{org.apache.maven.plugins:maven-deploy-plugin::3.0.0-M2-SNAPSHOT(version: 3.0.0-M2-SNAPSHOT, snapshot:false) } generated by PluginInvocation{org.apache.maven.plugins:maven-invoker-plugin:3.1.0@integration-test  integration-test}: windows-jdk11-m3.5.x_build\target\invoker-reports\*.xml
[Pipeline] [windows-jdk11-m3.5.x_build] // withMaven
[Pipeline] [windows-jdk11-m3.5.x_build] cleanWs
[windows-jdk11-m3.5.x_build] [WS-CLEANUP] Deleting project workspace...Cannot delete workspace :remote file operation failed: f:\jenkins\jenkins-slave\workspace\_maven-deploy-plugin_master-JYYWFCSTMK7R3RLALPYMGWVZ2B7UDDIH43DEPJ46EVHB4LZTULEA@2 at hudson.remoting.Channel@398d98d3:JNLP4-connect connection from ec2-34-228-168-168.compute-1.amazonaws.com/34.228.168.168:51626: java.nio.file.AccessDeniedException: f:\jenkins\jenkins-slave\workspace\_maven-deploy-plugin_master-JYYWFCSTMK7R3RLALPYMGWVZ2B7UDDIH43DEPJ46EVHB4LZTULEA@2 -> f:\jenkins\jenkins-slave\workspace\_maven-deploy-plugin_master-JYYWFCSTMK7R3RLALPYMGWVZ2B7UDDIH43DEPJ46EVHB4LZTULEA@2_ws-cleanup_1546100700707
[Pipeline] [windows-jdk11-m3.5.x_build] }
[Pipeline] [windows-jdk11-m3.5.x_build] // stage
[Pipeline] [windows-jdk11-m3.5.x_build] }
[Pipeline] [windows-jdk11-m3.5.x_build] // ws
[Pipeline] [windows-jdk11-m3.5.x_build] }
[Pipeline] [windows-jdk11-m3.5.x_build] // node
[Pipeline] [windows-jdk11-m3.5.x_build] }
[windows-jdk11-m3.5.x_build] Failed in branch windows-jdk11-m3.5.x_build
[windows-jdk8-m3.5.x_build] [INFO] run post-build script verify.bsh
[windows-jdk8-m3.5.x_build] [INFO]           MDEPLOY-213\pom.xml .............................. SUCCESS (15.4 s)
[windows-jdk8-m3.5.x_build] [INFO] Building: mdeploy-45-test\pom.xml
[windows-jdk8-m3.5.x_build] [INFO] run pre-build script setup.bsh
[windows-jdk8-m3.5.x_build] [INFO] run post-build script verify.bsh
[windows-jdk8-m3.5.x_build] [INFO]           mdeploy-45-test\pom.xml .......................... SUCCESS (8.2 s)
[windows-jdk8-m3.5.x_build] [INFO] Building: no-main-artifact-1\pom.xml
[windows-jdk8-m3.5.x_build] [INFO] run pre-build script setup.bsh
[windows-jdk8-m3.5.x_build] [INFO] run post-build script verify.groovy
[windows-jdk8-m3.5.x_build] [INFO]           no-main-artifact-1\pom.xml ....................... SUCCESS (9.6 s)
[windows-jdk8-m3.5.x_build] [INFO] Building: no-main-artifact-2\pom.xml
[windows-jdk8-m3.5.x_build] [INFO] run pre-build script setup.bsh
[windows-jdk8-m3.5.x_build] [INFO] run post-build script verify.groovy
[windows-jdk8-m3.5.x_build] [INFO]           no-main-artifact-2\pom.xml ....................... SUCCESS (6.1 s)
[windows-jdk8-m3.5.x_build] [INFO] Building: no-main-artifact-snapshot\pom.xml
[windows-jdk8-m3.5.x_build] [INFO] run pre-build script setup.bsh
[windows-jdk8-m3.5.x_build] [INFO] run post-build script verify.bsh
[windows-jdk8-m3.5.x_build] [INFO]           no-main-artifact-snapshot\pom.xml ................ SUCCESS (5.9 s)
[windows-jdk8-m3.5.x_build] [INFO] Building: offline\pom.xml
[windows-jdk8-m3.5.x_build] [INFO] run pre-build script setup.bsh
[windows-jdk8-m3.5.x_build] [INFO]           offline\pom.xml .................................. SUCCESS (12.1 s)
[windows-jdk8-m3.5.x_build] [INFO] Building: release-jar\pom.xml
[windows-jdk8-m3.5.x_build] [INFO] run pre-build script setup.bsh
[windows-jdk8-m3.5.x_build] [INFO] run post-build script verify.bsh
[windows-jdk8-m3.5.x_build] [INFO]           release-jar\pom.xml .............................. SUCCESS (5.3 s)
[windows-jdk8-m3.5.x_build] [INFO] Building: release-pom\pom.xml
[windows-jdk8-m3.5.x_build] [INFO] run pre-build script setup.bsh
[windows-jdk8-m3.5.x_build] [INFO] run post-build script verify.bsh
[windows-jdk8-m3.5.x_build] [INFO]           release-pom\pom.xml .............................. SUCCESS (4.6 s)
[windows-jdk8-m3.5.x_build] [INFO] Building: skip\pom.xml
[windows-jdk8-m3.5.x_build] [INFO] run pre-build script setup.bsh
[windows-jdk8-m3.5.x_build] [INFO]           skip\pom.xml ..................................... SUCCESS (4.4 s)
[windows-jdk8-m3.5.x_build] [INFO] Building: snapshot-jar\pom.xml
[windows-jdk8-m3.5.x_build] [INFO] run pre-build script setup.bsh
[windows-jdk8-m3.5.x_build] [INFO] run post-build script verify.bsh
[windows-jdk8-m3.5.x_build] [INFO]           snapshot-jar\pom.xml ............................. SUCCESS (5.4 s)
[windows-jdk8-m3.5.x_build] [INFO] Building: snapshot-pom\pom.xml
[windows-jdk8-m3.5.x_build] [INFO] run pre-build script setup.bsh
[windows-jdk8-m3.5.x_build] [INFO] run post-build script verify.bsh
[windows-jdk8-m3.5.x_build] [INFO]           snapshot-pom\pom.xml ............................. SUCCESS (4.5 s)
[windows-jdk8-m3.5.x_build] [INFO] 
[windows-jdk8-m3.5.x_build] [INFO] --- maven-checkstyle-plugin:3.0.0:check (checkstyle-check) @ maven-deploy-plugin ---
[windows-jdk8-m3.5.x_build] [INFO] Downloading from central: https://repo.maven.apache.org/maven2/org/apache/maven/shared/maven-shared-resources/2/maven-shared-resources-2.pom
[windows-jdk8-m3.5.x_build] [INFO] Downloaded from central: https://repo.maven.apache.org/maven2/org/apache/maven/shared/maven-shared-resources/2/maven-shared-resources-2.pom (3.0 kB at 123 kB/s)
[windows-jdk8-m3.5.x_build] [INFO] Downloading from central: https://repo.maven.apache.org/maven2/org/codehaus/plexus/plexus-utils/3.0.10/plexus-utils-3.0.10.pom
[windows-jdk8-m3.5.x_build] [INFO] Downloaded from central: https://repo.maven.apache.org/maven2/org/codehaus/plexus/plexus-utils/3.0.10/plexus-utils-3.0.10.pom (3.1 kB at 150 kB/s)
[windows-jdk8-m3.5.x_build] [INFO] Downloading from central: https://repo.maven.apache.org/maven2/org/codehaus/plexus/plexus/3.3/plexus-3.3.pom
[windows-jdk8-m3.5.x_build] [INFO] Downloaded from central: https://repo.maven.apache.org/maven2/org/codehaus/plexus/plexus/3.3/plexus-3.3.pom (20 kB at 905 kB/s)
[windows-jdk8-m3.5.x_build] [INFO] Downloading from central: https://repo.maven.apache.org/maven2/org/apache/maven/doxia/doxia-integration-tools/1.6/doxia-integration-tools-1.6.pom
[windows-jdk8-m3.5.x_build] [INFO] Downloaded from central: https://repo.maven.apache.org/maven2/org/apache/maven/doxia/doxia-integration-tools/1.6/doxia-integration-tools-1.6.pom (7.0 kB at 316 kB/s)
[windows-jdk8-m3.5.x_build] [INFO] Downloading from central: https://repo.maven.apache.org/maven2/org/apache/maven/doxia/doxia-tools/3/doxia-tools-3.pom
[windows-jdk8-m3.5.x_build] [INFO] Downloaded from central: https://repo.maven.apache.org/maven2/org/apache/maven/doxia/doxia-tools/3/doxia-tools-3.pom (9.9 kB at 451 kB/s)
[windows-jdk8-m3.5.x_build] [INFO] Downloading from central: https://repo.maven.apache.org/maven2/org/codehaus/plexus/plexus-resources/1.1.0/plexus-resources-1.1.0.pom
[windows-jdk8-m3.5.x_build] [INFO] Downloaded from central: https://repo.maven.apache.org/maven2/org/codehaus/plexus/plexus-resources/1.1.0/plexus-resources-1.1.0.pom (3.2 kB at 159 kB/s)
[windows-jdk8-m3.5.x_build] [INFO] Downloading from central: https://repo.maven.apache.org/maven2/com/puppycrawl/tools/checkstyle/6.18/checkstyle-6.18.pom
[windows-jdk8-m3.5.x_build] [INFO] Downloaded from central: https://repo.maven.apache.org/maven2/com/puppycrawl/tools/checkstyle/6.18/checkstyle-6.18.pom (71 kB at 2.6 MB/s)
[windows-jdk8-m3.5.x_build] [INFO] Downloading from central: https://repo.maven.apache.org/maven2/antlr/antlr/2.7.7/antlr-2.7.7.pom
[windows-jdk8-m3.5.x_build] [INFO] Downloaded from central: https://repo.maven.apache.org/maven2/antlr/antlr/2.7.7/antlr-2.7.7.pom (632 B at 27 kB/s)
[windows-jdk8-m3.5.x_build] [INFO] Downloading from central: https://repo.maven.apache.org/maven2/org/antlr/antlr4-runtime/4.5.3/antlr4-runtime-4.5.3.pom
[windows-jdk8-m3.5.x_build] [INFO] Downloaded from central: https://repo.maven.apache.org/maven2/org/antlr/antlr4-runtime/4.5.3/antlr4-runtime-4.5.3.pom (2.3 kB at 105 kB/s)
[windows-jdk8-m3.5.x_build] [INFO] Downloading from central: https://repo.maven.apache.org/maven2/org/antlr/antlr4-master/4.5.3/antlr4-master-4.5.3.pom
[windows-jdk8-m3.5.x_build] [INFO] Downloaded from central: https://repo.maven.apache.org/maven2/org/antlr/antlr4-master/4.5.3/antlr4-master-4.5.3.pom (3.7 kB at 153 kB/s)
[windows-jdk8-m3.5.x_build] [INFO] Downloading from central: https://repo.maven.apache.org/maven2/commons-beanutils/commons-beanutils/1.9.2/commons-beanutils-1.9.2.pom
[windows-jdk8-m3.5.x_build] [INFO] Downloaded from central: https://repo.maven.apache.org/maven2/commons-beanutils/commons-beanutils/1.9.2/commons-beanutils-1.9.2.pom (14 kB at 681 kB/s)
[windows-jdk8-m3.5.x_build] [INFO] Downloading from central: https://repo.maven.apache.org/maven2/org/apache/commons/commons-parent/33/commons-parent-33.pom
[windows-jdk8-m3.5.x_build] [INFO] Downloaded from central: https://repo.maven.apache.org/maven2/org/apache/commons/commons-parent/33/commons-parent-33.pom (53 kB at 2.2 MB/s)
[windows-jdk8-m3.5.x_build] [INFO] Downloading from central: https://repo.maven.apache.org/maven2/commons-cli/commons-cli/1.3.1/commons-cli-1.3.1.pom
[windows-jdk8-m3.5.x_build] [INFO] Downloaded from central: https://repo.maven.apache.org/maven2/commons-cli/commons-cli/1.3.1/commons-cli-1.3.1.pom (10 kB at 472 kB/s)
[windows-jdk8-m3.5.x_build] [INFO] Downloading from central: https://repo.maven.apache.org/maven2/com/google/guava/guava/19.0/guava-19.0.pom
[windows-jdk8-m3.5.x_build] [INFO] Downloaded from central: https://repo.maven.apache.org/maven2/com/google/guava/guava/19.0/guava-19.0.pom (6.8 kB at 283 kB/s)
[windows-jdk8-m3.5.x_build] [INFO] Downloading from central: https://repo.maven.apache.org/maven2/com/google/guava/guava-parent/19.0/guava-parent-19.0.pom
[windows-jdk8-m3.5.x_build] [INFO] Downloaded from central: https://repo.maven.apache.org/maven2/com/google/guava/guava-parent/19.0/guava-parent-19.0.pom (9.9 kB at 429 kB/s)
[windows-jdk8-m3.5.x_build] [INFO] Downloading from central: https://repo.maven.apache.org/maven2/org/sonatype/oss/oss-parent/7/oss-parent-7.pom
[windows-jdk8-m3.5.x_build] [INFO] Downloaded from central: https://repo.maven.apache.org/maven2/org/sonatype/oss/oss-parent/7/oss-parent-7.pom (4.8 kB at 219 kB/s)
[windows-jdk8-m3.5.x_build] [INFO] Downloading from central: https://repo.maven.apache.org/maven2/commons-digester/commons-digester/1.6/commons-digester-1.6.jar
[windows-jdk8-m3.5.x_build] [INFO] Downloading from central: https://repo.maven.apache.org/maven2/commons-logging/commons-logging/1.0.4/commons-logging-1.0.4.jar
[windows-jdk8-m3.5.x_build] [INFO] Downloading from central: https://repo.maven.apache.org/maven2/org/apache/maven/shared/maven-shared-resources/2/maven-shared-resources-2.jar
[windows-jdk8-m3.5.x_build] [INFO] Downloading from central: https://repo.maven.apache.org/maven2/org/apache/maven/doxia/doxia-core/1.2/doxia-core-1.2.jar
[windows-jdk8-m3.5.x_build] [INFO] Downloading from central: https://repo.maven.apache.org/maven2/org/apache/maven/doxia/doxia-integration-tools/1.6/doxia-integration-tools-1.6.jar
[windows-jdk8-m3.5.x_build] [INFO] Downloaded from central: https://repo.maven.apache.org/maven2/commons-logging/commons-logging/1.0.4/commons-logging-1.0.4.jar (38 kB at 1.4 MB/s)
[windows-jdk8-m3.5.x_build] [INFO] Downloading from central: https://repo.maven.apache.org/maven2/commons-io/commons-io/1.4/commons-io-1.4.jar
[windows-jdk8-m3.5.x_build] [INFO] Downloaded from central: https://repo.maven.apache.org/maven2/org/apache/maven/doxia/doxia-integration-tools/1.6/doxia-integration-tools-1.6.jar (45 kB at 1.4 MB/s)
[windows-jdk8-m3.5.x_build] [INFO] Downloading from central: https://repo.maven.apache.org/maven2/org/codehaus/plexus/plexus-resources/1.1.0/plexus-resources-1.1.0.jar
[windows-jdk8-m3.5.x_build] [INFO] Downloaded from central: https://repo.maven.apache.org/maven2/org/apache/maven/shared/maven-shared-resources/2/maven-shared-resources-2.jar (13 kB at 396 kB/s)
[windows-jdk8-m3.5.x_build] [INFO] Downloading from central: https://repo.maven.apache.org/maven2/com/puppycrawl/tools/checkstyle/6.18/checkstyle-6.18.jar
[windows-jdk8-m3.5.x_build] [INFO] Downloaded from central: https://repo.maven.apache.org/maven2/commons-digester/commons-digester/1.6/commons-digester-1.6.jar (168 kB at 4.4 MB/s)
[windows-jdk8-m3.5.x_build] [INFO] Downloading from central: https://repo.maven.apache.org/maven2/antlr/antlr/2.7.7/antlr-2.7.7.jar
[windows-jdk8-m3.5.x_build] [INFO] Downloaded from central: https://repo.maven.apache.org/maven2/org/apache/maven/doxia/doxia-core/1.2/doxia-core-1.2.jar (154 kB at 3.9 MB/s)
[windows-jdk8-m3.5.x_build] [INFO] Downloading from central: https://repo.maven.apache.org/maven2/org/antlr/antlr4-runtime/4.5.3/antlr4-runtime-4.5.3.jar
[windows-jdk8-m3.5.x_build] [INFO] Downloaded from central: https://repo.maven.apache.org/maven2/org/codehaus/plexus/plexus-resources/1.1.0/plexus-resources-1.1.0.jar (23 kB at 380 kB/s)
[windows-jdk8-m3.5.x_build] [INFO] Downloading from central: https://repo.maven.apache.org/maven2/commons-beanutils/commons-beanutils/1.9.2/commons-beanutils-1.9.2.jar
[windows-jdk8-m3.5.x_build] [INFO] Downloaded from central: https://repo.maven.apache.org/maven2/commons-io/commons-io/1.4/commons-io-1.4.jar (109 kB at 1.7 MB/s)
[windows-jdk8-m3.5.x_build] [INFO] Downloading from central: https://repo.maven.apache.org/maven2/commons-cli/commons-cli/1.3.1/commons-cli-1.3.1.jar
[windows-jdk8-m3.5.x_build] [INFO] Downloaded from central: https://repo.maven.apache.org/maven2/org/antlr/antlr4-runtime/4.5.3/antlr4-runtime-4.5.3.jar (302 kB at 3.7 MB/s)
[windows-jdk8-m3.5.x_build] [INFO] Downloading from central: https://repo.maven.apache.org/maven2/com/google/guava/guava/19.0/guava-19.0.jar
[windows-jdk8-m3.5.x_build] [INFO] Downloaded from central: https://repo.maven.apache.org/maven2/antlr/antlr/2.7.7/antlr-2.7.7.jar (445 kB at 5.2 MB/s)
[windows-jdk8-m3.5.x_build] [INFO] Downloading from central: https://repo.maven.apache.org/maven2/commons-lang/commons-lang/2.1/commons-lang-2.1.jar
[windows-jdk8-m3.5.x_build] [INFO] Downloaded from central: https://repo.maven.apache.org/maven2/commons-cli/commons-cli/1.3.1/commons-cli-1.3.1.jar (53 kB at 570 kB/s)
[windows-jdk8-m3.5.x_build] [INFO] Downloaded from central: https://repo.maven.apache.org/maven2/commons-beanutils/commons-beanutils/1.9.2/commons-beanutils-1.9.2.jar (234 kB at 2.4 MB/s)
[windows-jdk8-m3.5.x_build] [INFO] Downloaded from central: https://repo.maven.apache.org/maven2/com/puppycrawl/tools/checkstyle/6.18/checkstyle-6.18.jar (1.2 MB at 11 MB/s)
[windows-jdk8-m3.5.x_build] [INFO] Downloaded from central: https://repo.maven.apache.org/maven2/commons-lang/commons-lang/2.1/commons-lang-2.1.jar (208 kB at 1.7 MB/s)
[windows-jdk8-m3.5.x_build] [INFO] Downloaded from central: https://repo.maven.apache.org/maven2/com/google/guava/guava/19.0/guava-19.0.jar (2.3 MB at 10 MB/s)
[windows-jdk8-m3.5.x_build] [INFO] There is 1 error reported by Checkstyle 6.18 with config/maven_checks.xml ruleset.
[windows-jdk8-m3.5.x_build] [INFO] Ignored 1 error, 0 violation remaining.
[windows-jdk8-m3.5.x_build] [INFO] 
[windows-jdk8-m3.5.x_build] [INFO] --- maven-invoker-plugin:3.1.0:verify (integration-test) @ maven-deploy-plugin ---
[windows-jdk8-m3.5.x_build] [INFO] -------------------------------------------------
[windows-jdk8-m3.5.x_build] [INFO] Build Summary:
[windows-jdk8-m3.5.x_build] [INFO]   Passed: 31, Failed: 0, Errors: 0, Skipped: 0
[windows-jdk8-m3.5.x_build] [INFO] -------------------------------------------------
[windows-jdk8-m3.5.x_build] [INFO] ------------------------------------------------------------------------
[windows-jdk8-m3.5.x_build] [INFO] BUILD SUCCESS
[windows-jdk8-m3.5.x_build] [INFO] ------------------------------------------------------------------------
[windows-jdk8-m3.5.x_build] [INFO] Total time: 04:59 min
[windows-jdk8-m3.5.x_build] [INFO] Finished at: 2018-12-29T16:26:21Z
[windows-jdk8-m3.5.x_build] [INFO] Final Memory: 58M/720M
[windows-jdk8-m3.5.x_build] [INFO] ------------------------------------------------------------------------
[windows-jdk8-m3.5.x_build] [INFO] [jenkins-event-spy] Generated F:\jenkins\jenkins-slave\workspace\_maven-deploy-plugin_master-JYYWFCSTMK7R3RLALPYMGWVZ2B7UDDIH43DEPJ46EVHB4LZTULEA@2@tmp\withMavena5a4380e\maven-spy-20181229-162121-7101308918470453999835.log
[windows-jdk8-m3.5.x_build] Picked up JAVA_TOOL_OPTIONS: -Dmaven.ext.class.path="f:\jenkins\jenkins-slave\workspace\_maven-deploy-plugin_master-JYYWFCSTMK7R3RLALPYMGWVZ2B7UDDIH43DEPJ46EVHB4LZTULEA@2@tmp\withMavena5a4380e\pipeline-maven-spy.jar" -Dorg.jenkinsci.plugins.pipeline.maven.reportsFolder="f:\jenkins\jenkins-slave\workspace\_maven-deploy-plugin_master-JYYWFCSTMK7R3RLALPYMGWVZ2B7UDDIH43DEPJ46EVHB4LZTULEA@2@tmp\withMavena5a4380e" 
[Pipeline] [windows-jdk8-m3.5.x_build] }
[Pipeline] [windows-jdk8-m3.5.x_build] // dir
[Pipeline] [windows-jdk8-m3.5.x_build] }
[windows-jdk8-m3.5.x_build] [withMaven] artifactsPublisher - Archive artifact windows-jdk8-m3.5.x_build\pom.xml under org\apache\maven\plugins\maven-deploy-plugin\3.0.0-M2-SNAPSHOT\maven-deploy-plugin-3.0.0-M2-SNAPSHOT.pom
[windows-jdk8-m3.5.x_build] [withMaven] artifactsPublisher - Archive artifact windows-jdk8-m3.5.x_build\target\maven-deploy-plugin-3.0.0-M2-SNAPSHOT.jar under org\apache\maven\plugins\maven-deploy-plugin\3.0.0-M2-SNAPSHOT\maven-deploy-plugin-3.0.0-M2-SNAPSHOT.jar
[windows-jdk8-m3.5.x_build] [withMaven] junitPublisher - Archive test results for Maven artifact org.apache.maven.plugins:maven-deploy-plugin:3.0.0-M2-SNAPSHOT generated by maven-surefire-plugin:test (default-test): windows-jdk8-m3.5.x_build\target\surefire-reports\*.xml
[windows-jdk8-m3.5.x_build] Recording test results
[windows-jdk8-m3.5.x_build] [withMaven] openTasksPublisher - Scan Tasks for Maven artifact org.apache.maven.plugins:maven-deploy-plugin:3.0.0-M2-SNAPSHOT in source directory windows-jdk8-m3.5.x_build\src\main\java
[windows-jdk8-m3.5.x_build] [TASKS] Scanning folder 'f:\jenkins\jenkins-slave\workspace\_maven-deploy-plugin_master-JYYWFCSTMK7R3RLALPYMGWVZ2B7UDDIH43DEPJ46EVHB4LZTULEA@2' for files matching the pattern 'windows-jdk8-m3.5.x_build\src\main\java\**\*' - excludes: null
[windows-jdk8-m3.5.x_build] [TASKS] Found 3 files to scan for tasks
[windows-jdk8-m3.5.x_build] [TASKS] Found 0 open tasks.
[windows-jdk8-m3.5.x_build] Skipping warnings blame since pipelines do not have an SCM link.%n
[windows-jdk8-m3.5.x_build] [TASKS] Computing warning deltas based on reference build #35
[windows-jdk8-m3.5.x_build] [withMaven] invokerPublisher - Archive invoker results for Maven artifact MavenArtifact{org.apache.maven.plugins:maven-deploy-plugin::3.0.0-M2-SNAPSHOT(version: 3.0.0-M2-SNAPSHOT, snapshot:false) } generated by PluginInvocation{org.apache.maven.plugins:maven-invoker-plugin:3.1.0@integration-test  integration-test}: windows-jdk8-m3.5.x_build\target\invoker-reports\*.xml
[Pipeline] [windows-jdk8-m3.5.x_build] // withMaven
[Pipeline] [windows-jdk8-m3.5.x_build] cleanWs
[windows-jdk8-m3.5.x_build] [WS-CLEANUP] Deleting project workspace...Cannot delete workspace :remote file operation failed: f:\jenkins\jenkins-slave\workspace\_maven-deploy-plugin_master-JYYWFCSTMK7R3RLALPYMGWVZ2B7UDDIH43DEPJ46EVHB4LZTULEA@2 at hudson.remoting.Channel@7f96cc69:JNLP4-connect connection from 37.48.69.226/37.48.69.226:63010: java.nio.file.AccessDeniedException: f:\jenkins\jenkins-slave\workspace\_maven-deploy-plugin_master-JYYWFCSTMK7R3RLALPYMGWVZ2B7UDDIH43DEPJ46EVHB4LZTULEA@2 -> f:\jenkins\jenkins-slave\workspace\_maven-deploy-plugin_master-JYYWFCSTMK7R3RLALPYMGWVZ2B7UDDIH43DEPJ46EVHB4LZTULEA@2_ws-cleanup_1546100792177
[Pipeline] [windows-jdk8-m3.5.x_build] }
[Pipeline] [windows-jdk8-m3.5.x_build] // stage
[Pipeline] [windows-jdk8-m3.5.x_build] }
[Pipeline] [windows-jdk8-m3.5.x_build] // ws
[Pipeline] [windows-jdk8-m3.5.x_build] }
[Pipeline] [windows-jdk8-m3.5.x_build] // node
[Pipeline] [windows-jdk8-m3.5.x_build] }
[windows-jdk8-m3.5.x_build] Failed in branch windows-jdk8-m3.5.x_build
[Pipeline] // parallel
[Pipeline] stage
[Pipeline] { (Notifications)
[Pipeline] echo
Build result: FAILURE
[Pipeline] jiraIssueSelector
[Pipeline] emailext

Build succeeded in Jenkins: Maven TLP » maven-deploy-plugin » master #38

Posted by Apache Jenkins Server <je...@builds.apache.org>.
See https://builds.apache.org/job/maven-box/job/maven-deploy-plugin/job/master/38/

Changes:

* Disable cleanWs() due to issues with file handles on Windows
* added a link to asf-gitpubsub-jenkins-plugin
* fixed markup (asciidoc, not markdown...)

All tests passed

Build failed in Jenkins: Maven TLP » maven-deploy-plugin » master #37

Posted by Apache Jenkins Server <je...@builds.apache.org>.
See https://builds.apache.org/job/maven-box/job/maven-deploy-plugin/job/master/37/

Changes:

* use a special local repo to have a bit of caching
* add mavenLinkerPublisher

All tests passed

Build log:
[...truncated 3042 lines...]
[INFO] run pre-build script setup.bsh
[INFO] run post-build script verify.groovy
[INFO]           MDEPLOY-178_deployfile-with-embedded-pom\pom.xml . SUCCESS (5.7 s)
[INFO] Building: MDEPLOY-202_deployfile-with-multiple-executions\pom.xml
[INFO] run post-build script verify.bsh
[INFO]           MDEPLOY-212\pom.xml .............................. SUCCESS (11.8 s)
[INFO] Building: MDEPLOY-213\pom.xml
[INFO]           skip\pom.xml ..................................... SUCCESS (5.2 s)
[INFO] Building: snapshot-jar\pom.xml
[INFO] run pre-build script setup.bsh
[INFO] run post-build script verify.groovy
[INFO]           MDEPLOY-202_deployfile-with-multiple-executions\pom.xml SUCCESS (5.3 s)
[INFO] Building: MDEPLOY-212\pom.xml
[INFO] run post-build script verify.bsh
[INFO]           snapshot-jar\pom.xml ............................. SUCCESS (6.4 s)
[INFO] Building: snapshot-pom\pom.xml
[INFO] run pre-build script setup.bsh
[INFO] run post-build script verify.bsh
[INFO]           snapshot-pom\pom.xml ............................. SUCCESS (5.9 s)
[INFO] 
[INFO] --- maven-checkstyle-plugin:3.0.0:check (checkstyle-check) @ maven-deploy-plugin ---
[INFO] run post-build script verify.bsh
[INFO]           MDEPLOY-212\pom.xml .............................. SUCCESS (10.2 s)
[INFO] Building: MDEPLOY-213\pom.xml
[INFO] run post-build script verify.bsh
[INFO]           MDEPLOY-213\pom.xml .............................. SUCCESS (15.6 s)
[INFO] Building: mdeploy-45-test\pom.xml
[INFO] run pre-build script setup.bsh
[INFO] There is 1 error reported by Checkstyle 6.18 with config/maven_checks.xml ruleset.
[INFO] Ignored 1 error, 0 violation remaining.
[INFO] 
[INFO] --- maven-invoker-plugin:3.1.0:verify (integration-test) @ maven-deploy-plugin ---
[INFO] -------------------------------------------------
[INFO] Build Summary:
[INFO]   Passed: 31, Failed: 0, Errors: 0, Skipped: 0
[INFO] -------------------------------------------------
[INFO] ------------------------------------------------------------------------
[INFO] BUILD SUCCESS
[INFO] ------------------------------------------------------------------------
[INFO] Total time: 05:04 min
[INFO] Finished at: 2019-01-02T14:45:04-08:00
[INFO] Final Memory: 50M/747M
[INFO] ------------------------------------------------------------------------
[INFO] [jenkins-event-spy] Generated F:\jenkins\jenkins-slave\workspace\n-box_maven-deploy-plugin_master@2@tmp\withMaven36440030\maven-spy-20190102-143959-6992975105072738216303.log
Picked up JAVA_TOOL_OPTIONS: -Dmaven.ext.class.path="f:\jenkins\jenkins-slave\workspace\n-box_maven-deploy-plugin_master@2@tmp\withMaven36440030\pipeline-maven-spy.jar" -Dorg.jenkinsci.plugins.pipeline.maven.reportsFolder="f:\jenkins\jenkins-slave\workspace\n-box_maven-deploy-plugin_master@2@tmp\withMaven36440030" 
[Pipeline] }
[Pipeline] // dir
[Pipeline] }
[withMaven] artifactsPublisher - Archive artifact windows-jdk7-m3.5.x_build\pom.xml under org\apache\maven\plugins\maven-deploy-plugin\3.0.0-M2-SNAPSHOT\maven-deploy-plugin-3.0.0-M2-SNAPSHOT.pom
[withMaven] artifactsPublisher - Archive artifact windows-jdk7-m3.5.x_build\target\maven-deploy-plugin-3.0.0-M2-SNAPSHOT.jar under org\apache\maven\plugins\maven-deploy-plugin\3.0.0-M2-SNAPSHOT\maven-deploy-plugin-3.0.0-M2-SNAPSHOT.jar
[withMaven] junitPublisher - Archive test results for Maven artifact org.apache.maven.plugins:maven-deploy-plugin:maven-plugin:3.0.0-M2-SNAPSHOT generated by maven-surefire-plugin:test (default-test): windows-jdk7-m3.5.x_build\target\surefire-reports\*.xml
Recording test results
[withMaven] openTasksPublisher - Scan Tasks for Maven artifact org.apache.maven.plugins:maven-deploy-plugin:maven-plugin:3.0.0-M2-SNAPSHOT in source directory windows-jdk7-m3.5.x_build\src\main\java
[TASKS] Scanning folder 'f:\jenkins\jenkins-slave\workspace\n-box_maven-deploy-plugin_master@2' for files matching the pattern 'windows-jdk7-m3.5.x_build\src\main\java\**\*' - excludes: null
[TASKS] Found 3 files to scan for tasks
[TASKS] Found 0 open tasks.
Skipping warnings blame since pipelines do not have an SCM link.%n
[TASKS] Computing warning deltas based on reference build #35
[withMaven] invokerPublisher - Archive invoker results for Maven artifact MavenArtifact{org.apache.maven.plugins:maven-deploy-plugin:maven-plugin:3.0.0-M2-SNAPSHOT(version: 3.0.0-M2-SNAPSHOT, snapshot:false) } generated by PluginInvocation{org.apache.maven.plugins:maven-invoker-plugin:3.1.0@integration-test  integration-test}: windows-jdk7-m3.5.x_build\target\invoker-reports\*.xml
[INFO] run post-build script verify.bsh
[INFO]           mdeploy-45-test\pom.xml .......................... SUCCESS (8.6 s)
[INFO] Building: no-main-artifact-1\pom.xml
[INFO] run pre-build script setup.bsh
[withMaven] Publishers: Generated Artifacts Publisher: 128 ms, Junit Publisher: 213 ms, Open Task Scanner Publisher: 73 ms, Invoker Publisher: 8035 ms, Pipeline Graph Publisher: 1 ms
[Pipeline] // withMaven
[Pipeline] cleanWs
[WS-CLEANUP] Deleting project workspace...
[WS-CLEANUP] Deferred wipeout is used...
ERROR: Cannot delete workspace :f:\jenkins\jenkins-slave\workspace\n-box_maven-deploy-plugin_master@2\windows-jdk7-m3.5.x_build\target\invoker-reports\BUILD-3rd-party-jar-with-extras.xml
[Pipeline] }
[Pipeline] // stage
[Pipeline] }
[Pipeline] // ws
[Pipeline] }
[Pipeline] // node
[Pipeline] }
Failed in branch windows-jdk7-m3.5.x_build
[INFO] run post-build script verify.bsh
[INFO]           MDEPLOY-213\pom.xml .............................. SUCCESS (12.5 s)
[INFO] Building: mdeploy-45-test\pom.xml
[INFO] run pre-build script setup.bsh
[INFO] run post-build script verify.groovy
[INFO]           no-main-artifact-1\pom.xml ....................... SUCCESS (9.7 s)
[INFO] Building: no-main-artifact-2\pom.xml
[INFO] run pre-build script setup.bsh
[INFO] run post-build script verify.bsh
[INFO]           mdeploy-45-test\pom.xml .......................... SUCCESS (6.1 s)
[INFO] Building: no-main-artifact-1\pom.xml
[INFO] run pre-build script setup.bsh
[INFO] run post-build script verify.groovy
[INFO]           no-main-artifact-2\pom.xml ....................... SUCCESS (6.3 s)
[INFO] Building: no-main-artifact-snapshot\pom.xml
[INFO] run pre-build script setup.bsh
[INFO] run post-build script verify.groovy
[INFO]           no-main-artifact-1\pom.xml ....................... SUCCESS (7.4 s)
[INFO] Building: no-main-artifact-2\pom.xml
[INFO] run pre-build script setup.bsh
[INFO] run post-build script verify.groovy
[INFO]           no-main-artifact-2\pom.xml ....................... SUCCESS (4.7 s)
[INFO] Building: no-main-artifact-snapshot\pom.xml
[INFO] run pre-build script setup.bsh
[INFO] run post-build script verify.bsh
[INFO]           no-main-artifact-snapshot\pom.xml ................ SUCCESS (6.2 s)
[INFO] Building: offline\pom.xml
[INFO] run pre-build script setup.bsh
[INFO] run post-build script verify.bsh
[INFO]           no-main-artifact-snapshot\pom.xml ................ SUCCESS (4.2 s)
[INFO] Building: offline\pom.xml
[INFO] run pre-build script setup.bsh
[INFO]           offline\pom.xml .................................. SUCCESS (8.9 s)
[INFO] Building: release-jar\pom.xml
[INFO] run pre-build script setup.bsh
[INFO]           offline\pom.xml .................................. SUCCESS (12.1 s)
[INFO] Building: release-jar\pom.xml
[INFO] run pre-build script setup.bsh
[INFO] run post-build script verify.bsh
[INFO]           release-jar\pom.xml .............................. SUCCESS (4.4 s)
[INFO] Building: release-pom\pom.xml
[INFO] run pre-build script setup.bsh
[INFO] run post-build script verify.bsh
[INFO]           release-jar\pom.xml .............................. SUCCESS (5.9 s)
[INFO] Building: release-pom\pom.xml
[INFO] run pre-build script setup.bsh
[INFO] run post-build script verify.bsh
[INFO]           release-pom\pom.xml .............................. SUCCESS (4.0 s)
[INFO] Building: skip\pom.xml
[INFO] run pre-build script setup.bsh
[INFO] run post-build script verify.bsh
[INFO]           release-pom\pom.xml .............................. SUCCESS (5.7 s)
[INFO] Building: skip\pom.xml
[INFO] run pre-build script setup.bsh
[INFO]           skip\pom.xml ..................................... SUCCESS (3.8 s)
[INFO] Building: snapshot-jar\pom.xml
[INFO] run pre-build script setup.bsh
[INFO]           skip\pom.xml ..................................... SUCCESS (4.9 s)
[INFO] Building: snapshot-jar\pom.xml
[INFO] run pre-build script setup.bsh
[INFO] run post-build script verify.bsh
[INFO]           snapshot-jar\pom.xml ............................. SUCCESS (4.4 s)
[INFO] Building: snapshot-pom\pom.xml
[INFO] run pre-build script setup.bsh
[INFO] run post-build script verify.bsh
[INFO]           snapshot-pom\pom.xml ............................. SUCCESS (3.9 s)
[INFO] 
[INFO] --- maven-checkstyle-plugin:3.0.0:check (checkstyle-check) @ maven-deploy-plugin ---
[INFO] run post-build script verify.bsh
[INFO]           snapshot-jar\pom.xml ............................. SUCCESS (6.2 s)
[INFO] Building: snapshot-pom\pom.xml
[INFO] run pre-build script setup.bsh
[INFO] There is 1 error reported by Checkstyle 6.18 with config/maven_checks.xml ruleset.
[INFO] Ignored 1 error, 0 violation remaining.
[INFO] 
[INFO] --- maven-invoker-plugin:3.1.0:verify (integration-test) @ maven-deploy-plugin ---
[INFO] -------------------------------------------------
[INFO] Build Summary:
[INFO]   Passed: 31, Failed: 0, Errors: 0, Skipped: 0
[INFO] -------------------------------------------------
[INFO] ------------------------------------------------------------------------
[INFO] BUILD SUCCESS
[INFO] ------------------------------------------------------------------------
[INFO] Total time: 03:31 min
[INFO] Finished at: 2019-01-02T22:46:08Z
[INFO] Final Memory: 43M/150M
[INFO] ------------------------------------------------------------------------
[INFO] [jenkins-event-spy] Generated F:\jenkins\jenkins-slave\workspace\n-box_maven-deploy-plugin_master@2@tmp\withMaven2ef5f756\maven-spy-20190102-224236-5993931701543307484436.log
[Pipeline] }
[Pipeline] // dir
[Pipeline] }
[withMaven] artifactsPublisher - Archive artifact windows-jdk11-m3.5.x_build\pom.xml under org\apache\maven\plugins\maven-deploy-plugin\3.0.0-M2-SNAPSHOT\maven-deploy-plugin-3.0.0-M2-SNAPSHOT.pom
[withMaven] artifactsPublisher - Archive artifact windows-jdk11-m3.5.x_build\target\maven-deploy-plugin-3.0.0-M2-SNAPSHOT.jar under org\apache\maven\plugins\maven-deploy-plugin\3.0.0-M2-SNAPSHOT\maven-deploy-plugin-3.0.0-M2-SNAPSHOT.jar
[withMaven] junitPublisher - Archive test results for Maven artifact org.apache.maven.plugins:maven-deploy-plugin:maven-plugin:3.0.0-M2-SNAPSHOT generated by maven-surefire-plugin:test (default-test): windows-jdk11-m3.5.x_build\target\surefire-reports\*.xml
Recording test results
[withMaven] openTasksPublisher - Scan Tasks for Maven artifact org.apache.maven.plugins:maven-deploy-plugin:maven-plugin:3.0.0-M2-SNAPSHOT in source directory windows-jdk11-m3.5.x_build\src\main\java
[TASKS] Scanning folder 'f:\jenkins\jenkins-slave\workspace\n-box_maven-deploy-plugin_master@2' for files matching the pattern 'windows-jdk11-m3.5.x_build\src\main\java\**\*' - excludes: null
[TASKS] Found 3 files to scan for tasks
[TASKS] Found 0 open tasks.
Skipping warnings blame since pipelines do not have an SCM link.%n
[TASKS] Computing warning deltas based on reference build #35
[withMaven] invokerPublisher - Archive invoker results for Maven artifact MavenArtifact{org.apache.maven.plugins:maven-deploy-plugin:maven-plugin:3.0.0-M2-SNAPSHOT(version: 3.0.0-M2-SNAPSHOT, snapshot:false) } generated by PluginInvocation{org.apache.maven.plugins:maven-invoker-plugin:3.1.0@integration-test  integration-test}: windows-jdk11-m3.5.x_build\target\invoker-reports\*.xml
[INFO] run post-build script verify.bsh
[INFO]           snapshot-pom\pom.xml ............................. SUCCESS (5.3 s)
[INFO] 
[INFO] --- maven-checkstyle-plugin:3.0.0:check (checkstyle-check) @ maven-deploy-plugin ---
[withMaven] Publishers: Generated Artifacts Publisher: 118 ms, Junit Publisher: 229 ms, Open Task Scanner Publisher: 68 ms, Invoker Publisher: 6631 ms, Pipeline Graph Publisher: 1 ms
[Pipeline] // withMaven
[Pipeline] cleanWs
[WS-CLEANUP] Deleting project workspace...
[WS-CLEANUP] Deferred wipeout is used...
ERROR: Cannot delete workspace :f:\jenkins\jenkins-slave\workspace\n-box_maven-deploy-plugin_master@2\windows-jdk11-m3.5.x_build\target\invoker-reports\BUILD-3rd-party-jar-with-extras.xml
[Pipeline] }
[Pipeline] // stage
[INFO] There is 1 error reported by Checkstyle 6.18 with config/maven_checks.xml ruleset.
[INFO] Ignored 1 error, 0 violation remaining.
[INFO] 
[INFO] --- maven-invoker-plugin:3.1.0:verify (integration-test) @ maven-deploy-plugin ---
[INFO] -------------------------------------------------
[INFO] Build Summary:
[INFO]   Passed: 31, Failed: 0, Errors: 0, Skipped: 0
[INFO] -------------------------------------------------
[INFO] ------------------------------------------------------------------------
[INFO] BUILD SUCCESS
[INFO] ------------------------------------------------------------------------
[INFO] Total time: 04:55 min
[INFO] Finished at: 2019-01-02T14:46:16-08:00
[INFO] Final Memory: 48M/608M
[INFO] ------------------------------------------------------------------------
[INFO] [jenkins-event-spy] Generated F:\jenkins\jenkins-slave\workspace\n-box_maven-deploy-plugin_master@2@tmp\withMaven31f791e1\maven-spy-20190102-144120-7124324320848992175710.log
[Pipeline] }
[Pipeline] // ws
[Pipeline] }
[Pipeline] // node
[Pipeline] }
Failed in branch windows-jdk11-m3.5.x_build
Picked up JAVA_TOOL_OPTIONS: -Dmaven.ext.class.path="f:\jenkins\jenkins-slave\workspace\n-box_maven-deploy-plugin_master@2@tmp\withMaven31f791e1\pipeline-maven-spy.jar" -Dorg.jenkinsci.plugins.pipeline.maven.reportsFolder="f:\jenkins\jenkins-slave\workspace\n-box_maven-deploy-plugin_master@2@tmp\withMaven31f791e1" 
[Pipeline] }
[Pipeline] // dir
[Pipeline] }
[withMaven] artifactsPublisher - Archive artifact windows-jdk8-m3.5.x_build\pom.xml under org\apache\maven\plugins\maven-deploy-plugin\3.0.0-M2-SNAPSHOT\maven-deploy-plugin-3.0.0-M2-SNAPSHOT.pom
[withMaven] artifactsPublisher - Archive artifact windows-jdk8-m3.5.x_build\target\maven-deploy-plugin-3.0.0-M2-SNAPSHOT.jar under org\apache\maven\plugins\maven-deploy-plugin\3.0.0-M2-SNAPSHOT\maven-deploy-plugin-3.0.0-M2-SNAPSHOT.jar
[withMaven] junitPublisher - Archive test results for Maven artifact org.apache.maven.plugins:maven-deploy-plugin:maven-plugin:3.0.0-M2-SNAPSHOT generated by maven-surefire-plugin:test (default-test): windows-jdk8-m3.5.x_build\target\surefire-reports\*.xml
Recording test results
[withMaven] openTasksPublisher - Scan Tasks for Maven artifact org.apache.maven.plugins:maven-deploy-plugin:maven-plugin:3.0.0-M2-SNAPSHOT in source directory windows-jdk8-m3.5.x_build\src\main\java
[TASKS] Scanning folder 'f:\jenkins\jenkins-slave\workspace\n-box_maven-deploy-plugin_master@2' for files matching the pattern 'windows-jdk8-m3.5.x_build\src\main\java\**\*' - excludes: null
[TASKS] Found 3 files to scan for tasks
[TASKS] Found 0 open tasks.
Skipping warnings blame since pipelines do not have an SCM link.%n
[TASKS] Computing warning deltas based on reference build #35
[withMaven] invokerPublisher - Archive invoker results for Maven artifact MavenArtifact{org.apache.maven.plugins:maven-deploy-plugin:maven-plugin:3.0.0-M2-SNAPSHOT(version: 3.0.0-M2-SNAPSHOT, snapshot:false) } generated by PluginInvocation{org.apache.maven.plugins:maven-invoker-plugin:3.1.0@integration-test  integration-test}: windows-jdk8-m3.5.x_build\target\invoker-reports\*.xml
[withMaven] Publishers: Generated Artifacts Publisher: 128 ms, Junit Publisher: 221 ms, Open Task Scanner Publisher: 62 ms, Invoker Publisher: 13937 ms
[Pipeline] // withMaven
[Pipeline] cleanWs
[WS-CLEANUP] Deleting project workspace...
[WS-CLEANUP] Deferred wipeout is used...
ERROR: Cannot delete workspace :f:\jenkins\jenkins-slave\workspace\n-box_maven-deploy-plugin_master@2\windows-jdk7-m3.2.x_build\target\invoker-reports\BUILD-3rd-party-jar-with-extras.xml
[Pipeline] }
[Pipeline] // stage
[Pipeline] }
[Pipeline] // ws
[Pipeline] }
[Pipeline] // node
[Pipeline] }
Failed in branch windows-jdk8-m3.5.x_build
[Pipeline] // parallel
[Pipeline] stage
[Pipeline] { (Notifications)
[Pipeline] echo
Build result: FAILURE
[Pipeline] jiraIssueSelector
[Pipeline] emailext