You are viewing a plain text version of this content. The canonical link for it is here.
Posted to notifications@directory.apache.org by Apache Jenkins Server <je...@builds.apache.org> on 2024/03/03 16:14:21 UTC
Build failed in Jenkins: Directory » dir-scimple #554
See <https://ci-builds.apache.org/job/Directory/job/dir-scimple/554/display/redirect>
Changes:
------------------------------------------
Started by an SCM change
Running as SYSTEM
[EnvInject] - Loading node environment variables.
Building remotely on builds59 (ubuntu) in workspace <https://ci-builds.apache.org/job/Directory/job/dir-scimple/ws/>
The recommended git tool is: NONE
No credentials specified
> git rev-parse --resolve-git-dir <https://ci-builds.apache.org/job/Directory/job/dir-scimple/ws/.git> # timeout=10
ERROR: Workspace has a .git repository, but it appears to be corrupt.
hudson.plugins.git.GitException: Command "git rev-parse --resolve-git-dir <https://ci-builds.apache.org/job/Directory/job/dir-scimple/ws/.git"> returned status code 128:
stdout:
stderr: fatal: not a gitdir '<https://ci-builds.apache.org/job/Directory/job/dir-scimple/ws/.git'>
at org.jenkinsci.plugins.gitclient.CliGitAPIImpl.launchCommandIn(CliGitAPIImpl.java:2842)
at org.jenkinsci.plugins.gitclient.CliGitAPIImpl.launchCommandIn(CliGitAPIImpl.java:2762)
at org.jenkinsci.plugins.gitclient.CliGitAPIImpl.launchCommandIn(CliGitAPIImpl.java:2757)
at org.jenkinsci.plugins.gitclient.CliGitAPIImpl.launchCommand(CliGitAPIImpl.java:2051)
at org.jenkinsci.plugins.gitclient.CliGitAPIImpl.launchCommand(CliGitAPIImpl.java:2063)
at org.jenkinsci.plugins.gitclient.CliGitAPIImpl.hasGitRepo(CliGitAPIImpl.java:405)
at hudson.plugins.git.GitAPI.hasGitRepo(GitAPI.java:281)
at jdk.internal.reflect.GeneratedMethodAccessor34.invoke(Unknown Source)
at java.base/jdk.internal.reflect.DelegatingMethodAccessorImpl.invoke(DelegatingMethodAccessorImpl.java:43)
at java.base/java.lang.reflect.Method.invoke(Method.java:566)
at hudson.remoting.RemoteInvocationHandler$RPCRequest.perform(RemoteInvocationHandler.java:924)
at hudson.remoting.RemoteInvocationHandler$RPCRequest.call(RemoteInvocationHandler.java:902)
at hudson.remoting.RemoteInvocationHandler$RPCRequest.call(RemoteInvocationHandler.java:853)
at hudson.remoting.UserRequest.perform(UserRequest.java:211)
at hudson.remoting.UserRequest.perform(UserRequest.java:54)
at hudson.remoting.Request$2.run(Request.java:377)
at hudson.remoting.InterceptingExecutorService.lambda$wrap$0(InterceptingExecutorService.java:78)
at java.base/java.util.concurrent.FutureTask.run(FutureTask.java:264)
at java.base/java.util.concurrent.ThreadPoolExecutor.runWorker(ThreadPoolExecutor.java:1128)
at java.base/java.util.concurrent.ThreadPoolExecutor$Worker.run(ThreadPoolExecutor.java:628)
at java.base/java.lang.Thread.run(Thread.java:829)
Cloning the remote Git repository
Cloning repository https://gitbox.apache.org/repos/asf/directory-scimple.git
> git init <https://ci-builds.apache.org/job/Directory/job/dir-scimple/ws/> # timeout=10
Fetching upstream changes from https://gitbox.apache.org/repos/asf/directory-scimple.git
> git --version # timeout=10
> git --version # 'git version 2.34.1'
> git fetch --tags --force --progress -- https://gitbox.apache.org/repos/asf/directory-scimple.git +refs/heads/*:refs/remotes/origin/* # timeout=10
> git config remote.origin.url https://gitbox.apache.org/repos/asf/directory-scimple.git # timeout=10
> git config --add remote.origin.fetch +refs/heads/*:refs/remotes/origin/* # timeout=10
Avoid second fetch
> git rev-parse refs/remotes/origin/develop^{commit} # timeout=10
Checking out Revision 34dcd30952f983ac6dcbde59f8635d2e52623e5c (refs/remotes/origin/develop)
> git config core.sparsecheckout # timeout=10
> git checkout -f 34dcd30952f983ac6dcbde59f8635d2e52623e5c # timeout=10
Commit message: "Merge pull request #520 from apache/ci-report"
First time build. Skipping changelog.
Parsing POMs
Downloaded artifact https://repo.maven.apache.org/maven2/io/quarkus/platform/quarkus-bom/3.7.3/quarkus-bom-3.7.3.pom
Modules changed, recalculating dependency graph
Established TCP socket on 33477
maven35-agent.jar already up to date
maven35-interceptor.jar already up to date
maven3-interceptor-commons.jar already up to date
[dir-scimple] $ /home/jenkins/tools/java/latest1.8/bin/java -cp /home/jenkins/jenkins-agent/maven35-agent.jar:/home/jenkins/tools/maven/latest3/boot/plexus-classworlds-2.7.0.jar:/home/jenkins/tools/maven/latest3/conf/logging jenkins.maven3.agent.Maven35Main /home/jenkins/tools/maven/latest3 /home/jenkins/jenkins-agent/agent.jar /home/jenkins/jenkins-agent/maven35-interceptor.jar /home/jenkins/jenkins-agent/maven3-interceptor-commons.jar 33477
Exception in thread "main" java.lang.UnsupportedClassVersionError: hudson/remoting/Launcher has been compiled by a more recent version of the Java Runtime (class file version 55.0), this version of the Java Runtime only recognizes class file versions up to 52.0
at java.lang.ClassLoader.defineClass1(Native Method)
at java.lang.ClassLoader.defineClass(ClassLoader.java:756)
at java.security.SecureClassLoader.defineClass(SecureClassLoader.java:142)
at java.net.URLClassLoader.defineClass(URLClassLoader.java:473)
at java.net.URLClassLoader.access$100(URLClassLoader.java:74)
at java.net.URLClassLoader$1.run(URLClassLoader.java:369)
at java.net.URLClassLoader$1.run(URLClassLoader.java:363)
at java.security.AccessController.doPrivileged(Native Method)
at java.net.URLClassLoader.findClass(URLClassLoader.java:362)
at org.codehaus.plexus.classworlds.realm.ClassRealm.findClassInternal(ClassRealm.java:313)
at org.codehaus.plexus.classworlds.realm.ClassRealm.loadClassFromSelf(ClassRealm.java:432)
at org.codehaus.plexus.classworlds.strategy.SelfFirstStrategy.loadClass(SelfFirstStrategy.java:42)
at org.codehaus.plexus.classworlds.realm.ClassRealm.unsynchronizedLoadClass(ClassRealm.java:271)
at org.codehaus.plexus.classworlds.realm.ClassRealm.loadClass(ClassRealm.java:247)
at org.codehaus.plexus.classworlds.realm.ClassRealm.loadClass(ClassRealm.java:239)
at jenkins.maven3.agent.Maven35Main.main(Maven35Main.java:136)
at jenkins.maven3.agent.Maven35Main.main(Maven35Main.java:66)
ERROR: Failed to parse POMs
java.io.EOFException: unexpected stream termination
at hudson.remoting.ChannelBuilder.negotiate(ChannelBuilder.java:459)
at hudson.remoting.ChannelBuilder.build(ChannelBuilder.java:404)
at hudson.slaves.Channels.forProcess(Channels.java:121)
at hudson.maven.AbstractMavenProcessFactory.newProcess(AbstractMavenProcessFactory.java:298)
at hudson.maven.ProcessCache.get(ProcessCache.java:237)
at hudson.maven.MavenModuleSetBuild$MavenModuleSetBuildExecution.doRun(MavenModuleSetBuild.java:802)
at hudson.model.AbstractBuild$AbstractBuildExecution.run(AbstractBuild.java:526)
at hudson.model.Run.execute(Run.java:1841)
at hudson.maven.MavenModuleSetBuild.run(MavenModuleSetBuild.java:543)
at hudson.model.ResourceController.execute(ResourceController.java:101)
at hudson.model.Executor.run(Executor.java:442)
Build failed in Jenkins: Directory » dir-scimple #556
Posted by Apache Jenkins Server <je...@builds.apache.org>.
See <https://ci-builds.apache.org/job/Directory/job/dir-scimple/556/display/redirect>
Changes:
------------------------------------------
Started by timer
Running as SYSTEM
[EnvInject] - Loading node environment variables.
Building remotely on builds59 (ubuntu) in workspace <https://ci-builds.apache.org/job/Directory/job/dir-scimple/ws/>
The recommended git tool is: NONE
No credentials specified
> git rev-parse --resolve-git-dir <https://ci-builds.apache.org/job/Directory/job/dir-scimple/ws/.git> # timeout=10
Fetching changes from the remote Git repository
> git config remote.origin.url https://gitbox.apache.org/repos/asf/directory-scimple.git # timeout=10
Cleaning workspace
> git rev-parse --verify HEAD # timeout=10
Resetting working tree
> git reset --hard # timeout=10
> git clean -fdx # timeout=10
Pruning obsolete local branches
Fetching upstream changes from https://gitbox.apache.org/repos/asf/directory-scimple.git
> git --version # timeout=10
> git --version # 'git version 2.34.1'
> git fetch --tags --force --progress --prune -- https://gitbox.apache.org/repos/asf/directory-scimple.git +refs/heads/*:refs/remotes/origin/* # timeout=10
> git rev-parse refs/remotes/origin/develop^{commit} # timeout=10
Checking out Revision 01e534ce0646a3d7628e934eae5ba69ae066ca41 (refs/remotes/origin/develop)
> git config core.sparsecheckout # timeout=10
> git checkout -f 01e534ce0646a3d7628e934eae5ba69ae066ca41 # timeout=10
Commit message: "Merge pull request #524 from apache/dependabot/maven/org.codehaus.mojo-exec-maven-plugin-3.2.0"
> git rev-list --no-walk 01e534ce0646a3d7628e934eae5ba69ae066ca41 # timeout=10
Parsing POMs
Downloaded artifact https://repo.maven.apache.org/maven2/io/quarkus/platform/quarkus-bom/3.8.1/quarkus-bom-3.8.1.pom
Downloaded artifact https://repo.maven.apache.org/maven2/org/springframework/boot/spring-boot-dependencies/3.2.3/spring-boot-dependencies-3.2.3.pom
Downloaded artifact https://repo.maven.apache.org/maven2/com/fasterxml/jackson/jackson-bom/2.15.4/jackson-bom-2.15.4.pom
Downloaded artifact https://repo.maven.apache.org/maven2/org/jetbrains/kotlinx/kotlinx-serialization-bom/1.6.3/kotlinx-serialization-bom-1.6.3.pom
Downloaded artifact https://repo.maven.apache.org/maven2/org/springframework/amqp/spring-amqp-bom/3.1.2/spring-amqp-bom-3.1.2.pom
Downloaded artifact https://repo.maven.apache.org/maven2/org/springframework/batch/spring-batch-bom/5.1.1/spring-batch-bom-5.1.1.pom
Downloaded artifact https://repo.maven.apache.org/maven2/org/springframework/data/spring-data-bom/2023.1.3/spring-data-bom-2023.1.3.pom
Downloaded artifact https://repo.maven.apache.org/maven2/org/springframework/integration/spring-integration-bom/6.2.2/spring-integration-bom-6.2.2.pom
Downloaded artifact https://repo.maven.apache.org/maven2/org/springframework/pulsar/spring-pulsar-bom/1.0.3/spring-pulsar-bom-1.0.3.pom
Downloaded artifact https://repo.maven.apache.org/maven2/org/springframework/security/spring-security-bom/6.2.2/spring-security-bom-6.2.2.pom
Modules changed, recalculating dependency graph
Established TCP socket on 33233
maven35-agent.jar already up to date
maven35-interceptor.jar already up to date
maven3-interceptor-commons.jar already up to date
[dir-scimple] $ /home/jenkins/tools/java/latest1.8/bin/java -cp /home/jenkins/jenkins-agent/maven35-agent.jar:/home/jenkins/tools/maven/latest3/boot/plexus-classworlds-2.7.0.jar:/home/jenkins/tools/maven/latest3/conf/logging jenkins.maven3.agent.Maven35Main /home/jenkins/tools/maven/latest3 /home/jenkins/jenkins-agent/agent.jar /home/jenkins/jenkins-agent/maven35-interceptor.jar /home/jenkins/jenkins-agent/maven3-interceptor-commons.jar 33233
Exception in thread "main" java.lang.UnsupportedClassVersionError: hudson/remoting/Launcher has been compiled by a more recent version of the Java Runtime (class file version 55.0), this version of the Java Runtime only recognizes class file versions up to 52.0
at java.lang.ClassLoader.defineClass1(Native Method)
at java.lang.ClassLoader.defineClass(ClassLoader.java:756)
at java.security.SecureClassLoader.defineClass(SecureClassLoader.java:142)
at java.net.URLClassLoader.defineClass(URLClassLoader.java:473)
at java.net.URLClassLoader.access$100(URLClassLoader.java:74)
at java.net.URLClassLoader$1.run(URLClassLoader.java:369)
at java.net.URLClassLoader$1.run(URLClassLoader.java:363)
at java.security.AccessController.doPrivileged(Native Method)
at java.net.URLClassLoader.findClass(URLClassLoader.java:362)
at org.codehaus.plexus.classworlds.realm.ClassRealm.findClassInternal(ClassRealm.java:313)
at org.codehaus.plexus.classworlds.realm.ClassRealm.loadClassFromSelf(ClassRealm.java:432)
at org.codehaus.plexus.classworlds.strategy.SelfFirstStrategy.loadClass(SelfFirstStrategy.java:42)
at org.codehaus.plexus.classworlds.realm.ClassRealm.unsynchronizedLoadClass(ClassRealm.java:271)
at org.codehaus.plexus.classworlds.realm.ClassRealm.loadClass(ClassRealm.java:247)
at org.codehaus.plexus.classworlds.realm.ClassRealm.loadClass(ClassRealm.java:239)
at jenkins.maven3.agent.Maven35Main.main(Maven35Main.java:136)
at jenkins.maven3.agent.Maven35Main.main(Maven35Main.java:66)
ERROR: Failed to parse POMs
java.io.EOFException: unexpected stream termination
at hudson.remoting.ChannelBuilder.negotiate(ChannelBuilder.java:459)
at hudson.remoting.ChannelBuilder.build(ChannelBuilder.java:404)
at hudson.slaves.Channels.forProcess(Channels.java:121)
at hudson.maven.AbstractMavenProcessFactory.newProcess(AbstractMavenProcessFactory.java:298)
at hudson.maven.ProcessCache.get(ProcessCache.java:237)
at hudson.maven.MavenModuleSetBuild$MavenModuleSetBuildExecution.doRun(MavenModuleSetBuild.java:802)
at hudson.model.AbstractBuild$AbstractBuildExecution.run(AbstractBuild.java:526)
at hudson.model.Run.execute(Run.java:1841)
at hudson.maven.MavenModuleSetBuild.run(MavenModuleSetBuild.java:543)
at hudson.model.ResourceController.execute(ResourceController.java:101)
at hudson.model.Executor.run(Executor.java:442)
Build failed in Jenkins: Directory » dir-scimple #555
Posted by Apache Jenkins Server <je...@builds.apache.org>.
See <https://ci-builds.apache.org/job/Directory/job/dir-scimple/555/display/redirect?page=changes>
Changes:
[github] Bump com.gradle:gradle-enterprise-maven-extension from 1.20 to 1.20.1
[github] Bump org.codehaus.mojo:exec-maven-plugin from 3.1.1 to 3.2.0
[github] Bump version.spring-boot from 3.2.2 to 3.2.3
[github] Bump com.h3xstream.findsecbugs:findsecbugs-plugin from 1.12.0 to 1.13.0
[github] Bump org.mockito:mockito-core from 5.10.0 to 5.11.0
[github] Bump com.gradle:common-custom-user-data-maven-extension
[github] Bump version.quarkus from 3.7.3 to 3.8.1
[github] Bump org.mockito:mockito-junit-jupiter from 5.10.0 to 5.11.0
------------------------------------------
Started by an SCM change
Running as SYSTEM
[EnvInject] - Loading node environment variables.
Building remotely on builds42 (tmp-22 ubuntu) in workspace <https://ci-builds.apache.org/job/Directory/job/dir-scimple/ws/>
The recommended git tool is: NONE
No credentials specified
Cloning the remote Git repository
Cloning repository https://gitbox.apache.org/repos/asf/directory-scimple.git
> git init <https://ci-builds.apache.org/job/Directory/job/dir-scimple/ws/> # timeout=10
Fetching upstream changes from https://gitbox.apache.org/repos/asf/directory-scimple.git
> git --version # timeout=10
> git --version # 'git version 2.34.1'
> git fetch --tags --force --progress -- https://gitbox.apache.org/repos/asf/directory-scimple.git +refs/heads/*:refs/remotes/origin/* # timeout=10
> git config remote.origin.url https://gitbox.apache.org/repos/asf/directory-scimple.git # timeout=10
> git config --add remote.origin.fetch +refs/heads/*:refs/remotes/origin/* # timeout=10
Avoid second fetch
> git rev-parse refs/remotes/origin/develop^{commit} # timeout=10
Checking out Revision 01e534ce0646a3d7628e934eae5ba69ae066ca41 (refs/remotes/origin/develop)
> git config core.sparsecheckout # timeout=10
> git checkout -f 01e534ce0646a3d7628e934eae5ba69ae066ca41 # timeout=10
Commit message: "Merge pull request #524 from apache/dependabot/maven/org.codehaus.mojo-exec-maven-plugin-3.2.0"
> git rev-list --no-walk 34dcd30952f983ac6dcbde59f8635d2e52623e5c # timeout=10
Parsing POMs
Downloaded artifact https://repo.maven.apache.org/maven2/io/rest-assured/rest-assured-bom/5.4.0/rest-assured-bom-5.4.0.pom
Downloaded artifact https://repo.maven.apache.org/maven2/io/quarkus/platform/quarkus-bom/3.8.1/quarkus-bom-3.8.1.pom
Downloaded artifact https://repo.maven.apache.org/maven2/org/springframework/boot/spring-boot-dependencies/3.2.3/spring-boot-dependencies-3.2.3.pom
Downloaded artifact https://repo.maven.apache.org/maven2/org/infinispan/infinispan-bom/14.0.24.Final/infinispan-bom-14.0.24.Final.pom
Downloaded artifact https://repo.maven.apache.org/maven2/org/infinispan/infinispan-build-configuration-parent/14.0.24.Final/infinispan-build-configuration-parent-14.0.24.Final.pom
Downloaded artifact https://repo.maven.apache.org/maven2/com/fasterxml/jackson/jackson-bom/2.15.4/jackson-bom-2.15.4.pom
Downloaded artifact https://repo.maven.apache.org/maven2/org/jetbrains/kotlinx/kotlinx-serialization-bom/1.6.3/kotlinx-serialization-bom-1.6.3.pom
Downloaded artifact https://repo.maven.apache.org/maven2/io/projectreactor/reactor-bom/2023.0.3/reactor-bom-2023.0.3.pom
Downloaded artifact https://repo.maven.apache.org/maven2/org/springframework/amqp/spring-amqp-bom/3.1.2/spring-amqp-bom-3.1.2.pom
Downloaded artifact https://repo.maven.apache.org/maven2/org/springframework/batch/spring-batch-bom/5.1.1/spring-batch-bom-5.1.1.pom
Downloaded artifact https://repo.maven.apache.org/maven2/org/springframework/data/spring-data-bom/2023.1.3/spring-data-bom-2023.1.3.pom
Downloaded artifact https://repo.maven.apache.org/maven2/org/springframework/spring-framework-bom/6.1.4/spring-framework-bom-6.1.4.pom
Downloaded artifact https://repo.maven.apache.org/maven2/org/springframework/integration/spring-integration-bom/6.2.2/spring-integration-bom-6.2.2.pom
Downloaded artifact https://repo.maven.apache.org/maven2/org/springframework/pulsar/spring-pulsar-bom/1.0.3/spring-pulsar-bom-1.0.3.pom
Downloaded artifact https://repo.maven.apache.org/maven2/org/springframework/security/spring-security-bom/6.2.2/spring-security-bom-6.2.2.pom
Modules changed, recalculating dependency graph
Established TCP socket on 45817
maven35-agent.jar already up to date
maven35-interceptor.jar already up to date
maven3-interceptor-commons.jar already up to date
[dir-scimple] $ /home/jenkins/tools/java/latest1.8/bin/java -cp /home/jenkins/maven35-agent.jar:/home/jenkins/tools/maven/latest3/boot/plexus-classworlds-2.7.0.jar:/home/jenkins/tools/maven/latest3/conf/logging jenkins.maven3.agent.Maven35Main /home/jenkins/tools/maven/latest3 /home/jenkins/agent.jar /home/jenkins/maven35-interceptor.jar /home/jenkins/maven3-interceptor-commons.jar 45817
Exception in thread "main" java.lang.UnsupportedClassVersionError: hudson/remoting/Launcher has been compiled by a more recent version of the Java Runtime (class file version 55.0), this version of the Java Runtime only recognizes class file versions up to 52.0
at java.lang.ClassLoader.defineClass1(Native Method)
at java.lang.ClassLoader.defineClass(ClassLoader.java:756)
at java.security.SecureClassLoader.defineClass(SecureClassLoader.java:142)
at java.net.URLClassLoader.defineClass(URLClassLoader.java:473)
at java.net.URLClassLoader.access$100(URLClassLoader.java:74)
at java.net.URLClassLoader$1.run(URLClassLoader.java:369)
at java.net.URLClassLoader$1.run(URLClassLoader.java:363)
at java.security.AccessController.doPrivileged(Native Method)
at java.net.URLClassLoader.findClass(URLClassLoader.java:362)
at org.codehaus.plexus.classworlds.realm.ClassRealm.findClassInternal(ClassRealm.java:313)
at org.codehaus.plexus.classworlds.realm.ClassRealm.loadClassFromSelf(ClassRealm.java:432)
at org.codehaus.plexus.classworlds.strategy.SelfFirstStrategy.loadClass(SelfFirstStrategy.java:42)
at org.codehaus.plexus.classworlds.realm.ClassRealm.unsynchronizedLoadClass(ClassRealm.java:271)
at org.codehaus.plexus.classworlds.realm.ClassRealm.loadClass(ClassRealm.java:247)
at org.codehaus.plexus.classworlds.realm.ClassRealm.loadClass(ClassRealm.java:239)
at jenkins.maven3.agent.Maven35Main.main(Maven35Main.java:136)
at jenkins.maven3.agent.Maven35Main.main(Maven35Main.java:66)
ERROR: Failed to parse POMs
java.io.EOFException: unexpected stream termination
at hudson.remoting.ChannelBuilder.negotiate(ChannelBuilder.java:459)
at hudson.remoting.ChannelBuilder.build(ChannelBuilder.java:404)
at hudson.slaves.Channels.forProcess(Channels.java:121)
at hudson.maven.AbstractMavenProcessFactory.newProcess(AbstractMavenProcessFactory.java:298)
at hudson.maven.ProcessCache.get(ProcessCache.java:237)
at hudson.maven.MavenModuleSetBuild$MavenModuleSetBuildExecution.doRun(MavenModuleSetBuild.java:802)
at hudson.model.AbstractBuild$AbstractBuildExecution.run(AbstractBuild.java:526)
at hudson.model.Run.execute(Run.java:1841)
at hudson.maven.MavenModuleSetBuild.run(MavenModuleSetBuild.java:543)
at hudson.model.ResourceController.execute(ResourceController.java:101)
at hudson.model.Executor.run(Executor.java:442)