You are viewing a plain text version of this content. The canonical link for it is here.
Posted to builds@beam.apache.org by Apache Jenkins Server <je...@builds.apache.org> on 2023/05/26 12:32:05 UTC
Build failed in Jenkins: beam_PostCommit_Java_PVR_Spark_Batch #2057
See <https://ci-beam.apache.org/job/beam_PostCommit_Java_PVR_Spark_Batch/2057/display/redirect>
Changes:
------------------------------------------
[...truncated 45.34 KB...]
> Task :release:go-licenses:java:docker
Step 1/8 : FROM golang:1.20-bullseye
---> 6a90a37099af
Step 2/8 : WORKDIR /usr/src/app
---> Using cache
---> bd08a8ecc7fb
Step 3/8 : COPY go.mod ./
---> Using cache
---> 8eba35b06933
Step 4/8 : RUN go install github.com/google/go-licenses@latest
---> Using cache
---> 12df389897f2
Step 5/8 : COPY get-licenses.sh /opt/apache/beam/
---> Using cache
---> ed9522196d3e
Step 6/8 : ARG sdk_location
---> Using cache
---> f9962d313d81
Step 7/8 : ENV sdk_location=$sdk_location
---> Using cache
---> 23813b094d97
Step 8/8 : ENTRYPOINT /opt/apache/beam/get-licenses.sh
---> Using cache
---> 117be110a4d9
Successfully built 117be110a4d9
Successfully tagged golicenses-java:latest
> Task :sdks:java:container:pullLicenses
Copying already-fetched licenses from <https://ci-beam.apache.org/job/beam_PostCommit_Java_PVR_Spark_Batch/ws/src/sdks/java/container/build/reports/dependency-license> to <https://ci-beam.apache.org/job/beam_PostCommit_Java_PVR_Spark_Batch/ws/src/sdks/java/container/build/target/java_third_party_licenses>
Collecting pip
Using cached pip-23.1.2-py3-none-any.whl (2.1 MB)
Collecting setuptools
Using cached setuptools-67.8.0-py3-none-any.whl (1.1 MB)
Collecting wheel
Using cached wheel-0.40.0-py3-none-any.whl (64 kB)
Installing collected packages: pip, setuptools, wheel
Attempting uninstall: pip
Found existing installation: pip 20.0.2
Uninstalling pip-20.0.2:
Successfully uninstalled pip-20.0.2
Attempting uninstall: setuptools
Found existing installation: setuptools 44.0.0
Uninstalling setuptools-44.0.0:
Successfully uninstalled setuptools-44.0.0
Successfully installed pip-23.1.2 setuptools-67.8.0 wheel-0.40.0
Collecting beautifulsoup4<5.0,>=4.9.0 (from -r <https://ci-beam.apache.org/job/beam_PostCommit_Java_PVR_Spark_Batch/ws/src/sdks/java/container/license_scripts/requirement.txt> (line 19))
Using cached beautifulsoup4-4.12.2-py3-none-any.whl (142 kB)
Collecting pyyaml<6.0.0,>=3.12 (from -r <https://ci-beam.apache.org/job/beam_PostCommit_Java_PVR_Spark_Batch/ws/src/sdks/java/container/license_scripts/requirement.txt> (line 20))
Using cached PyYAML-5.4.1-cp38-cp38-manylinux1_x86_64.whl (662 kB)
Collecting tenacity<9.0,>=6.1.0 (from -r <https://ci-beam.apache.org/job/beam_PostCommit_Java_PVR_Spark_Batch/ws/src/sdks/java/container/license_scripts/requirement.txt> (line 21))
Using cached tenacity-8.2.2-py3-none-any.whl (24 kB)
Collecting soupsieve>1.2 (from beautifulsoup4<5.0,>=4.9.0->-r <https://ci-beam.apache.org/job/beam_PostCommit_Java_PVR_Spark_Batch/ws/src/sdks/java/container/license_scripts/requirement.txt> (line 19))
Using cached soupsieve-2.4.1-py3-none-any.whl (36 kB)
Installing collected packages: tenacity, soupsieve, pyyaml, beautifulsoup4
Successfully installed beautifulsoup4-4.12.2 pyyaml-5.4.1 soupsieve-2.4.1 tenacity-8.2.2
Executing python <https://ci-beam.apache.org/job/beam_PostCommit_Java_PVR_Spark_Batch/ws/src/sdks/java/container/license_scripts/pull_licenses_java.py> --license_index=<https://ci-beam.apache.org/job/beam_PostCommit_Java_PVR_Spark_Batch/ws/src/sdks/java/container/build/reports/dependency-license/index.json> --output_dir=<https://ci-beam.apache.org/job/beam_PostCommit_Java_PVR_Spark_Batch/ws/src/sdks/java/container/build/target/java_third_party_licenses> --dep_url_yaml=<https://ci-beam.apache.org/job/beam_PostCommit_Java_PVR_Spark_Batch/ws/src/sdks/java/container/license_scripts/dep_urls_java.yaml> --manual_license_path=<https://ci-beam.apache.org/job/beam_PostCommit_Java_PVR_Spark_Batch/ws/src/sdks/java/container/license_scripts/manual_licenses>
INFO:root:Pulling license for 124 dependencies using 16 threads.
INFO:root:Replaced local file URL with file://<https://ci-beam.apache.org/job/beam_PostCommit_Java_PVR_Spark_Batch/ws/src/sdks/java/container/license_scripts/manual_licenses/xz/COPYING> for xz-1.5
INFO:root:pull_licenses_java.py succeed. It took 1.462761 seconds with 16 threads.
Copying licenses from <https://ci-beam.apache.org/job/beam_PostCommit_Java_PVR_Spark_Batch/ws/src/sdks/java/container/build/target/java_third_party_licenses> to <https://ci-beam.apache.org/job/beam_PostCommit_Java_PVR_Spark_Batch/ws/src/sdks/java/container/build/target/third_party_licenses.>
Finished license_scripts.sh
> Task :release:go-licenses:java:dockerRun
+ rm -rf '/output/*'
+ go get github.com/apache/beam/sdks/v2/java/container
go: downloading github.com/apache/beam/sdks/v2 v2.47.0
go: downloading github.com/apache/beam v2.47.0+incompatible
go: downloading github.com/golang/protobuf v1.5.3
go: downloading google.golang.org/grpc v1.54.0
go: downloading google.golang.org/protobuf v1.30.0
go: downloading golang.org/x/sys v0.7.0
go: downloading golang.org/x/net v0.8.0
go: downloading google.golang.org/genproto v0.0.0-20230330154414-c0448cd141ea
go: downloading golang.org/x/text v0.8.0
go: added github.com/apache/beam/sdks/v2 v2.47.0
go: added github.com/golang/protobuf v1.5.3
go: added golang.org/x/net v0.8.0
go: added golang.org/x/sys v0.7.0
go: added golang.org/x/text v0.8.0
go: added google.golang.org/genproto v0.0.0-20230330154414-c0448cd141ea
go: added google.golang.org/grpc v1.54.0
go: added google.golang.org/protobuf v1.30.0
+ go-licenses save github.com/apache/beam/sdks/v2/java/container --save_path=/output/licenses
> Task :sdks:java:container:java8:copyJavaThirdPartyLicenses
> Task :release:go-licenses:java:dockerRun
W0526 10:21:11.133238 39 library.go:101] "golang.org/x/sys/unix" contains non-Go code that can't be inspected for further dependencies:
/go/pkg/mod/golang.org/x/sys@v0.7.0/unix/asm_linux_amd64.s
+ go-licenses csv github.com/apache/beam/sdks/v2/java/container
+ tee /output/licenses/list.csv
W0526 10:21:17.572433 84 library.go:101] "golang.org/x/sys/unix" contains non-Go code that can't be inspected for further dependencies:
/go/pkg/mod/golang.org/x/sys@v0.7.0/unix/asm_linux_amd64.s
github.com/apache/beam/sdks/v2/go,https://github.com/apache/beam/blob/sdks/v2.47.0/sdks/go/README.md,Apache-2.0
github.com/apache/beam/sdks/v2/java/container,https://github.com/apache/beam/blob/sdks/v2.47.0/sdks/LICENSE,Apache-2.0
github.com/golang/protobuf,https://github.com/golang/protobuf/blob/v1.5.3/LICENSE,BSD-3-Clause
golang.org/x/net,https://cs.opensource.google/go/x/net/+/v0.8.0:LICENSE,BSD-3-Clause
golang.org/x/sys/unix,https://cs.opensource.google/go/x/sys/+/v0.7.0:LICENSE,BSD-3-Clause
golang.org/x/text,https://cs.opensource.google/go/x/text/+/v0.8.0:LICENSE,BSD-3-Clause
google.golang.org/genproto/googleapis/rpc/status,https://github.com/googleapis/go-genproto/blob/c0448cd141ea/LICENSE,Apache-2.0
google.golang.org/grpc,https://github.com/grpc/grpc-go/blob/v1.54.0/LICENSE,Apache-2.0
google.golang.org/protobuf,https://github.com/protocolbuffers/protobuf-go/blob/v1.30.0/LICENSE,BSD-3-Clause
+ chmod -R a+w /output/licenses
> Task :runners:spark:3:job-server:validatesPortableRunnerBatch
> Task :release:go-licenses:java:createLicenses
> Task :sdks:java:container:java8:copyGolangLicenses
> Task :sdks:java:container:java8:dockerPrepare
> Task :sdks:java:container:java8:docker
#1 [internal] load build definition from Dockerfile
#1 transferring dockerfile: 2.58kB 0.0s done
#1 DONE 0.1s
#2 [internal] load .dockerignore
#2 transferring context: 2B done
#2 DONE 0.0s
#3 [internal] load metadata for docker.io/library/eclipse-temurin:8
#3 DONE 0.4s
#4 [ 1/16] FROM docker.io/library/eclipse-temurin:8@sha256:d4efd49db25bb331f7323b40b2cd8330f0bb64cb46bf00db5fbd837813c611d3
#4 resolve docker.io/library/eclipse-temurin:8@sha256:d4efd49db25bb331f7323b40b2cd8330f0bb64cb46bf00db5fbd837813c611d3 0.0s done
#4 ...
#5 [internal] load build context
#5 transferring context: 35.81MB 0.8s done
#5 DONE 0.8s
#4 [ 1/16] FROM docker.io/library/eclipse-temurin:8@sha256:d4efd49db25bb331f7323b40b2cd8330f0bb64cb46bf00db5fbd837813c611d3
#4 ...
#6 [ 2/16] ADD target/slf4j-api.jar /opt/apache/beam/jars/
#6 DONE 11.9s
#7 [ 3/16] ADD target/slf4j-jdk14.jar /opt/apache/beam/jars/
#7 DONE 1.0s
#4 [ 1/16] FROM docker.io/library/eclipse-temurin:8@sha256:d4efd49db25bb331f7323b40b2cd8330f0bb64cb46bf00db5fbd837813c611d3
#4 ...
#8 [ 4/16] ADD target/jcl-over-slf4j.jar /opt/apache/beam/jars/
#8 DONE 0.3s
#4 [ 1/16] FROM docker.io/library/eclipse-temurin:8@sha256:d4efd49db25bb331f7323b40b2cd8330f0bb64cb46bf00db5fbd837813c611d3
#4 ...
#9 [ 5/16] ADD target/log4j-over-slf4j.jar /opt/apache/beam/jars/
#9 DONE 1.7s
#4 [ 1/16] FROM docker.io/library/eclipse-temurin:8@sha256:d4efd49db25bb331f7323b40b2cd8330f0bb64cb46bf00db5fbd837813c611d3
#4 ...
#10 [ 6/16] ADD target/log4j-to-slf4j.jar /opt/apache/beam/jars/
#10 DONE 1.0s
#11 [ 7/16] ADD target/beam-sdks-java-harness.jar /opt/apache/beam/jars/
#11 DONE 2.0s
#4 [ 1/16] FROM docker.io/library/eclipse-temurin:8@sha256:d4efd49db25bb331f7323b40b2cd8330f0bb64cb46bf00db5fbd837813c611d3
#4 ...
#12 [ 8/16] COPY target/jamm.jar target/open-module-agent*.jar /opt/apache/beam/jars/
#12 DONE 2.1s
#4 [ 1/16] FROM docker.io/library/eclipse-temurin:8@sha256:d4efd49db25bb331f7323b40b2cd8330f0bb64cb46bf00db5fbd837813c611d3
#4 ...
#13 [ 9/16] COPY target/linux_amd64/boot /opt/apache/beam/
#13 DONE 0.2s
#14 [10/16] COPY target/LICENSE /opt/apache/beam/
#14 DONE 0.1s
#4 [ 1/16] FROM docker.io/library/eclipse-temurin:8@sha256:d4efd49db25bb331f7323b40b2cd8330f0bb64cb46bf00db5fbd837813c611d3
#4 ...
#15 [11/16] COPY target/NOTICE /opt/apache/beam/
#15 DONE 0.1s
#16 [12/16] ADD target/third_party_licenses /opt/apache/beam/third_party_licenses/
#16 DONE 0.2s
#17 [13/16] COPY target/LICENSE target/options/* /opt/apache/beam/options/
#17 DONE 0.1s
#4 [ 1/16] FROM docker.io/library/eclipse-temurin:8@sha256:d4efd49db25bb331f7323b40b2cd8330f0bb64cb46bf00db5fbd837813c611d3
#4 ...
#18 [14/16] COPY target/go-licenses/* /opt/apache/beam/third_party_licenses/golang/
#18 DONE 0.1s
#19 [15/16] RUN if [ "true" = "false" ] ; then rm -rf /opt/apache/beam/third_party_licenses ; fi
#19 DONE 0.8s
#4 [ 1/16] FROM docker.io/library/eclipse-temurin:8@sha256:d4efd49db25bb331f7323b40b2cd8330f0bb64cb46bf00db5fbd837813c611d3
#4 ...
#20 [16/16] COPY target/profiler/* /opt/google_cloud_profiler/
#20 ERROR: lstat /var/lib/docker/tmp/buildkit-mount319220631/target/profiler: no such file or directory
------
> [16/16] COPY target/profiler/* /opt/google_cloud_profiler/:
------
ERROR: failed to solve: lstat /var/lib/docker/tmp/buildkit-mount319220631/target/profiler: no such file or directory
> Task :sdks:java:container:java8:docker FAILED
> Task :runners:spark:3:job-server:validatesPortableRunnerBatch
[shutdown-hook-0] INFO org.apache.spark.util.ShutdownHookManager - Shutdown hook called
[shutdown-hook-0] INFO org.apache.spark.util.ShutdownHookManager - Deleting directory /tmp/spark-966ffcf1-b259-4ad0-afa7-1d73dbb537bf
[grpc-default-executor-13] INFO org.apache.beam.runners.fnexecution.logging.GrpcLoggingService - Logging client hanged up.
[shutdown-hook-0] INFO org.apache.spark.util.ShutdownHookManager - Shutdown hook called
[shutdown-hook-0] INFO org.apache.spark.util.ShutdownHookManager - Deleting directory /tmp/spark-e72665d7-aac3-4aa3-8ea9-f225c86611c3
[shutdown-hook-0] INFO org.apache.spark.util.ShutdownHookManager - Shutdown hook called
[shutdown-hook-0] INFO org.apache.spark.util.ShutdownHookManager - Deleting directory /tmp/spark-04515a28-5c22-46bf-9c57-d9126f4e166e
[grpc-default-executor-120] INFO org.apache.beam.runners.fnexecution.logging.GrpcLoggingService - Logging client hanged up.
[shutdown-hook-0] INFO org.apache.spark.util.ShutdownHookManager - Shutdown hook called
[shutdown-hook-0] INFO org.apache.spark.util.ShutdownHookManager - Deleting directory /tmp/spark-812f6eec-8330-487f-9c49-968e5a48ba04
FAILURE: Build failed with an exception.
* What went wrong:
Execution failed for task ':sdks:java:container:java8:docker'.
> Process 'command 'docker'' finished with non-zero exit value 1
* Try:
> Run with --stacktrace option to get the stack trace.
> Run with --info or --debug option to get more log output.
* Get more help at https://help.gradle.org
Deprecated Gradle features were used in this build, making it incompatible with Gradle 8.0.
You can use '--warning-mode all' to show the individual deprecation warnings and determine if they come from your own scripts or plugins.
See https://docs.gradle.org/7.5.1/userguide/command_line_interface.html#sec:command_line_warnings
Execution optimizations have been disabled for 1 invalid unit(s) of work during this build to ensure correctness.
Please consult deprecation warnings for more details.
BUILD FAILED in 2h 11m 38s
117 actionable tasks: 74 executed, 39 from cache, 4 up-to-date
Publishing build scan...
https://ge.apache.org/s/ggy7wzwjy4nt4
Build step 'Invoke Gradle script' changed build result to FAILURE
Build step 'Invoke Gradle script' marked build as failure
---------------------------------------------------------------------
To unsubscribe, e-mail: builds-unsubscribe@beam.apache.org
For additional commands, e-mail: builds-help@beam.apache.org
Jenkins build is back to normal : beam_PostCommit_Java_PVR_Spark_Batch #2058
Posted by Apache Jenkins Server <je...@builds.apache.org>.
See <https://ci-beam.apache.org/job/beam_PostCommit_Java_PVR_Spark_Batch/2058/display/redirect>
---------------------------------------------------------------------
To unsubscribe, e-mail: builds-unsubscribe@beam.apache.org
For additional commands, e-mail: builds-help@beam.apache.org