You are viewing a plain text version of this content. The canonical link for it is here.
Posted to dev@openmeetings.apache.org by Apache Jenkins Server <je...@builds.apache.org> on 2023/08/26 13:42:45 UTC
Build failed in Jenkins: OpenMeetings » openmeetings #292
See <https://ci-builds.apache.org/job/OpenMeetings/job/openmeetings/292/display/redirect>
Changes:
------------------------------------------
Started by user Maxim Solodovnik
Running as SYSTEM
[EnvInject] - Loading node environment variables.
Building remotely on builds34 (ubuntu) in workspace <https://ci-builds.apache.org/job/OpenMeetings/job/openmeetings/ws/>
[WS-CLEANUP] Deleting project workspace...
[WS-CLEANUP] Deferred wipeout is used...
[WS-CLEANUP] Done
The recommended git tool is: NONE
No credentials specified
Cloning the remote Git repository
Cloning repository https://github.com/apache/openmeetings.git
> git init <https://ci-builds.apache.org/job/OpenMeetings/job/openmeetings/ws/> # timeout=10
Fetching upstream changes from https://github.com/apache/openmeetings.git
> git --version # timeout=10
> git --version # 'git version 2.17.1'
> git fetch --tags --progress -- https://github.com/apache/openmeetings.git +refs/heads/*:refs/remotes/origin/* # timeout=10
> git config remote.origin.url https://github.com/apache/openmeetings.git # timeout=10
> git config --add remote.origin.fetch +refs/heads/*:refs/remotes/origin/* # timeout=10
Avoid second fetch
> git rev-parse refs/remotes/origin/master^{commit} # timeout=10
Checking out Revision e201ff9ba748ef67fbec29ddcf2212e9fbfa08e6 (refs/remotes/origin/master)
> git config core.sparsecheckout # timeout=10
> git checkout -f e201ff9ba748ef67fbec29ddcf2212e9fbfa08e6 # timeout=10
Commit message: "[OPENMEETINGS-2770] tomcat"
> git rev-list --no-walk e201ff9ba748ef67fbec29ddcf2212e9fbfa08e6 # timeout=10
Run condition [Current build status] enabling prebuild for step [Invoke Artifactory Maven 3]
[openmeetings] $ /home/jenkins/tools/maven/latest3/bin/mvn clean install -PallModules,Jenkins
[INFO] Scanning for projects...
[INFO] ------------------------------------------------------------------------
[INFO] Reactor Build Order:
[INFO]
[INFO] Openmeetings [pom]
[INFO] Openmeetings Util [jar]
[INFO] Openmeetings DB [jar]
[INFO] Openmeetings Core [jar]
[INFO] Openmeetings MediaServer [jar]
[INFO] Openmeetings Install [jar]
[INFO] Openmeetings Service [jar]
[INFO] Openmeetings Webservices [jar]
[INFO] Openmeetings Web [war]
[INFO] Openmeetings Screen Sharing applet [jar]
[INFO] Openmeetings Server [jar]
[INFO]
[INFO] ------------< org.apache.openmeetings:openmeetings-parent >-------------
[INFO] Building Openmeetings 7.2.0-SNAPSHOT [1/11]
[INFO] from pom.xml
[INFO] --------------------------------[ pom ]---------------------------------
[INFO]
[INFO] --- clean:3.3.1:clean (default-clean) @ openmeetings-parent ---
[INFO]
[INFO] --- buildnumber:3.0.0:create (default) @ openmeetings-parent ---
[INFO] ShortRevision tag detected. The value is '7'.
[INFO] Executing: /bin/sh -c cd '<https://ci-builds.apache.org/job/OpenMeetings/job/openmeetings/ws/'> && 'git' 'rev-parse' '--verify' '--short=7' 'HEAD'
[INFO] Working directory: <https://ci-builds.apache.org/job/OpenMeetings/job/openmeetings/ws/>
[INFO] Storing buildNumber: e201ff9 at timestamp: 1693057345915
[WARNING] Cannot get the branch information from the git repository:
Detecting the current branch failed: fatal: ref HEAD is not a symbolic ref
[INFO] ShortRevision tag detected. The value is '7'.
[INFO] Executing: /bin/sh -c cd '<https://ci-builds.apache.org/job/OpenMeetings/job/openmeetings/ws/'> && 'git' 'rev-parse' '--verify' '--short=7' 'HEAD'
[INFO] Working directory: <https://ci-builds.apache.org/job/OpenMeetings/job/openmeetings/ws/>
[INFO] Storing buildScmBranch: UNKNOWN
[INFO]
[INFO] --- apache-rat:0.15:check (default) @ openmeetings-parent ---
[INFO] Added 3 additional default licenses.
[INFO] Enabled default license matchers.
[INFO] Added 3 custom approved licenses.
[INFO] Will parse SCM ignores for exclusions...
[INFO] Parsing exclusions from <https://ci-builds.apache.org/job/OpenMeetings/job/openmeetings/ws/.gitignore>
[INFO] Finished adding exclusions from SCM ignore files.
[INFO] 83 implicit excludes.
[INFO] 9 explicit excludes.
[INFO] 11 resources included
[INFO] Rat check: Summary over all files. Unapproved: 0, unknown: 0, generated: 0, approved: 9 licenses.
[INFO]
[INFO] --- enforcer:3.3.0:enforce (enforce-versions) @ openmeetings-parent ---
[INFO] Rule 0: org.apache.maven.enforcer.rules.version.RequireJavaVersion passed
[INFO] Rule 1: org.apache.maven.enforcer.rules.version.RequireMavenVersion passed
[INFO]
[INFO] --- enforcer:3.3.0:enforce (enforce-maven-version) @ openmeetings-parent ---
[INFO] Rule 0: org.apache.maven.enforcer.rules.version.RequireMavenVersion passed
[INFO]
[INFO] --- enforcer:3.3.0:enforce (enforce-java-version) @ openmeetings-parent ---
[INFO] Rule 0: org.apache.maven.enforcer.rules.version.RequireJavaVersion passed
[INFO]
[INFO] --- jacoco:0.8.10:prepare-agent (prepare-agent) @ openmeetings-parent ---
[INFO] argLine set to -javaagent:/home/jenkins/.m2/repository/org/jacoco/org.jacoco.agent/0.8.10/org.jacoco.agent-0.8.10-runtime.jar=destfile=<https://ci-builds.apache.org/job/OpenMeetings/job/openmeetings/ws/../target/jacoco.exec,append=true>
[INFO]
[INFO] --- remote-resources:3.1.0:process (process-resource-bundles) @ openmeetings-parent ---
[INFO] Preparing remote bundle org.apache.apache.resources:apache-jar-resource-bundle:1.5
[INFO] Copying 3 resources from 1 bundle.
[INFO]
[INFO] --- site:4.0.0-M9:site (generate-site) @ openmeetings-parent ---
[INFO] Configuring report plugin maven-project-info-reports-plugin:3.4.5
[INFO] Configured 14 reports for maven-project-info-reports-plugin:3.4.5: index, ci-management, dependencies, dependency-convergence, dependency-management, distribution-management, issue-management, licenses, mailing-lists, plugin-management, plugins, team, scm, summary
[INFO] Configuring report plugin maven-checkstyle-plugin:3.3.0
[INFO] Configured 1 report for maven-checkstyle-plugin:3.3.0: checkstyle
[INFO] Configuring report plugin maven-surefire-report-plugin:3.1.2
[INFO] Configured 1 report for maven-surefire-report-plugin:3.1.2: report-only
[INFO] Configuring report plugin apache-rat-plugin:0.15
[INFO] Configured 1 report for apache-rat-plugin:0.15: rat
[INFO] Rendering site for default locale
[INFO] Relativizing site links with respect to localized project URL: https://openmeetings.apache.org
[INFO] Rendering content with io.github.devacfr.maven.skins:reflow-maven-skin:jar:2.3.4 skin
[INFO] Rendering 19 report documents
[INFO] Generating "About" report --- maven-project-info-reports-plugin:3.4.5:index
log4j:WARN No appenders could be found for logger (org.apache.commons.beanutils.converters.BooleanConverter).
log4j:WARN Please initialize the log4j system properly.
log4j:WARN See http://logging.apache.org/log4j/1.2/faq.html#noconfig for more info.
[INFO] Generating "CI Management" report --- maven-project-info-reports-plugin:3.4.5:ci-management
[INFO] Generating "Dependencies" report --- maven-project-info-reports-plugin:3.4.5:dependencies
[INFO] Generating "Dependency Convergence" report --- maven-project-info-reports-plugin:3.4.5:dependency-convergence
Downloading from sonatype-snapshots: https://oss.sonatype.org/content/repositories/snapshots/org/apache/wicket/wicket-util/9.15.0-SNAPSHOT/maven-metadata.xml
[WARNING] Could not transfer metadata org.apache.wicket:wicket-util:9.15.0-SNAPSHOT/maven-metadata.xml from/to sonatype-snapshots (https://oss.sonatype.org/content/repositories/snapshots/): status code: 403, reason phrase: Forbidden (403)
[WARNING] org.apache.wicket:wicket-util:9.15.0-SNAPSHOT/maven-metadata.xml failed to transfer from https://oss.sonatype.org/content/repositories/snapshots/ during a previous attempt. This failure was cached in the local repository and resolution will not be reattempted until the update interval of sonatype-snapshots has elapsed or updates are forced. Original error: Could not transfer metadata org.apache.wicket:wicket-util:9.15.0-SNAPSHOT/maven-metadata.xml from/to sonatype-snapshots (https://oss.sonatype.org/content/repositories/snapshots/): status code: 403, reason phrase: Forbidden (403)
Downloading from sonatype-snapshots: https://oss.sonatype.org/content/repositories/snapshots/org/apache/wicket/wicket-parent/9.15.0-SNAPSHOT/maven-metadata.xml
[WARNING] Could not transfer metadata org.apache.wicket:wicket-parent:9.15.0-SNAPSHOT/maven-metadata.xml from/to sonatype-snapshots (https://oss.sonatype.org/content/repositories/snapshots/): status code: 403, reason phrase: Forbidden (403)
Downloading from sonatype-snapshots: https://oss.sonatype.org/content/repositories/snapshots/org/apache/wicket/wicket-native-websocket-core/9.15.0-SNAPSHOT/maven-metadata.xml
[WARNING] Could not transfer metadata org.apache.wicket:wicket-native-websocket-core:9.15.0-SNAPSHOT/maven-metadata.xml from/to sonatype-snapshots (https://oss.sonatype.org/content/repositories/snapshots/): status code: 403, reason phrase: Forbidden (403)
[WARNING] org.apache.wicket:wicket-native-websocket-core:9.15.0-SNAPSHOT/maven-metadata.xml failed to transfer from https://oss.sonatype.org/content/repositories/snapshots/ during a previous attempt. This failure was cached in the local repository and resolution will not be reattempted until the update interval of sonatype-snapshots has elapsed or updates are forced. Original error: Could not transfer metadata org.apache.wicket:wicket-native-websocket-core:9.15.0-SNAPSHOT/maven-metadata.xml from/to sonatype-snapshots (https://oss.sonatype.org/content/repositories/snapshots/): status code: 403, reason phrase: Forbidden (403)
Downloading from sonatype-snapshots: https://oss.sonatype.org/content/repositories/snapshots/org/apache/wicket/wicket-native-websocket/9.15.0-SNAPSHOT/maven-metadata.xml
[WARNING] Could not transfer metadata org.apache.wicket:wicket-native-websocket:9.15.0-SNAPSHOT/maven-metadata.xml from/to sonatype-snapshots (https://oss.sonatype.org/content/repositories/snapshots/): status code: 403, reason phrase: Forbidden (403)
Downloading from sonatype-snapshots: https://oss.sonatype.org/content/repositories/snapshots/org/apache/wicket/wicket-core/9.15.0-SNAPSHOT/maven-metadata.xml
[WARNING] Could not transfer metadata org.apache.wicket:wicket-core:9.15.0-SNAPSHOT/maven-metadata.xml from/to sonatype-snapshots (https://oss.sonatype.org/content/repositories/snapshots/): status code: 403, reason phrase: Forbidden (403)
[WARNING] org.apache.wicket:wicket-core:9.15.0-SNAPSHOT/maven-metadata.xml failed to transfer from https://oss.sonatype.org/content/repositories/snapshots/ during a previous attempt. This failure was cached in the local repository and resolution will not be reattempted until the update interval of sonatype-snapshots has elapsed or updates are forced. Original error: Could not transfer metadata org.apache.wicket:wicket-core:9.15.0-SNAPSHOT/maven-metadata.xml from/to sonatype-snapshots (https://oss.sonatype.org/content/repositories/snapshots/): status code: 403, reason phrase: Forbidden (403)
Downloading from sonatype-snapshots: https://oss.sonatype.org/content/repositories/snapshots/org/apache/wicket/wicket-request/9.15.0-SNAPSHOT/maven-metadata.xml
[WARNING] Could not transfer metadata org.apache.wicket:wicket-request:9.15.0-SNAPSHOT/maven-metadata.xml from/to sonatype-snapshots (https://oss.sonatype.org/content/repositories/snapshots/): status code: 403, reason phrase: Forbidden (403)
[WARNING] org.apache.wicket:wicket-request:9.15.0-SNAPSHOT/maven-metadata.xml failed to transfer from https://oss.sonatype.org/content/repositories/snapshots/ during a previous attempt. This failure was cached in the local repository and resolution will not be reattempted until the update interval of sonatype-snapshots has elapsed or updates are forced. Original error: Could not transfer metadata org.apache.wicket:wicket-request:9.15.0-SNAPSHOT/maven-metadata.xml from/to sonatype-snapshots (https://oss.sonatype.org/content/repositories/snapshots/): status code: 403, reason phrase: Forbidden (403)
Downloading from sonatype-snapshots: https://oss.sonatype.org/content/repositories/snapshots/org/apache/wicket/wicket-extensions/9.15.0-SNAPSHOT/maven-metadata.xml
[WARNING] Could not transfer metadata org.apache.wicket:wicket-extensions:9.15.0-SNAPSHOT/maven-metadata.xml from/to sonatype-snapshots (https://oss.sonatype.org/content/repositories/snapshots/): status code: 403, reason phrase: Forbidden (403)
[WARNING] org.apache.wicket:wicket-extensions:9.15.0-SNAPSHOT/maven-metadata.xml failed to transfer from https://oss.sonatype.org/content/repositories/snapshots/ during a previous attempt. This failure was cached in the local repository and resolution will not be reattempted until the update interval of sonatype-snapshots has elapsed or updates are forced. Original error: Could not transfer metadata org.apache.wicket:wicket-extensions:9.15.0-SNAPSHOT/maven-metadata.xml from/to sonatype-snapshots (https://oss.sonatype.org/content/repositories/snapshots/): status code: 403, reason phrase: Forbidden (403)
Downloading from sonatype-snapshots: https://oss.sonatype.org/content/repositories/snapshots/org/apache/openmeetings/openmeetings-util/7.2.0-SNAPSHOT/maven-metadata.xml
[WARNING] Could not transfer metadata org.apache.openmeetings:openmeetings-util:7.2.0-SNAPSHOT/maven-metadata.xml from/to sonatype-snapshots (https://oss.sonatype.org/content/repositories/snapshots/): status code: 403, reason phrase: Forbidden (403)
Downloading from sonatype-nexus-snapshots: https://oss.sonatype.org/content/repositories/snapshots/org/apache/wicket/wicket-devutils/9.15.0-SNAPSHOT/maven-metadata.xml
Downloading from sonatype-snapshots: https://oss.sonatype.org/content/repositories/snapshots/org/apache/wicket/wicket-devutils/9.15.0-SNAPSHOT/maven-metadata.xml
[WARNING] Could not transfer metadata org.apache.wicket:wicket-devutils:9.15.0-SNAPSHOT/maven-metadata.xml from/to sonatype-snapshots (https://oss.sonatype.org/content/repositories/snapshots/): status code: 403, reason phrase: Forbidden (403)
[WARNING] Could not transfer metadata org.apache.wicket:wicket-devutils:9.15.0-SNAPSHOT/maven-metadata.xml from/to sonatype-nexus-snapshots (https://oss.sonatype.org/content/repositories/snapshots): status code: 403, reason phrase: Forbidden (403)
[WARNING] org.apache.wicket:wicket-devutils:9.15.0-SNAPSHOT/maven-metadata.xml failed to transfer from https://oss.sonatype.org/content/repositories/snapshots/ during a previous attempt. This failure was cached in the local repository and resolution will not be reattempted until the update interval of sonatype-snapshots has elapsed or updates are forced. Original error: Could not transfer metadata org.apache.wicket:wicket-devutils:9.15.0-SNAPSHOT/maven-metadata.xml from/to sonatype-snapshots (https://oss.sonatype.org/content/repositories/snapshots/): status code: 403, reason phrase: Forbidden (403)
[WARNING] org.apache.wicket:wicket-devutils:9.15.0-SNAPSHOT/maven-metadata.xml failed to transfer from https://oss.sonatype.org/content/repositories/snapshots during a previous attempt. This failure was cached in the local repository and resolution will not be reattempted until the update interval of sonatype-nexus-snapshots has elapsed or updates are forced. Original error: Could not transfer metadata org.apache.wicket:wicket-devutils:9.15.0-SNAPSHOT/maven-metadata.xml from/to sonatype-nexus-snapshots (https://oss.sonatype.org/content/repositories/snapshots): status code: 403, reason phrase: Forbidden (403)
[WARNING] org.apache.openmeetings:openmeetings-util:7.2.0-SNAPSHOT/maven-metadata.xml failed to transfer from https://oss.sonatype.org/content/repositories/snapshots/ during a previous attempt. This failure was cached in the local repository and resolution will not be reattempted until the update interval of sonatype-snapshots has elapsed or updates are forced. Original error: Could not transfer metadata org.apache.openmeetings:openmeetings-util:7.2.0-SNAPSHOT/maven-metadata.xml from/to sonatype-snapshots (https://oss.sonatype.org/content/repositories/snapshots/): status code: 403, reason phrase: Forbidden (403)
Downloading from sonatype-snapshots: https://oss.sonatype.org/content/repositories/snapshots/org/apache/openmeetings/openmeetings-db/7.2.0-SNAPSHOT/maven-metadata.xml
[WARNING] Could not transfer metadata org.apache.openmeetings:openmeetings-db:7.2.0-SNAPSHOT/maven-metadata.xml from/to sonatype-snapshots (https://oss.sonatype.org/content/repositories/snapshots/): status code: 403, reason phrase: Forbidden (403)
Downloading from sonatype-snapshots: https://oss.sonatype.org/content/repositories/snapshots/org/apache/wicket/wicket-ioc/9.15.0-SNAPSHOT/maven-metadata.xml
[WARNING] Could not transfer metadata org.apache.wicket:wicket-ioc:9.15.0-SNAPSHOT/maven-metadata.xml from/to sonatype-snapshots (https://oss.sonatype.org/content/repositories/snapshots/): status code: 403, reason phrase: Forbidden (403)
[WARNING] org.apache.wicket:wicket-ioc:9.15.0-SNAPSHOT/maven-metadata.xml failed to transfer from https://oss.sonatype.org/content/repositories/snapshots/ during a previous attempt. This failure was cached in the local repository and resolution will not be reattempted until the update interval of sonatype-snapshots has elapsed or updates are forced. Original error: Could not transfer metadata org.apache.wicket:wicket-ioc:9.15.0-SNAPSHOT/maven-metadata.xml from/to sonatype-snapshots (https://oss.sonatype.org/content/repositories/snapshots/): status code: 403, reason phrase: Forbidden (403)
Downloading from sonatype-snapshots: https://oss.sonatype.org/content/repositories/snapshots/org/apache/openmeetings/openmeetings-core/7.2.0-SNAPSHOT/maven-metadata.xml
[WARNING] Could not transfer metadata org.apache.openmeetings:openmeetings-core:7.2.0-SNAPSHOT/maven-metadata.xml from/to sonatype-snapshots (https://oss.sonatype.org/content/repositories/snapshots/): status code: 403, reason phrase: Forbidden (403)
Downloading from sonatype-snapshots: https://oss.sonatype.org/content/repositories/snapshots/org/kurento/kms-api-core/maven-metadata.xml
[WARNING] Could not transfer metadata org.kurento:kms-api-core/maven-metadata.xml from/to sonatype-snapshots (https://oss.sonatype.org/content/repositories/snapshots/): status code: 403, reason phrase: Forbidden (403)
Downloading from sonatype-snapshots: https://oss.sonatype.org/content/repositories/snapshots/org/kurento/kms-api-elements/maven-metadata.xml
[WARNING] Could not transfer metadata org.kurento:kms-api-elements/maven-metadata.xml from/to sonatype-snapshots (https://oss.sonatype.org/content/repositories/snapshots/): status code: 403, reason phrase: Forbidden (403)
Downloading from sonatype-snapshots: https://oss.sonatype.org/content/repositories/snapshots/org/apache/wicket/wicket-spring/9.15.0-SNAPSHOT/maven-metadata.xml
[WARNING] Could not transfer metadata org.apache.wicket:wicket-spring:9.15.0-SNAPSHOT/maven-metadata.xml from/to sonatype-snapshots (https://oss.sonatype.org/content/repositories/snapshots/): status code: 403, reason phrase: Forbidden (403)
[WARNING] org.apache.wicket:wicket-spring:9.15.0-SNAPSHOT/maven-metadata.xml failed to transfer from https://oss.sonatype.org/content/repositories/snapshots/ during a previous attempt. This failure was cached in the local repository and resolution will not be reattempted until the update interval of sonatype-snapshots has elapsed or updates are forced. Original error: Could not transfer metadata org.apache.wicket:wicket-spring:9.15.0-SNAPSHOT/maven-metadata.xml from/to sonatype-snapshots (https://oss.sonatype.org/content/repositories/snapshots/): status code: 403, reason phrase: Forbidden (403)
Downloading from sonatype-snapshots: https://oss.sonatype.org/content/repositories/snapshots/org/apache/openmeetings/openmeetings-service/7.2.0-SNAPSHOT/maven-metadata.xml
[WARNING] Could not transfer metadata org.apache.openmeetings:openmeetings-service:7.2.0-SNAPSHOT/maven-metadata.xml from/to sonatype-snapshots (https://oss.sonatype.org/content/repositories/snapshots/): status code: 403, reason phrase: Forbidden (403)
Downloading from sonatype-snapshots: https://oss.sonatype.org/content/repositories/snapshots/org/apache/openmeetings/openmeetings-install/7.2.0-SNAPSHOT/maven-metadata.xml
[WARNING] Could not transfer metadata org.apache.openmeetings:openmeetings-install:7.2.0-SNAPSHOT/maven-metadata.xml from/to sonatype-snapshots (https://oss.sonatype.org/content/repositories/snapshots/): status code: 403, reason phrase: Forbidden (403)
Downloading from sonatype-snapshots: https://oss.sonatype.org/content/repositories/snapshots/org/apache/openmeetings/openmeetings-mediaserver/7.2.0-SNAPSHOT/maven-metadata.xml
[WARNING] Could not transfer metadata org.apache.openmeetings:openmeetings-mediaserver:7.2.0-SNAPSHOT/maven-metadata.xml from/to sonatype-snapshots (https://oss.sonatype.org/content/repositories/snapshots/): status code: 403, reason phrase: Forbidden (403)
[WARNING] org.kurento:kms-api-core/maven-metadata.xml failed to transfer from https://oss.sonatype.org/content/repositories/snapshots/ during a previous attempt. This failure was cached in the local repository and resolution will not be reattempted until the update interval of sonatype-snapshots has elapsed or updates are forced. Original error: Could not transfer metadata org.kurento:kms-api-core/maven-metadata.xml from/to sonatype-snapshots (https://oss.sonatype.org/content/repositories/snapshots/): status code: 403, reason phrase: Forbidden (403)
[WARNING] org.kurento:kms-api-elements/maven-metadata.xml failed to transfer from https://oss.sonatype.org/content/repositories/snapshots/ during a previous attempt. This failure was cached in the local repository and resolution will not be reattempted until the update interval of sonatype-snapshots has elapsed or updates are forced. Original error: Could not transfer metadata org.kurento:kms-api-elements/maven-metadata.xml from/to sonatype-snapshots (https://oss.sonatype.org/content/repositories/snapshots/): status code: 403, reason phrase: Forbidden (403)
Downloading from sonatype-snapshots: https://oss.sonatype.org/content/repositories/snapshots/org/apache/openmeetings/openmeetings-webservice/7.2.0-SNAPSHOT/maven-metadata.xml
[WARNING] Could not transfer metadata org.apache.openmeetings:openmeetings-webservice:7.2.0-SNAPSHOT/maven-metadata.xml from/to sonatype-snapshots (https://oss.sonatype.org/content/repositories/snapshots/): status code: 403, reason phrase: Forbidden (403)
Downloading from sonatype-snapshots: https://oss.sonatype.org/content/repositories/snapshots/org/apache/wicket/wicket-auth-roles/9.15.0-SNAPSHOT/maven-metadata.xml
[WARNING] Could not transfer metadata org.apache.wicket:wicket-auth-roles:9.15.0-SNAPSHOT/maven-metadata.xml from/to sonatype-snapshots (https://oss.sonatype.org/content/repositories/snapshots/): status code: 403, reason phrase: Forbidden (403)
[WARNING] org.apache.wicket:wicket-auth-roles:9.15.0-SNAPSHOT/maven-metadata.xml failed to transfer from https://oss.sonatype.org/content/repositories/snapshots/ during a previous attempt. This failure was cached in the local repository and resolution will not be reattempted until the update interval of sonatype-snapshots has elapsed or updates are forced. Original error: Could not transfer metadata org.apache.wicket:wicket-auth-roles:9.15.0-SNAPSHOT/maven-metadata.xml from/to sonatype-snapshots (https://oss.sonatype.org/content/repositories/snapshots/): status code: 403, reason phrase: Forbidden (403)
Downloading from sonatype-snapshots: https://oss.sonatype.org/content/repositories/snapshots/org/apache/wicket/wicket-native-websocket-javax/9.15.0-SNAPSHOT/maven-metadata.xml
[WARNING] Could not transfer metadata org.apache.wicket:wicket-native-websocket-javax:9.15.0-SNAPSHOT/maven-metadata.xml from/to sonatype-snapshots (https://oss.sonatype.org/content/repositories/snapshots/): status code: 403, reason phrase: Forbidden (403)
[WARNING] org.apache.wicket:wicket-native-websocket-javax:9.15.0-SNAPSHOT/maven-metadata.xml failed to transfer from https://oss.sonatype.org/content/repositories/snapshots/ during a previous attempt. This failure was cached in the local repository and resolution will not be reattempted until the update interval of sonatype-snapshots has elapsed or updates are forced. Original error: Could not transfer metadata org.apache.wicket:wicket-native-websocket-javax:9.15.0-SNAPSHOT/maven-metadata.xml from/to sonatype-snapshots (https://oss.sonatype.org/content/repositories/snapshots/): status code: 403, reason phrase: Forbidden (403)
Downloading from sonatype-snapshots: https://oss.sonatype.org/content/repositories/snapshots/de/agilecoders/wicket/wicket-bootstrap-extensions/6.0.5-SNAPSHOT/maven-metadata.xml
[WARNING] Could not transfer metadata de.agilecoders.wicket:wicket-bootstrap-extensions:6.0.5-SNAPSHOT/maven-metadata.xml from/to sonatype-snapshots (https://oss.sonatype.org/content/repositories/snapshots/): status code: 403, reason phrase: Forbidden (403)
[WARNING] de.agilecoders.wicket:wicket-bootstrap-extensions:6.0.5-SNAPSHOT/maven-metadata.xml failed to transfer from https://oss.sonatype.org/content/repositories/snapshots/ during a previous attempt. This failure was cached in the local repository and resolution will not be reattempted until the update interval of sonatype-snapshots has elapsed or updates are forced. Original error: Could not transfer metadata de.agilecoders.wicket:wicket-bootstrap-extensions:6.0.5-SNAPSHOT/maven-metadata.xml from/to sonatype-snapshots (https://oss.sonatype.org/content/repositories/snapshots/): status code: 403, reason phrase: Forbidden (403)
Downloading from sonatype-snapshots: https://oss.sonatype.org/content/repositories/snapshots/de/agilecoders/wicket/wicket-bootstrap-extensions/6.0.5-SNAPSHOT/wicket-bootstrap-extensions-6.0.5-SNAPSHOT.pom
Downloading from sonatype-snapshots: https://oss.sonatype.org/content/repositories/snapshots/de/agilecoders/wicket/wicket-bootstrap-themes/6.0.5-SNAPSHOT/maven-metadata.xml
[WARNING] Could not transfer metadata de.agilecoders.wicket:wicket-bootstrap-themes:6.0.5-SNAPSHOT/maven-metadata.xml from/to sonatype-snapshots (https://oss.sonatype.org/content/repositories/snapshots/): status code: 403, reason phrase: Forbidden (403)
[WARNING] de.agilecoders.wicket:wicket-bootstrap-themes:6.0.5-SNAPSHOT/maven-metadata.xml failed to transfer from https://oss.sonatype.org/content/repositories/snapshots/ during a previous attempt. This failure was cached in the local repository and resolution will not be reattempted until the update interval of sonatype-snapshots has elapsed or updates are forced. Original error: Could not transfer metadata de.agilecoders.wicket:wicket-bootstrap-themes:6.0.5-SNAPSHOT/maven-metadata.xml from/to sonatype-snapshots (https://oss.sonatype.org/content/repositories/snapshots/): status code: 403, reason phrase: Forbidden (403)
Downloading from sonatype-snapshots: https://oss.sonatype.org/content/repositories/snapshots/de/agilecoders/wicket/wicket-bootstrap-themes/6.0.5-SNAPSHOT/wicket-bootstrap-themes-6.0.5-SNAPSHOT.pom
[WARNING] org.apache.openmeetings:openmeetings-core:7.2.0-SNAPSHOT/maven-metadata.xml failed to transfer from https://oss.sonatype.org/content/repositories/snapshots/ during a previous attempt. This failure was cached in the local repository and resolution will not be reattempted until the update interval of sonatype-snapshots has elapsed or updates are forced. Original error: Could not transfer metadata org.apache.openmeetings:openmeetings-core:7.2.0-SNAPSHOT/maven-metadata.xml from/to sonatype-snapshots (https://oss.sonatype.org/content/repositories/snapshots/): status code: 403, reason phrase: Forbidden (403)
[INFO] ------------------------------------------------------------------------
[INFO] Reactor Summary for Openmeetings 7.2.0-SNAPSHOT:
[INFO]
[INFO] Openmeetings ....................................... FAILURE [ 19.548 s]
[INFO] Openmeetings Util .................................. SKIPPED
[INFO] Openmeetings DB .................................... SKIPPED
[INFO] Openmeetings Core .................................. SKIPPED
[INFO] Openmeetings MediaServer ........................... SKIPPED
[INFO] Openmeetings Install ............................... SKIPPED
[INFO] Openmeetings Service ............................... SKIPPED
[INFO] Openmeetings Webservices ........................... SKIPPED
[INFO] Openmeetings Web ................................... SKIPPED
[INFO] Openmeetings Screen Sharing applet ................. SKIPPED
[INFO] Openmeetings Server ................................ SKIPPED
[INFO] ------------------------------------------------------------------------
[INFO] BUILD FAILURE
[INFO] ------------------------------------------------------------------------
[INFO] Total time: 21.432 s
[INFO] Finished at: 2023-08-26T13:42:44Z
[INFO] ------------------------------------------------------------------------
[ERROR] Failed to execute goal org.apache.maven.plugins:maven-site-plugin:4.0.0-M9:site (generate-site) on project openmeetings-parent: Error generating maven-project-info-reports-plugin:3.4.5:dependency-convergence report: Could not build dependency tree: Could not collect dependencies: org.apache.openmeetings:openmeetings-web:war:7.2.0-SNAPSHOT: Failed to collect dependencies at de.agilecoders.wicket:wicket-bootstrap-extensions:jar:6.0.5-SNAPSHOT: Failed to read artifact descriptor for de.agilecoders.wicket:wicket-bootstrap-extensions:jar:6.0.5-SNAPSHOT: The following artifacts could not be resolved: de.agilecoders.wicket:wicket-bootstrap-extensions:pom:6.0.5-SNAPSHOT (absent): Could not transfer artifact de.agilecoders.wicket:wicket-bootstrap-extensions:pom:6.0.5-SNAPSHOT from/to sonatype-snapshots (https://oss.sonatype.org/content/repositories/snapshots/): status code: 403, reason phrase: Forbidden (403) -> [Help 1]
[ERROR]
[ERROR] To see the full stack trace of the errors, re-run Maven with the -e switch.
[ERROR] Re-run Maven using the -X switch to enable full debug logging.
[ERROR]
[ERROR] For more information about the errors and possible solutions, please read the following articles:
[ERROR] [Help 1] http://cwiki.apache.org/confluence/display/MAVEN/MojoExecutionException
Build step 'Invoke top-level Maven targets' marked build as failure
SSH: Current build result is [FAILURE], not going to run.
Archiving artifacts
Recording test results
ERROR: Step ?Publish JUnit test result report? failed: No test report files were found. Configuration error?
Build failed in Jenkins: OpenMeetings » openmeetings #293
Posted by Apache Jenkins Server <je...@builds.apache.org>.
See <https://ci-builds.apache.org/job/OpenMeetings/job/openmeetings/293/display/redirect?page=changes>
Changes:
[Maxim Solodovnik] [OPENMEETINGS-2770] jetty; code clean-up
------------------------------------------
[...truncated 3.51 KB...]
[INFO] --- clean:3.3.1:clean (default-clean) @ openmeetings-parent ---
[INFO]
[INFO] --- buildnumber:3.0.0:create (default) @ openmeetings-parent ---
[INFO] ShortRevision tag detected. The value is '7'.
[INFO] Executing: /bin/sh -c cd '<https://ci-builds.apache.org/job/OpenMeetings/job/openmeetings/ws/'> && 'git' 'rev-parse' '--verify' '--short=7' 'HEAD'
[INFO] Working directory: <https://ci-builds.apache.org/job/OpenMeetings/job/openmeetings/ws/>
[INFO] Storing buildNumber: 53f2d76 at timestamp: 1693549653485
[WARNING] Cannot get the branch information from the git repository:
Detecting the current branch failed: fatal: ref HEAD is not a symbolic ref
[INFO] ShortRevision tag detected. The value is '7'.
[INFO] Executing: /bin/sh -c cd '<https://ci-builds.apache.org/job/OpenMeetings/job/openmeetings/ws/'> && 'git' 'rev-parse' '--verify' '--short=7' 'HEAD'
[INFO] Working directory: <https://ci-builds.apache.org/job/OpenMeetings/job/openmeetings/ws/>
[INFO] Storing buildScmBranch: UNKNOWN
[INFO]
[INFO] --- apache-rat:0.15:check (default) @ openmeetings-parent ---
[INFO] Added 3 additional default licenses.
[INFO] Enabled default license matchers.
[INFO] Added 3 custom approved licenses.
[INFO] Will parse SCM ignores for exclusions...
[INFO] Parsing exclusions from <https://ci-builds.apache.org/job/OpenMeetings/job/openmeetings/ws/.gitignore>
[INFO] Finished adding exclusions from SCM ignore files.
[INFO] 83 implicit excludes.
[INFO] 9 explicit excludes.
[INFO] 11 resources included
[INFO] Rat check: Summary over all files. Unapproved: 0, unknown: 0, generated: 0, approved: 9 licenses.
[INFO]
[INFO] --- enforcer:3.3.0:enforce (enforce-versions) @ openmeetings-parent ---
[INFO] Rule 0: org.apache.maven.enforcer.rules.version.RequireJavaVersion passed
[INFO] Rule 1: org.apache.maven.enforcer.rules.version.RequireMavenVersion passed
[INFO]
[INFO] --- enforcer:3.3.0:enforce (enforce-maven-version) @ openmeetings-parent ---
[INFO] Rule 0: org.apache.maven.enforcer.rules.version.RequireMavenVersion passed
[INFO]
[INFO] --- enforcer:3.3.0:enforce (enforce-java-version) @ openmeetings-parent ---
[INFO] Rule 0: org.apache.maven.enforcer.rules.version.RequireJavaVersion passed
[INFO]
[INFO] --- jacoco:0.8.10:prepare-agent (prepare-agent) @ openmeetings-parent ---
[INFO] argLine set to -javaagent:/home/jenkins/.m2/repository/org/jacoco/org.jacoco.agent/0.8.10/org.jacoco.agent-0.8.10-runtime.jar=destfile=<https://ci-builds.apache.org/job/OpenMeetings/job/openmeetings/ws/../target/jacoco.exec,append=true>
[INFO]
[INFO] --- remote-resources:3.1.0:process (process-resource-bundles) @ openmeetings-parent ---
[INFO] Preparing remote bundle org.apache.apache.resources:apache-jar-resource-bundle:1.5
[INFO] Copying 3 resources from 1 bundle.
[INFO]
[INFO] --- site:4.0.0-M9:site (generate-site) @ openmeetings-parent ---
[INFO] Configuring report plugin maven-project-info-reports-plugin:3.4.5
[INFO] Configured 14 reports for maven-project-info-reports-plugin:3.4.5: index, ci-management, dependencies, dependency-convergence, dependency-management, distribution-management, issue-management, licenses, mailing-lists, plugin-management, plugins, team, scm, summary
[INFO] Configuring report plugin maven-checkstyle-plugin:3.3.0
[INFO] Configured 1 report for maven-checkstyle-plugin:3.3.0: checkstyle
[INFO] Configuring report plugin maven-surefire-report-plugin:3.1.2
[INFO] Configured 1 report for maven-surefire-report-plugin:3.1.2: report-only
[INFO] Configuring report plugin apache-rat-plugin:0.15
[INFO] Configured 1 report for apache-rat-plugin:0.15: rat
[INFO] Rendering site for default locale
Downloading from central: https://repo.maven.apache.org/maven2/org/apache/apache/30/apache-30-site.xml
[INFO] Relativizing site links with respect to localized project URL: https://openmeetings.apache.org
[INFO] Rendering content with io.github.devacfr.maven.skins:reflow-maven-skin:jar:2.3.4 skin
[INFO] Rendering 19 report documents
[INFO] Generating "About" report --- maven-project-info-reports-plugin:3.4.5:index
log4j:WARN No appenders could be found for logger (org.apache.commons.beanutils.converters.BooleanConverter).
log4j:WARN Please initialize the log4j system properly.
log4j:WARN See http://logging.apache.org/log4j/1.2/faq.html#noconfig for more info.
[INFO] Generating "CI Management" report --- maven-project-info-reports-plugin:3.4.5:ci-management
[INFO] Generating "Dependencies" report --- maven-project-info-reports-plugin:3.4.5:dependencies
[INFO] Generating "Dependency Convergence" report --- maven-project-info-reports-plugin:3.4.5:dependency-convergence
Downloading from sonatype-snapshots: https://oss.sonatype.org/content/repositories/snapshots/org/apache/wicket/wicket-util/9.15.0-SNAPSHOT/maven-metadata.xml
Downloading from Nexus: https://repository.apache.org/snapshots/org/apache/wicket/wicket-util/9.15.0-SNAPSHOT/maven-metadata.xml
Progress (1): 1.4 kB Downloaded from Nexus: https://repository.apache.org/snapshots/org/apache/wicket/wicket-util/9.15.0-SNAPSHOT/maven-metadata.xml (1.4 kB at 1.8 kB/s)
[WARNING] Could not transfer metadata org.apache.wicket:wicket-util:9.15.0-SNAPSHOT/maven-metadata.xml from/to sonatype-snapshots (https://oss.sonatype.org/content/repositories/snapshots/): status code: 403, reason phrase: Forbidden (403)
[WARNING] org.apache.wicket:wicket-util:9.15.0-SNAPSHOT/maven-metadata.xml failed to transfer from https://oss.sonatype.org/content/repositories/snapshots/ during a previous attempt. This failure was cached in the local repository and resolution will not be reattempted until the update interval of sonatype-snapshots has elapsed or updates are forced. Original error: Could not transfer metadata org.apache.wicket:wicket-util:9.15.0-SNAPSHOT/maven-metadata.xml from/to sonatype-snapshots (https://oss.sonatype.org/content/repositories/snapshots/): status code: 403, reason phrase: Forbidden (403)
Downloading from sonatype-snapshots: https://oss.sonatype.org/content/repositories/snapshots/org/apache/wicket/wicket-util/9.15.0-SNAPSHOT/wicket-util-9.15.0-20230826.174351-6.pom
Downloading from Nexus: https://repository.apache.org/snapshots/org/apache/wicket/wicket-util/9.15.0-SNAPSHOT/wicket-util-9.15.0-20230826.174351-6.pom
Progress (1): 2.3 kB Downloaded from Nexus: https://repository.apache.org/snapshots/org/apache/wicket/wicket-util/9.15.0-SNAPSHOT/wicket-util-9.15.0-20230826.174351-6.pom (2.3 kB at 12 kB/s)
Downloading from sonatype-snapshots: https://oss.sonatype.org/content/repositories/snapshots/org/apache/wicket/wicket-parent/9.15.0-SNAPSHOT/maven-metadata.xml
Downloading from Nexus: https://repository.apache.org/snapshots/org/apache/wicket/wicket-parent/9.15.0-SNAPSHOT/maven-metadata.xml
Progress (1): 609 B Downloaded from Nexus: https://repository.apache.org/snapshots/org/apache/wicket/wicket-parent/9.15.0-SNAPSHOT/maven-metadata.xml (609 B at 1.7 kB/s)
[WARNING] Could not transfer metadata org.apache.wicket:wicket-parent:9.15.0-SNAPSHOT/maven-metadata.xml from/to sonatype-snapshots (https://oss.sonatype.org/content/repositories/snapshots/): status code: 403, reason phrase: Forbidden (403)
Downloading from Nexus: https://repository.apache.org/snapshots/org/apache/wicket/wicket-parent/9.15.0-SNAPSHOT/wicket-parent-9.15.0-20230826.174351-6.pom
Progress (1): 7.8/51 kBProgress (1): 8.2/51 kBProgress (1): 16/51 kB Progress (1): 24/51 kBProgress (1): 25/51 kBProgress (1): 33/51 kBProgress (1): 40/51 kBProgress (1): 41/51 kBProgress (1): 49/51 kBProgress (1): 51 kB Downloaded from Nexus: https://repository.apache.org/snapshots/org/apache/wicket/wicket-parent/9.15.0-SNAPSHOT/wicket-parent-9.15.0-20230826.174351-6.pom (51 kB at 96 kB/s)
Downloading from sonatype-snapshots: https://oss.sonatype.org/content/repositories/snapshots/org/apache/wicket/wicket-native-websocket-core/9.15.0-SNAPSHOT/maven-metadata.xml
Downloading from Nexus: https://repository.apache.org/snapshots/org/apache/wicket/wicket-native-websocket-core/9.15.0-SNAPSHOT/maven-metadata.xml
Progress (1): 1.4 kB Downloaded from Nexus: https://repository.apache.org/snapshots/org/apache/wicket/wicket-native-websocket-core/9.15.0-SNAPSHOT/maven-metadata.xml (1.4 kB at 3.1 kB/s)
[WARNING] Could not transfer metadata org.apache.wicket:wicket-native-websocket-core:9.15.0-SNAPSHOT/maven-metadata.xml from/to sonatype-snapshots (https://oss.sonatype.org/content/repositories/snapshots/): status code: 403, reason phrase: Forbidden (403)
[WARNING] org.apache.wicket:wicket-native-websocket-core:9.15.0-SNAPSHOT/maven-metadata.xml failed to transfer from https://oss.sonatype.org/content/repositories/snapshots/ during a previous attempt. This failure was cached in the local repository and resolution will not be reattempted until the update interval of sonatype-snapshots has elapsed or updates are forced. Original error: Could not transfer metadata org.apache.wicket:wicket-native-websocket-core:9.15.0-SNAPSHOT/maven-metadata.xml from/to sonatype-snapshots (https://oss.sonatype.org/content/repositories/snapshots/): status code: 403, reason phrase: Forbidden (403)
Downloading from sonatype-snapshots: https://oss.sonatype.org/content/repositories/snapshots/org/apache/wicket/wicket-native-websocket-core/9.15.0-SNAPSHOT/wicket-native-websocket-core-9.15.0-20230826.174351-5.pom
Downloading from Nexus: https://repository.apache.org/snapshots/org/apache/wicket/wicket-native-websocket-core/9.15.0-SNAPSHOT/wicket-native-websocket-core-9.15.0-20230826.174351-5.pom
Progress (1): 2.1 kB Downloaded from Nexus: https://repository.apache.org/snapshots/org/apache/wicket/wicket-native-websocket-core/9.15.0-SNAPSHOT/wicket-native-websocket-core-9.15.0-20230826.174351-5.pom (2.1 kB at 12 kB/s)
Downloading from Nexus: https://repository.apache.org/snapshots/org/apache/wicket/wicket-native-websocket/9.15.0-SNAPSHOT/maven-metadata.xml
Downloading from sonatype-snapshots: https://oss.sonatype.org/content/repositories/snapshots/org/apache/wicket/wicket-native-websocket/9.15.0-SNAPSHOT/maven-metadata.xml
Progress (1): 619 B Downloaded from Nexus: https://repository.apache.org/snapshots/org/apache/wicket/wicket-native-websocket/9.15.0-SNAPSHOT/maven-metadata.xml (619 B at 1.4 kB/s)
[WARNING] Could not transfer metadata org.apache.wicket:wicket-native-websocket:9.15.0-SNAPSHOT/maven-metadata.xml from/to sonatype-snapshots (https://oss.sonatype.org/content/repositories/snapshots/): status code: 403, reason phrase: Forbidden (403)
Downloading from Nexus: https://repository.apache.org/snapshots/org/apache/wicket/wicket-native-websocket/9.15.0-SNAPSHOT/wicket-native-websocket-9.15.0-20230826.174351-5.pom
Progress (1): 1.6 kB Downloaded from Nexus: https://repository.apache.org/snapshots/org/apache/wicket/wicket-native-websocket/9.15.0-SNAPSHOT/wicket-native-websocket-9.15.0-20230826.174351-5.pom (1.6 kB at 9.0 kB/s)
Downloading from Nexus: https://repository.apache.org/snapshots/org/apache/wicket/wicket-core/9.15.0-SNAPSHOT/maven-metadata.xml
Downloading from sonatype-snapshots: https://oss.sonatype.org/content/repositories/snapshots/org/apache/wicket/wicket-core/9.15.0-SNAPSHOT/maven-metadata.xml
Progress (1): 1.4 kB Downloaded from Nexus: https://repository.apache.org/snapshots/org/apache/wicket/wicket-core/9.15.0-SNAPSHOT/maven-metadata.xml (1.4 kB at 3.8 kB/s)
[WARNING] Could not transfer metadata org.apache.wicket:wicket-core:9.15.0-SNAPSHOT/maven-metadata.xml from/to sonatype-snapshots (https://oss.sonatype.org/content/repositories/snapshots/): status code: 403, reason phrase: Forbidden (403)
[WARNING] org.apache.wicket:wicket-core:9.15.0-SNAPSHOT/maven-metadata.xml failed to transfer from https://oss.sonatype.org/content/repositories/snapshots/ during a previous attempt. This failure was cached in the local repository and resolution will not be reattempted until the update interval of sonatype-snapshots has elapsed or updates are forced. Original error: Could not transfer metadata org.apache.wicket:wicket-core:9.15.0-SNAPSHOT/maven-metadata.xml from/to sonatype-snapshots (https://oss.sonatype.org/content/repositories/snapshots/): status code: 403, reason phrase: Forbidden (403)
Downloading from sonatype-snapshots: https://oss.sonatype.org/content/repositories/snapshots/org/apache/wicket/wicket-core/9.15.0-SNAPSHOT/wicket-core-9.15.0-20230826.174351-5.pom
Downloading from Nexus: https://repository.apache.org/snapshots/org/apache/wicket/wicket-core/9.15.0-SNAPSHOT/wicket-core-9.15.0-20230826.174351-5.pom
Progress (1): 7.8/9.1 kBProgress (1): 8.2/9.1 kBProgress (1): 9.1 kB Downloaded from Nexus: https://repository.apache.org/snapshots/org/apache/wicket/wicket-core/9.15.0-SNAPSHOT/wicket-core-9.15.0-20230826.174351-5.pom (9.1 kB at 50 kB/s)
Downloading from central: https://repo.maven.apache.org/maven2/com/github/openjson/openjson/1.0.13/openjson-1.0.13.pom
Progress (1): 1.4/9.4 kBProgress (1): 2.7/9.4 kBProgress (1): 4.1/9.4 kBProgress (1): 5.5/9.4 kBProgress (1): 6.9/9.4 kBProgress (1): 8.2/9.4 kBProgress (1): 9.4 kB Downloaded from central: https://repo.maven.apache.org/maven2/com/github/openjson/openjson/1.0.13/openjson-1.0.13.pom (9.4 kB at 112 kB/s)
Downloading from Nexus: https://repository.apache.org/snapshots/org/apache/wicket/wicket-request/9.15.0-SNAPSHOT/maven-metadata.xml
Downloading from sonatype-snapshots: https://oss.sonatype.org/content/repositories/snapshots/org/apache/wicket/wicket-request/9.15.0-SNAPSHOT/maven-metadata.xml
Progress (1): 1.4 kB Downloaded from Nexus: https://repository.apache.org/snapshots/org/apache/wicket/wicket-request/9.15.0-SNAPSHOT/maven-metadata.xml (1.4 kB at 3.4 kB/s)
[WARNING] Could not transfer metadata org.apache.wicket:wicket-request:9.15.0-SNAPSHOT/maven-metadata.xml from/to sonatype-snapshots (https://oss.sonatype.org/content/repositories/snapshots/): status code: 403, reason phrase: Forbidden (403)
[WARNING] org.apache.wicket:wicket-request:9.15.0-SNAPSHOT/maven-metadata.xml failed to transfer from https://oss.sonatype.org/content/repositories/snapshots/ during a previous attempt. This failure was cached in the local repository and resolution will not be reattempted until the update interval of sonatype-snapshots has elapsed or updates are forced. Original error: Could not transfer metadata org.apache.wicket:wicket-request:9.15.0-SNAPSHOT/maven-metadata.xml from/to sonatype-snapshots (https://oss.sonatype.org/content/repositories/snapshots/): status code: 403, reason phrase: Forbidden (403)
Downloading from sonatype-snapshots: https://oss.sonatype.org/content/repositories/snapshots/org/apache/wicket/wicket-request/9.15.0-SNAPSHOT/wicket-request-9.15.0-20230826.174351-6.pom
Downloading from Nexus: https://repository.apache.org/snapshots/org/apache/wicket/wicket-request/9.15.0-SNAPSHOT/wicket-request-9.15.0-20230826.174351-6.pom
Progress (1): 1.9 kB Downloaded from Nexus: https://repository.apache.org/snapshots/org/apache/wicket/wicket-request/9.15.0-SNAPSHOT/wicket-request-9.15.0-20230826.174351-6.pom (1.9 kB at 11 kB/s)
Downloading from sonatype-snapshots: https://oss.sonatype.org/content/repositories/snapshots/org/apache/wicket/wicket-extensions/9.15.0-SNAPSHOT/maven-metadata.xml
Downloading from Nexus: https://repository.apache.org/snapshots/org/apache/wicket/wicket-extensions/9.15.0-SNAPSHOT/maven-metadata.xml
Progress (1): 1.4 kB Downloaded from Nexus: https://repository.apache.org/snapshots/org/apache/wicket/wicket-extensions/9.15.0-SNAPSHOT/maven-metadata.xml (1.4 kB at 3.1 kB/s)
[WARNING] Could not transfer metadata org.apache.wicket:wicket-extensions:9.15.0-SNAPSHOT/maven-metadata.xml from/to sonatype-snapshots (https://oss.sonatype.org/content/repositories/snapshots/): status code: 403, reason phrase: Forbidden (403)
[WARNING] org.apache.wicket:wicket-extensions:9.15.0-SNAPSHOT/maven-metadata.xml failed to transfer from https://oss.sonatype.org/content/repositories/snapshots/ during a previous attempt. This failure was cached in the local repository and resolution will not be reattempted until the update interval of sonatype-snapshots has elapsed or updates are forced. Original error: Could not transfer metadata org.apache.wicket:wicket-extensions:9.15.0-SNAPSHOT/maven-metadata.xml from/to sonatype-snapshots (https://oss.sonatype.org/content/repositories/snapshots/): status code: 403, reason phrase: Forbidden (403)
Downloading from sonatype-snapshots: https://oss.sonatype.org/content/repositories/snapshots/org/apache/wicket/wicket-extensions/9.15.0-SNAPSHOT/wicket-extensions-9.15.0-20230826.174351-5.pom
Downloading from Nexus: https://repository.apache.org/snapshots/org/apache/wicket/wicket-extensions/9.15.0-SNAPSHOT/wicket-extensions-9.15.0-20230826.174351-5.pom
Progress (1): 2.2 kB Downloaded from Nexus: https://repository.apache.org/snapshots/org/apache/wicket/wicket-extensions/9.15.0-SNAPSHOT/wicket-extensions-9.15.0-20230826.174351-5.pom (2.2 kB at 12 kB/s)
Downloading from central: https://repo.maven.apache.org/maven2/org/apache/james/apache-mime4j-core/0.8.9/apache-mime4j-core-0.8.9.pom
Progress (1): 1.4/2.2 kBProgress (1): 2.2 kB Downloaded from central: https://repo.maven.apache.org/maven2/org/apache/james/apache-mime4j-core/0.8.9/apache-mime4j-core-0.8.9.pom (2.2 kB at 62 kB/s)
Downloading from central: https://repo.maven.apache.org/maven2/org/apache/james/apache-mime4j-project/0.8.9/apache-mime4j-project-0.8.9.pom
Progress (1): 1.4/11 kBProgress (1): 2.7/11 kBProgress (1): 4.1/11 kBProgress (1): 5.5/11 kBProgress (1): 6.9/11 kBProgress (1): 8.2/11 kBProgress (1): 9.6/11 kBProgress (1): 11/11 kB Progress (1): 11 kB Downloaded from central: https://repo.maven.apache.org/maven2/org/apache/james/apache-mime4j-project/0.8.9/apache-mime4j-project-0.8.9.pom (11 kB at 286 kB/s)
Downloading from central: https://repo.maven.apache.org/maven2/org/apache/james/apache-mime4j-dom/0.8.9/apache-mime4j-dom-0.8.9.pom
Progress (1): 1.4/3.5 kBProgress (1): 2.7/3.5 kBProgress (1): 3.5 kB Downloaded from central: https://repo.maven.apache.org/maven2/org/apache/james/apache-mime4j-dom/0.8.9/apache-mime4j-dom-0.8.9.pom (3.5 kB at 96 kB/s)
Downloading from sonatype-snapshots: https://oss.sonatype.org/content/repositories/snapshots/org/apache/openmeetings/openmeetings-util/7.2.0-SNAPSHOT/maven-metadata.xml
Downloading from Nexus: https://repository.apache.org/snapshots/org/apache/openmeetings/openmeetings-util/7.2.0-SNAPSHOT/maven-metadata.xml
[WARNING] Could not transfer metadata org.apache.openmeetings:openmeetings-util:7.2.0-SNAPSHOT/maven-metadata.xml from/to sonatype-snapshots (https://oss.sonatype.org/content/repositories/snapshots/): status code: 403, reason phrase: Forbidden (403)
Downloading from sonatype-snapshots: https://oss.sonatype.org/content/repositories/snapshots/org/apache/wicket/wicket-devutils/9.15.0-SNAPSHOT/maven-metadata.xml
Downloading from wicket-snapshots: https://repository.apache.org/content/repositories/snapshots/org/apache/wicket/wicket-devutils/9.15.0-SNAPSHOT/maven-metadata.xml
Downloading from Nexus: https://repository.apache.org/snapshots/org/apache/wicket/wicket-devutils/9.15.0-SNAPSHOT/maven-metadata.xml
Downloading from sonatype-nexus-snapshots: https://oss.sonatype.org/content/repositories/snapshots/org/apache/wicket/wicket-devutils/9.15.0-SNAPSHOT/maven-metadata.xml
Progress (1): 1.4 kB Downloaded from wicket-snapshots: https://repository.apache.org/content/repositories/snapshots/org/apache/wicket/wicket-devutils/9.15.0-SNAPSHOT/maven-metadata.xml (1.4 kB at 7.9 kB/s)
Progress (1): 1.4 kB Downloaded from Nexus: https://repository.apache.org/snapshots/org/apache/wicket/wicket-devutils/9.15.0-SNAPSHOT/maven-metadata.xml (1.4 kB at 1.7 kB/s)
[WARNING] Could not transfer metadata org.apache.wicket:wicket-devutils:9.15.0-SNAPSHOT/maven-metadata.xml from/to sonatype-snapshots (https://oss.sonatype.org/content/repositories/snapshots/): status code: 403, reason phrase: Forbidden (403)
[WARNING] Could not transfer metadata org.apache.wicket:wicket-devutils:9.15.0-SNAPSHOT/maven-metadata.xml from/to sonatype-nexus-snapshots (https://oss.sonatype.org/content/repositories/snapshots): status code: 403, reason phrase: Forbidden (403)
[WARNING] org.apache.wicket:wicket-devutils:9.15.0-SNAPSHOT/maven-metadata.xml failed to transfer from https://oss.sonatype.org/content/repositories/snapshots/ during a previous attempt. This failure was cached in the local repository and resolution will not be reattempted until the update interval of sonatype-snapshots has elapsed or updates are forced. Original error: Could not transfer metadata org.apache.wicket:wicket-devutils:9.15.0-SNAPSHOT/maven-metadata.xml from/to sonatype-snapshots (https://oss.sonatype.org/content/repositories/snapshots/): status code: 403, reason phrase: Forbidden (403)
[WARNING] org.apache.wicket:wicket-devutils:9.15.0-SNAPSHOT/maven-metadata.xml failed to transfer from https://oss.sonatype.org/content/repositories/snapshots during a previous attempt. This failure was cached in the local repository and resolution will not be reattempted until the update interval of sonatype-nexus-snapshots has elapsed or updates are forced. Original error: Could not transfer metadata org.apache.wicket:wicket-devutils:9.15.0-SNAPSHOT/maven-metadata.xml from/to sonatype-nexus-snapshots (https://oss.sonatype.org/content/repositories/snapshots): status code: 403, reason phrase: Forbidden (403)
Downloading from sonatype-snapshots: https://oss.sonatype.org/content/repositories/snapshots/org/apache/wicket/wicket-devutils/9.15.0-SNAPSHOT/wicket-devutils-9.15.0-20230826.174351-5.pom
Downloading from Nexus: https://repository.apache.org/snapshots/org/apache/wicket/wicket-devutils/9.15.0-SNAPSHOT/wicket-devutils-9.15.0-20230826.174351-5.pom
Progress (1): 2.1 kB Downloaded from Nexus: https://repository.apache.org/snapshots/org/apache/wicket/wicket-devutils/9.15.0-SNAPSHOT/wicket-devutils-9.15.0-20230826.174351-5.pom (2.1 kB at 11 kB/s)
[WARNING] org.apache.openmeetings:openmeetings-util:7.2.0-SNAPSHOT/maven-metadata.xml failed to transfer from https://oss.sonatype.org/content/repositories/snapshots/ during a previous attempt. This failure was cached in the local repository and resolution will not be reattempted until the update interval of sonatype-snapshots has elapsed or updates are forced. Original error: Could not transfer metadata org.apache.openmeetings:openmeetings-util:7.2.0-SNAPSHOT/maven-metadata.xml from/to sonatype-snapshots (https://oss.sonatype.org/content/repositories/snapshots/): status code: 403, reason phrase: Forbidden (403)
Downloading from sonatype-snapshots: https://oss.sonatype.org/content/repositories/snapshots/org/apache/openmeetings/openmeetings-db/7.2.0-SNAPSHOT/maven-metadata.xml
Downloading from Nexus: https://repository.apache.org/snapshots/org/apache/openmeetings/openmeetings-db/7.2.0-SNAPSHOT/maven-metadata.xml
[WARNING] Could not transfer metadata org.apache.openmeetings:openmeetings-db:7.2.0-SNAPSHOT/maven-metadata.xml from/to sonatype-snapshots (https://oss.sonatype.org/content/repositories/snapshots/): status code: 403, reason phrase: Forbidden (403)
Downloading from sonatype-snapshots: https://oss.sonatype.org/content/repositories/snapshots/org/apache/wicket/wicket-ioc/9.15.0-SNAPSHOT/maven-metadata.xml
Downloading from Nexus: https://repository.apache.org/snapshots/org/apache/wicket/wicket-ioc/9.15.0-SNAPSHOT/maven-metadata.xml
Progress (1): 1.4 kB Downloaded from Nexus: https://repository.apache.org/snapshots/org/apache/wicket/wicket-ioc/9.15.0-SNAPSHOT/maven-metadata.xml (1.4 kB at 3.8 kB/s)
[WARNING] Could not transfer metadata org.apache.wicket:wicket-ioc:9.15.0-SNAPSHOT/maven-metadata.xml from/to sonatype-snapshots (https://oss.sonatype.org/content/repositories/snapshots/): status code: 403, reason phrase: Forbidden (403)
[WARNING] org.apache.wicket:wicket-ioc:9.15.0-SNAPSHOT/maven-metadata.xml failed to transfer from https://oss.sonatype.org/content/repositories/snapshots/ during a previous attempt. This failure was cached in the local repository and resolution will not be reattempted until the update interval of sonatype-snapshots has elapsed or updates are forced. Original error: Could not transfer metadata org.apache.wicket:wicket-ioc:9.15.0-SNAPSHOT/maven-metadata.xml from/to sonatype-snapshots (https://oss.sonatype.org/content/repositories/snapshots/): status code: 403, reason phrase: Forbidden (403)
Downloading from sonatype-snapshots: https://oss.sonatype.org/content/repositories/snapshots/org/apache/wicket/wicket-ioc/9.15.0-SNAPSHOT/wicket-ioc-9.15.0-20230826.174351-5.pom
Downloading from Nexus: https://repository.apache.org/snapshots/org/apache/wicket/wicket-ioc/9.15.0-SNAPSHOT/wicket-ioc-9.15.0-20230826.174351-5.pom
Progress (1): 2.6 kB Downloaded from Nexus: https://repository.apache.org/snapshots/org/apache/wicket/wicket-ioc/9.15.0-SNAPSHOT/wicket-ioc-9.15.0-20230826.174351-5.pom (2.6 kB at 14 kB/s)
Downloading from sonatype-snapshots: https://oss.sonatype.org/content/repositories/snapshots/org/apache/openmeetings/openmeetings-core/7.2.0-SNAPSHOT/maven-metadata.xml
Downloading from Nexus: https://repository.apache.org/snapshots/org/apache/openmeetings/openmeetings-core/7.2.0-SNAPSHOT/maven-metadata.xml
[WARNING] Could not transfer metadata org.apache.openmeetings:openmeetings-core:7.2.0-SNAPSHOT/maven-metadata.xml from/to sonatype-snapshots (https://oss.sonatype.org/content/repositories/snapshots/): status code: 403, reason phrase: Forbidden (403)
Downloading from Nexus: https://repository.apache.org/snapshots/org/kurento/kms-api-core/maven-metadata.xml
Downloading from sonatype-snapshots: https://oss.sonatype.org/content/repositories/snapshots/org/kurento/kms-api-core/maven-metadata.xml
Downloading from central: https://repo.maven.apache.org/maven2/org/kurento/kms-api-core/maven-metadata.xml
Progress (1): 1.1 kB Downloaded from central: https://repo.maven.apache.org/maven2/org/kurento/kms-api-core/maven-metadata.xml (1.1 kB at 31 kB/s)
[WARNING] Could not transfer metadata org.kurento:kms-api-core/maven-metadata.xml from/to sonatype-snapshots (https://oss.sonatype.org/content/repositories/snapshots/): status code: 403, reason phrase: Forbidden (403)
Downloading from sonatype-snapshots: https://oss.sonatype.org/content/repositories/snapshots/org/kurento/kms-api-elements/maven-metadata.xml
Downloading from Nexus: https://repository.apache.org/snapshots/org/kurento/kms-api-elements/maven-metadata.xml
Downloading from central: https://repo.maven.apache.org/maven2/org/kurento/kms-api-elements/maven-metadata.xml
Progress (1): 1.1 kB Downloaded from central: https://repo.maven.apache.org/maven2/org/kurento/kms-api-elements/maven-metadata.xml (1.1 kB at 33 kB/s)
[WARNING] Could not transfer metadata org.kurento:kms-api-elements/maven-metadata.xml from/to sonatype-snapshots (https://oss.sonatype.org/content/repositories/snapshots/): status code: 403, reason phrase: Forbidden (403)
Downloading from sonatype-snapshots: https://oss.sonatype.org/content/repositories/snapshots/org/apache/wicket/wicket-spring/9.15.0-SNAPSHOT/maven-metadata.xml
Downloading from Nexus: https://repository.apache.org/snapshots/org/apache/wicket/wicket-spring/9.15.0-SNAPSHOT/maven-metadata.xml
Progress (1): 1.4 kB Downloaded from Nexus: https://repository.apache.org/snapshots/org/apache/wicket/wicket-spring/9.15.0-SNAPSHOT/maven-metadata.xml (1.4 kB at 2.6 kB/s)
[WARNING] Could not transfer metadata org.apache.wicket:wicket-spring:9.15.0-SNAPSHOT/maven-metadata.xml from/to sonatype-snapshots (https://oss.sonatype.org/content/repositories/snapshots/): status code: 403, reason phrase: Forbidden (403)
[WARNING] org.apache.wicket:wicket-spring:9.15.0-SNAPSHOT/maven-metadata.xml failed to transfer from https://oss.sonatype.org/content/repositories/snapshots/ during a previous attempt. This failure was cached in the local repository and resolution will not be reattempted until the update interval of sonatype-snapshots has elapsed or updates are forced. Original error: Could not transfer metadata org.apache.wicket:wicket-spring:9.15.0-SNAPSHOT/maven-metadata.xml from/to sonatype-snapshots (https://oss.sonatype.org/content/repositories/snapshots/): status code: 403, reason phrase: Forbidden (403)
Downloading from sonatype-snapshots: https://oss.sonatype.org/content/repositories/snapshots/org/apache/wicket/wicket-spring/9.15.0-SNAPSHOT/wicket-spring-9.15.0-20230826.174351-5.pom
Downloading from Nexus: https://repository.apache.org/snapshots/org/apache/wicket/wicket-spring/9.15.0-SNAPSHOT/wicket-spring-9.15.0-20230826.174351-5.pom
Progress (1): 2.5 kB Downloaded from Nexus: https://repository.apache.org/snapshots/org/apache/wicket/wicket-spring/9.15.0-SNAPSHOT/wicket-spring-9.15.0-20230826.174351-5.pom (2.5 kB at 14 kB/s)
Downloading from Nexus: https://repository.apache.org/snapshots/org/apache/openmeetings/openmeetings-service/7.2.0-SNAPSHOT/maven-metadata.xml
Downloading from sonatype-snapshots: https://oss.sonatype.org/content/repositories/snapshots/org/apache/openmeetings/openmeetings-service/7.2.0-SNAPSHOT/maven-metadata.xml
[WARNING] Could not transfer metadata org.apache.openmeetings:openmeetings-service:7.2.0-SNAPSHOT/maven-metadata.xml from/to sonatype-snapshots (https://oss.sonatype.org/content/repositories/snapshots/): status code: 403, reason phrase: Forbidden (403)
Downloading from Nexus: https://repository.apache.org/snapshots/org/apache/openmeetings/openmeetings-install/7.2.0-SNAPSHOT/maven-metadata.xml
Downloading from sonatype-snapshots: https://oss.sonatype.org/content/repositories/snapshots/org/apache/openmeetings/openmeetings-install/7.2.0-SNAPSHOT/maven-metadata.xml
[WARNING] Could not transfer metadata org.apache.openmeetings:openmeetings-install:7.2.0-SNAPSHOT/maven-metadata.xml from/to sonatype-snapshots (https://oss.sonatype.org/content/repositories/snapshots/): status code: 403, reason phrase: Forbidden (403)
Downloading from sonatype-snapshots: https://oss.sonatype.org/content/repositories/snapshots/org/apache/openmeetings/openmeetings-mediaserver/7.2.0-SNAPSHOT/maven-metadata.xml
Downloading from Nexus: https://repository.apache.org/snapshots/org/apache/openmeetings/openmeetings-mediaserver/7.2.0-SNAPSHOT/maven-metadata.xml
[WARNING] Could not transfer metadata org.apache.openmeetings:openmeetings-mediaserver:7.2.0-SNAPSHOT/maven-metadata.xml from/to sonatype-snapshots (https://oss.sonatype.org/content/repositories/snapshots/): status code: 403, reason phrase: Forbidden (403)
[WARNING] org.kurento:kms-api-core/maven-metadata.xml failed to transfer from https://oss.sonatype.org/content/repositories/snapshots/ during a previous attempt. This failure was cached in the local repository and resolution will not be reattempted until the update interval of sonatype-snapshots has elapsed or updates are forced. Original error: Could not transfer metadata org.kurento:kms-api-core/maven-metadata.xml from/to sonatype-snapshots (https://oss.sonatype.org/content/repositories/snapshots/): status code: 403, reason phrase: Forbidden (403)
[WARNING] org.kurento:kms-api-elements/maven-metadata.xml failed to transfer from https://oss.sonatype.org/content/repositories/snapshots/ during a previous attempt. This failure was cached in the local repository and resolution will not be reattempted until the update interval of sonatype-snapshots has elapsed or updates are forced. Original error: Could not transfer metadata org.kurento:kms-api-elements/maven-metadata.xml from/to sonatype-snapshots (https://oss.sonatype.org/content/repositories/snapshots/): status code: 403, reason phrase: Forbidden (403)
Downloading from sonatype-snapshots: https://oss.sonatype.org/content/repositories/snapshots/org/apache/openmeetings/openmeetings-webservice/7.2.0-SNAPSHOT/maven-metadata.xml
Downloading from Nexus: https://repository.apache.org/snapshots/org/apache/openmeetings/openmeetings-webservice/7.2.0-SNAPSHOT/maven-metadata.xml
[WARNING] Could not transfer metadata org.apache.openmeetings:openmeetings-webservice:7.2.0-SNAPSHOT/maven-metadata.xml from/to sonatype-snapshots (https://oss.sonatype.org/content/repositories/snapshots/): status code: 403, reason phrase: Forbidden (403)
Downloading from sonatype-snapshots: https://oss.sonatype.org/content/repositories/snapshots/org/apache/wicket/wicket-auth-roles/9.15.0-SNAPSHOT/maven-metadata.xml
Downloading from Nexus: https://repository.apache.org/snapshots/org/apache/wicket/wicket-auth-roles/9.15.0-SNAPSHOT/maven-metadata.xml
Progress (1): 1.4 kB Downloaded from Nexus: https://repository.apache.org/snapshots/org/apache/wicket/wicket-auth-roles/9.15.0-SNAPSHOT/maven-metadata.xml (1.4 kB at 3.1 kB/s)
[WARNING] Could not transfer metadata org.apache.wicket:wicket-auth-roles:9.15.0-SNAPSHOT/maven-metadata.xml from/to sonatype-snapshots (https://oss.sonatype.org/content/repositories/snapshots/): status code: 403, reason phrase: Forbidden (403)
[WARNING] org.apache.wicket:wicket-auth-roles:9.15.0-SNAPSHOT/maven-metadata.xml failed to transfer from https://oss.sonatype.org/content/repositories/snapshots/ during a previous attempt. This failure was cached in the local repository and resolution will not be reattempted until the update interval of sonatype-snapshots has elapsed or updates are forced. Original error: Could not transfer metadata org.apache.wicket:wicket-auth-roles:9.15.0-SNAPSHOT/maven-metadata.xml from/to sonatype-snapshots (https://oss.sonatype.org/content/repositories/snapshots/): status code: 403, reason phrase: Forbidden (403)
Downloading from sonatype-snapshots: https://oss.sonatype.org/content/repositories/snapshots/org/apache/wicket/wicket-auth-roles/9.15.0-SNAPSHOT/wicket-auth-roles-9.15.0-20230826.174351-5.pom
Downloading from Nexus: https://repository.apache.org/snapshots/org/apache/wicket/wicket-auth-roles/9.15.0-SNAPSHOT/wicket-auth-roles-9.15.0-20230826.174351-5.pom
Progress (1): 1.9 kB Downloaded from Nexus: https://repository.apache.org/snapshots/org/apache/wicket/wicket-auth-roles/9.15.0-SNAPSHOT/wicket-auth-roles-9.15.0-20230826.174351-5.pom (1.9 kB at 10 kB/s)
Downloading from sonatype-snapshots: https://oss.sonatype.org/content/repositories/snapshots/org/apache/wicket/wicket-native-websocket-javax/9.15.0-SNAPSHOT/maven-metadata.xml
Downloading from Nexus: https://repository.apache.org/snapshots/org/apache/wicket/wicket-native-websocket-javax/9.15.0-SNAPSHOT/maven-metadata.xml
Progress (1): 1.4 kB Downloaded from Nexus: https://repository.apache.org/snapshots/org/apache/wicket/wicket-native-websocket-javax/9.15.0-SNAPSHOT/maven-metadata.xml (1.4 kB at 3.9 kB/s)
[WARNING] Could not transfer metadata org.apache.wicket:wicket-native-websocket-javax:9.15.0-SNAPSHOT/maven-metadata.xml from/to sonatype-snapshots (https://oss.sonatype.org/content/repositories/snapshots/): status code: 403, reason phrase: Forbidden (403)
[WARNING] org.apache.wicket:wicket-native-websocket-javax:9.15.0-SNAPSHOT/maven-metadata.xml failed to transfer from https://oss.sonatype.org/content/repositories/snapshots/ during a previous attempt. This failure was cached in the local repository and resolution will not be reattempted until the update interval of sonatype-snapshots has elapsed or updates are forced. Original error: Could not transfer metadata org.apache.wicket:wicket-native-websocket-javax:9.15.0-SNAPSHOT/maven-metadata.xml from/to sonatype-snapshots (https://oss.sonatype.org/content/repositories/snapshots/): status code: 403, reason phrase: Forbidden (403)
Downloading from sonatype-snapshots: https://oss.sonatype.org/content/repositories/snapshots/org/apache/wicket/wicket-native-websocket-javax/9.15.0-SNAPSHOT/wicket-native-websocket-javax-9.15.0-20230826.174351-5.pom
Downloading from Nexus: https://repository.apache.org/snapshots/org/apache/wicket/wicket-native-websocket-javax/9.15.0-SNAPSHOT/wicket-native-websocket-javax-9.15.0-20230826.174351-5.pom
Progress (1): 2.6 kB Downloaded from Nexus: https://repository.apache.org/snapshots/org/apache/wicket/wicket-native-websocket-javax/9.15.0-SNAPSHOT/wicket-native-websocket-javax-9.15.0-20230826.174351-5.pom (2.6 kB at 14 kB/s)
Downloading from sonatype-snapshots: https://oss.sonatype.org/content/repositories/snapshots/de/agilecoders/wicket/wicket-bootstrap-extensions/6.0.5-SNAPSHOT/maven-metadata.xml
Downloading from Nexus: https://repository.apache.org/snapshots/de/agilecoders/wicket/wicket-bootstrap-extensions/6.0.5-SNAPSHOT/maven-metadata.xml
[WARNING] Could not transfer metadata de.agilecoders.wicket:wicket-bootstrap-extensions:6.0.5-SNAPSHOT/maven-metadata.xml from/to sonatype-snapshots (https://oss.sonatype.org/content/repositories/snapshots/): status code: 403, reason phrase: Forbidden (403)
[WARNING] de.agilecoders.wicket:wicket-bootstrap-extensions:6.0.5-SNAPSHOT/maven-metadata.xml failed to transfer from https://oss.sonatype.org/content/repositories/snapshots/ during a previous attempt. This failure was cached in the local repository and resolution will not be reattempted until the update interval of sonatype-snapshots has elapsed or updates are forced. Original error: Could not transfer metadata de.agilecoders.wicket:wicket-bootstrap-extensions:6.0.5-SNAPSHOT/maven-metadata.xml from/to sonatype-snapshots (https://oss.sonatype.org/content/repositories/snapshots/): status code: 403, reason phrase: Forbidden (403)
Downloading from sonatype-snapshots: https://oss.sonatype.org/content/repositories/snapshots/de/agilecoders/wicket/wicket-bootstrap-extensions/6.0.5-SNAPSHOT/wicket-bootstrap-extensions-6.0.5-SNAPSHOT.pom
Downloading from Nexus: https://repository.apache.org/snapshots/de/agilecoders/wicket/wicket-bootstrap-extensions/6.0.5-SNAPSHOT/wicket-bootstrap-extensions-6.0.5-SNAPSHOT.pom
Downloading from Nexus: https://repository.apache.org/snapshots/de/agilecoders/wicket/wicket-bootstrap-themes/6.0.5-SNAPSHOT/maven-metadata.xml
Downloading from sonatype-snapshots: https://oss.sonatype.org/content/repositories/snapshots/de/agilecoders/wicket/wicket-bootstrap-themes/6.0.5-SNAPSHOT/maven-metadata.xml
[WARNING] Could not transfer metadata de.agilecoders.wicket:wicket-bootstrap-themes:6.0.5-SNAPSHOT/maven-metadata.xml from/to sonatype-snapshots (https://oss.sonatype.org/content/repositories/snapshots/): status code: 403, reason phrase: Forbidden (403)
[WARNING] de.agilecoders.wicket:wicket-bootstrap-themes:6.0.5-SNAPSHOT/maven-metadata.xml failed to transfer from https://oss.sonatype.org/content/repositories/snapshots/ during a previous attempt. This failure was cached in the local repository and resolution will not be reattempted until the update interval of sonatype-snapshots has elapsed or updates are forced. Original error: Could not transfer metadata de.agilecoders.wicket:wicket-bootstrap-themes:6.0.5-SNAPSHOT/maven-metadata.xml from/to sonatype-snapshots (https://oss.sonatype.org/content/repositories/snapshots/): status code: 403, reason phrase: Forbidden (403)
Downloading from sonatype-snapshots: https://oss.sonatype.org/content/repositories/snapshots/de/agilecoders/wicket/wicket-bootstrap-themes/6.0.5-SNAPSHOT/wicket-bootstrap-themes-6.0.5-SNAPSHOT.pom
Downloading from Nexus: https://repository.apache.org/snapshots/de/agilecoders/wicket/wicket-bootstrap-themes/6.0.5-SNAPSHOT/wicket-bootstrap-themes-6.0.5-SNAPSHOT.pom
[WARNING] org.apache.openmeetings:openmeetings-core:7.2.0-SNAPSHOT/maven-metadata.xml failed to transfer from https://oss.sonatype.org/content/repositories/snapshots/ during a previous attempt. This failure was cached in the local repository and resolution will not be reattempted until the update interval of sonatype-snapshots has elapsed or updates are forced. Original error: Could not transfer metadata org.apache.openmeetings:openmeetings-core:7.2.0-SNAPSHOT/maven-metadata.xml from/to sonatype-snapshots (https://oss.sonatype.org/content/repositories/snapshots/): status code: 403, reason phrase: Forbidden (403)
[INFO] ------------------------------------------------------------------------
[INFO] Reactor Summary for Openmeetings 7.2.0-SNAPSHOT:
[INFO]
[INFO] Openmeetings ....................................... FAILURE [ 50.196 s]
[INFO] Openmeetings Util .................................. SKIPPED
[INFO] Openmeetings DB .................................... SKIPPED
[INFO] Openmeetings Core .................................. SKIPPED
[INFO] Openmeetings MediaServer ........................... SKIPPED
[INFO] Openmeetings Install ............................... SKIPPED
[INFO] Openmeetings Service ............................... SKIPPED
[INFO] Openmeetings Webservices ........................... SKIPPED
[INFO] Openmeetings Web ................................... SKIPPED
[INFO] Openmeetings Screen Sharing applet ................. SKIPPED
[INFO] Openmeetings Server ................................ SKIPPED
[INFO] ------------------------------------------------------------------------
[INFO] BUILD FAILURE
[INFO] ------------------------------------------------------------------------
[INFO] Total time: 51.922 s
[INFO] Finished at: 2023-09-01T06:28:18Z
[INFO] ------------------------------------------------------------------------
[ERROR] Failed to execute goal org.apache.maven.plugins:maven-site-plugin:4.0.0-M9:site (generate-site) on project openmeetings-parent: Error generating maven-project-info-reports-plugin:3.4.5:dependency-convergence report: Could not build dependency tree: Could not collect dependencies: org.apache.openmeetings:openmeetings-web:war:7.2.0-SNAPSHOT: Failed to collect dependencies at de.agilecoders.wicket:wicket-bootstrap-extensions:jar:6.0.5-SNAPSHOT: Failed to read artifact descriptor for de.agilecoders.wicket:wicket-bootstrap-extensions:jar:6.0.5-SNAPSHOT: The following artifacts could not be resolved: de.agilecoders.wicket:wicket-bootstrap-extensions:pom:6.0.5-SNAPSHOT (absent): Could not transfer artifact de.agilecoders.wicket:wicket-bootstrap-extensions:pom:6.0.5-SNAPSHOT from/to sonatype-snapshots (https://oss.sonatype.org/content/repositories/snapshots/): status code: 403, reason phrase: Forbidden (403) -> [Help 1]
[ERROR]
[ERROR] To see the full stack trace of the errors, re-run Maven with the -e switch.
[ERROR] Re-run Maven using the -X switch to enable full debug logging.
[ERROR]
[ERROR] For more information about the errors and possible solutions, please read the following articles:
[ERROR] [Help 1] http://cwiki.apache.org/confluence/display/MAVEN/MojoExecutionException
Build step 'Invoke top-level Maven targets' marked build as failure
SSH: Current build result is [FAILURE], not going to run.
Archiving artifacts
Recording test results
ERROR: Step ?Publish JUnit test result report? failed: No test report files were found. Configuration error?