You are viewing a plain text version of this content. The canonical link for it is here.
Posted to builds@beam.apache.org by Apache Jenkins Server <je...@builds.apache.org> on 2020/08/24 13:40:29 UTC
beam_PostCommit_Python2 - Build # 2830 - Aborted!
beam_PostCommit_Python2 - Build # 2830 - Aborted:
Check console output at https://ci-beam.apache.org/job/beam_PostCommit_Python2/2830/ to view the results.
Jenkins build is back to normal : beam_PostCommit_Python2 #2836
Posted by Apache Jenkins Server <je...@builds.apache.org>.
See <https://ci-beam.apache.org/job/beam_PostCommit_Python2/2836/display/redirect?page=changes>
---------------------------------------------------------------------
To unsubscribe, e-mail: builds-unsubscribe@beam.apache.org
For additional commands, e-mail: builds-help@beam.apache.org
Build failed in Jenkins: beam_PostCommit_Python2 #2835
Posted by Apache Jenkins Server <je...@builds.apache.org>.
See <https://ci-beam.apache.org/job/beam_PostCommit_Python2/2835/display/redirect>
Changes:
------------------------------------------
[...truncated 21.77 MB...]
"encoding": {
"@type": "kind:windowed_value",
"component_encodings": [
{
"@type": "kind:pair",
"component_encodings": [
{
"@type": "kind:bytes"
},
{
"@type": "FastPrimitivesCoder$<string of 176 bytes>",
"component_encodings": [
{
"@type": "FastPrimitivesCoder$<string of 176 bytes>",
"component_encodings": [],
"pipeline_proto_coder_id": "ref_Coder_FastPrimitivesCoder_3"
},
{
"@type": "FastPrimitivesCoder$<string of 176 bytes>",
"component_encodings": [],
"pipeline_proto_coder_id": "ref_Coder_FastPrimitivesCoder_3"
}
],
"is_pair_like": true,
"pipeline_proto_coder_id": "ref_Coder_FastPrimitivesCoder_3"
}
],
"is_pair_like": true
},
{
"@type": "kind:global_window"
}
],
"is_wrapper": true
},
"output_name": "None",
"user_name": "Write/Write/WriteImpl/FinalizeWrite/MapToVoidKey0.out"
}
],
"parallel_input": {
"@type": "OutputReference",
"output_name": "None",
"step_name": "s17"
},
"serialized_fn": "ref_AppliedPTransform_Write/Write/WriteImpl/FinalizeWrite/MapToVoidKey0_39",
"user_name": "Write/Write/WriteImpl/FinalizeWrite/MapToVoidKey0"
}
},
{
"kind": "ParallelDo",
"name": "s41",
"properties": {
"display_data": [
{
"key": "fn",
"label": "Transform Function",
"namespace": "apache_beam.transforms.core.CallableWrapperDoFn",
"type": "STRING",
"value": "<lambda>"
},
{
"key": "fn",
"label": "Transform Function",
"namespace": "apache_beam.transforms.core.ParDo",
"shortValue": "CallableWrapperDoFn",
"type": "STRING",
"value": "apache_beam.transforms.core.CallableWrapperDoFn"
}
],
"non_parallel_inputs": {},
"output_info": [
{
"encoding": {
"@type": "kind:windowed_value",
"component_encodings": [
{
"@type": "kind:pair",
"component_encodings": [
{
"@type": "kind:bytes"
},
{
"@type": "FastPrimitivesCoder$<string of 176 bytes>",
"component_encodings": [
{
"@type": "FastPrimitivesCoder$<string of 176 bytes>",
"component_encodings": [],
"pipeline_proto_coder_id": "ref_Coder_FastPrimitivesCoder_3"
},
{
"@type": "FastPrimitivesCoder$<string of 176 bytes>",
"component_encodings": [],
"pipeline_proto_coder_id": "ref_Coder_FastPrimitivesCoder_3"
}
],
"is_pair_like": true,
"pipeline_proto_coder_id": "ref_Coder_FastPrimitivesCoder_3"
}
],
"is_pair_like": true
},
{
"@type": "kind:global_window"
}
],
"is_wrapper": true
},
"output_name": "None",
"user_name": "Write/Write/WriteImpl/FinalizeWrite/MapToVoidKey1.out"
}
],
"parallel_input": {
"@type": "OutputReference",
"output_name": "None",
"step_name": "s24"
},
"serialized_fn": "ref_AppliedPTransform_Write/Write/WriteImpl/FinalizeWrite/MapToVoidKey1_40",
"user_name": "Write/Write/WriteImpl/FinalizeWrite/MapToVoidKey1"
}
},
{
"kind": "ParallelDo",
"name": "s42",
"properties": {
"display_data": [
{
"key": "fn",
"label": "Transform Function",
"namespace": "apache_beam.transforms.core.CallableWrapperDoFn",
"type": "STRING",
"value": "<lambda>"
},
{
"key": "fn",
"label": "Transform Function",
"namespace": "apache_beam.transforms.core.ParDo",
"shortValue": "CallableWrapperDoFn",
"type": "STRING",
"value": "apache_beam.transforms.core.CallableWrapperDoFn"
}
],
"non_parallel_inputs": {},
"output_info": [
{
"encoding": {
"@type": "kind:windowed_value",
"component_encodings": [
{
"@type": "kind:pair",
"component_encodings": [
{
"@type": "kind:bytes"
},
{
"@type": "FastPrimitivesCoder$<string of 176 bytes>",
"component_encodings": [
{
"@type": "FastPrimitivesCoder$<string of 176 bytes>",
"component_encodings": [],
"pipeline_proto_coder_id": "ref_Coder_FastPrimitivesCoder_3"
},
{
"@type": "FastPrimitivesCoder$<string of 176 bytes>",
"component_encodings": [],
"pipeline_proto_coder_id": "ref_Coder_FastPrimitivesCoder_3"
}
],
"is_pair_like": true,
"pipeline_proto_coder_id": "ref_Coder_FastPrimitivesCoder_3"
}
],
"is_pair_like": true
},
{
"@type": "kind:global_window"
}
],
"is_wrapper": true
},
"output_name": "None",
"user_name": "Write/Write/WriteImpl/FinalizeWrite/MapToVoidKey2.out"
}
],
"parallel_input": {
"@type": "OutputReference",
"output_name": "None",
"step_name": "s29"
},
"serialized_fn": "ref_AppliedPTransform_Write/Write/WriteImpl/FinalizeWrite/MapToVoidKey2_41",
"user_name": "Write/Write/WriteImpl/FinalizeWrite/MapToVoidKey2"
}
}
],
"type": "JOB_TYPE_BATCH"
}
apache_beam.runners.dataflow.internal.apiclient: INFO: Create job: <Job
createTime: u'2020-08-25T18:11:27.828756Z'
currentStateTime: u'1970-01-01T00:00:00Z'
id: u'2020-08-25_11_11_26-6024699672183693383'
location: u'us-central1'
name: u'beamapp-jenkins-0825181117-464130'
projectId: u'apache-beam-testing'
stageStates: []
startTime: u'2020-08-25T18:11:27.828756Z'
steps: []
tempFiles: []
type: TypeValueValuesEnum(JOB_TYPE_BATCH, 1)>
apache_beam.runners.dataflow.internal.apiclient: INFO: Created job with id: [2020-08-25_11_11_26-6024699672183693383]
apache_beam.runners.dataflow.internal.apiclient: INFO: Submitted job: 2020-08-25_11_11_26-6024699672183693383
apache_beam.runners.dataflow.internal.apiclient: INFO: To access the Dataflow monitoring console, please navigate to https://console.cloud.google.com/dataflow/jobs/us-central1/2020-08-25_11_11_26-6024699672183693383?project=apache-beam-testing
--------------------- >> end captured logging << ---------------------
----------------------------------------------------------------------
XML: nosetests-postCommitIT-df-py27.xml
----------------------------------------------------------------------
XML: <https://ci-beam.apache.org/job/beam_PostCommit_Python2/ws/src/sdks/python/nosetests.xml>
----------------------------------------------------------------------
Ran 66 tests in 3812.477s
FAILED (SKIP=7, failures=2)
> Task :sdks:python:test-suites:dataflow:py2:postCommitIT FAILED
FAILURE: Build failed with an exception.
* Where:
Script '<https://ci-beam.apache.org/job/beam_PostCommit_Python2/ws/src/sdks/python/test-suites/dataflow/common.gradle'> line: 118
* What went wrong:
Execution failed for task ':sdks:python:test-suites:dataflow:py2:postCommitIT'.
> Process 'command 'sh'' finished with non-zero exit value 1
* Try:
Run with --stacktrace option to get the stack trace. Run with --info or --debug option to get more log output. Run with --scan to get full insights.
* Get more help at https://help.gradle.org
Deprecated Gradle features were used in this build, making it incompatible with Gradle 6.0.
Use '--warning-mode all' to show the individual deprecation warnings.
See https://docs.gradle.org/5.2.1/userguide/command_line_interface.html#sec:command_line_warnings
BUILD FAILED in 1h 6m 13s
173 actionable tasks: 133 executed, 36 from cache, 4 up-to-date
Publishing build scan...
https://gradle.com/s/lh4budsd5hwww
Build step 'Invoke Gradle script' changed build result to FAILURE
Build step 'Invoke Gradle script' marked build as failure
---------------------------------------------------------------------
To unsubscribe, e-mail: builds-unsubscribe@beam.apache.org
For additional commands, e-mail: builds-help@beam.apache.org
Build failed in Jenkins: beam_PostCommit_Python2 #2834
Posted by Apache Jenkins Server <je...@builds.apache.org>.
See <https://ci-beam.apache.org/job/beam_PostCommit_Python2/2834/display/redirect>
Changes:
------------------------------------------
[...truncated 21.95 MB...]
"non_parallel_inputs": {},
"output_info": [
{
"encoding": {
"@type": "kind:windowed_value",
"component_encodings": [
{
"@type": "kind:pair",
"component_encodings": [
{
"@type": "StrUtf8Coder$QlpoOTFBWSZTWdJUCXcAABnfwHAQACEAQAgACgC/QvwCYAAgAFRRoaAAAAgUHqBtTQeo/VNqQdgL184imrQEh+0jkgYoD+zb1SV5l2QqlM2rPxdyRThQkNJUCXc=",
"component_encodings": [],
"pipeline_proto_coder_id": "ref_Coder_StrUtf8Coder_4"
},
{
"@type": "FastPrimitivesCoder$<string of 176 bytes>",
"component_encodings": [
{
"@type": "FastPrimitivesCoder$<string of 176 bytes>",
"component_encodings": [],
"pipeline_proto_coder_id": "ref_Coder_FastPrimitivesCoder_3"
},
{
"@type": "FastPrimitivesCoder$<string of 176 bytes>",
"component_encodings": [],
"pipeline_proto_coder_id": "ref_Coder_FastPrimitivesCoder_3"
}
],
"is_pair_like": true,
"pipeline_proto_coder_id": "ref_Coder_FastPrimitivesCoder_3"
}
],
"is_pair_like": true
},
{
"@type": "kind:interval_window"
}
],
"is_wrapper": true
},
"output_name": "None",
"user_name": "count.out"
}
],
"parallel_input": {
"@type": "OutputReference",
"output_name": "out",
"step_name": "s6"
},
"serialized_fn": "ref_AppliedPTransform_count_9",
"user_name": "count"
}
},
{
"kind": "ParallelDo",
"name": "s8",
"properties": {
"display_data": [
{
"key": "fn",
"label": "Transform Function",
"namespace": "apache_beam.transforms.core.CallableWrapperDoFn",
"type": "STRING",
"value": "format_result"
},
{
"key": "fn",
"label": "Transform Function",
"namespace": "apache_beam.transforms.core.ParDo",
"shortValue": "CallableWrapperDoFn",
"type": "STRING",
"value": "apache_beam.transforms.core.CallableWrapperDoFn"
}
],
"non_parallel_inputs": {},
"output_info": [
{
"encoding": {
"@type": "kind:windowed_value",
"component_encodings": [
{
"@type": "FastPrimitivesCoder$<string of 176 bytes>",
"component_encodings": [
{
"@type": "FastPrimitivesCoder$<string of 176 bytes>",
"component_encodings": [],
"pipeline_proto_coder_id": "ref_Coder_FastPrimitivesCoder_3"
},
{
"@type": "FastPrimitivesCoder$<string of 176 bytes>",
"component_encodings": [],
"pipeline_proto_coder_id": "ref_Coder_FastPrimitivesCoder_3"
}
],
"is_pair_like": true,
"pipeline_proto_coder_id": "ref_Coder_FastPrimitivesCoder_3"
},
{
"@type": "kind:interval_window"
}
],
"is_wrapper": true
},
"output_name": "None",
"user_name": "format.out"
}
],
"parallel_input": {
"@type": "OutputReference",
"output_name": "None",
"step_name": "s7"
},
"serialized_fn": "ref_AppliedPTransform_format_10",
"user_name": "format"
}
},
{
"kind": "ParallelDo",
"name": "s9",
"properties": {
"display_data": [
{
"key": "fn",
"label": "Transform Function",
"namespace": "apache_beam.transforms.core.CallableWrapperDoFn",
"type": "STRING",
"value": "<lambda>"
},
{
"key": "fn",
"label": "Transform Function",
"namespace": "apache_beam.transforms.core.ParDo",
"shortValue": "CallableWrapperDoFn",
"type": "STRING",
"value": "apache_beam.transforms.core.CallableWrapperDoFn"
}
],
"non_parallel_inputs": {},
"output_info": [
{
"encoding": {
"@type": "kind:windowed_value",
"component_encodings": [
{
"@type": "kind:bytes"
},
{
"@type": "kind:interval_window"
}
],
"is_wrapper": true
},
"output_name": "None",
"user_name": "encode.out"
}
],
"parallel_input": {
"@type": "OutputReference",
"output_name": "None",
"step_name": "s8"
},
"serialized_fn": "ref_AppliedPTransform_encode_11",
"user_name": "encode"
}
},
{
"kind": "ParallelWrite",
"name": "s10",
"properties": {
"display_data": [],
"encoding": {
"@type": "kind:windowed_value",
"component_encodings": [
{
"@type": "kind:bytes"
},
{
"@type": "kind:global_window"
}
],
"is_wrapper": true
},
"format": "pubsub",
"parallel_input": {
"@type": "OutputReference",
"output_name": "None",
"step_name": "s9"
},
"pubsub_topic": "projects/apache-beam-testing/topics/wc_topic_output9c5b8ae7-03a2-4842-adcc-e224b6150bf4",
"user_name": "WriteToPubSub/Write/NativeWrite"
}
}
],
"type": "JOB_TYPE_STREAMING"
}
apache_beam.runners.dataflow.internal.apiclient: INFO: Create job: <Job
createTime: u'2020-08-25T12:11:17.953842Z'
currentStateTime: u'1970-01-01T00:00:00Z'
id: u'2020-08-25_05_11_16-12461424176018986966'
location: u'us-central1'
name: u'beamapp-jenkins-0825121106-188405'
projectId: u'apache-beam-testing'
stageStates: []
startTime: u'2020-08-25T12:11:17.953842Z'
steps: []
tempFiles: []
type: TypeValueValuesEnum(JOB_TYPE_STREAMING, 2)>
apache_beam.runners.dataflow.internal.apiclient: INFO: Created job with id: [2020-08-25_05_11_16-12461424176018986966]
apache_beam.runners.dataflow.internal.apiclient: INFO: Submitted job: 2020-08-25_05_11_16-12461424176018986966
apache_beam.runners.dataflow.internal.apiclient: INFO: To access the Dataflow monitoring console, please navigate to https://console.cloud.google.com/dataflow/jobs/us-central1/2020-08-25_05_11_16-12461424176018986966?project=apache-beam-testing
--------------------- >> end captured logging << ---------------------
----------------------------------------------------------------------
XML: nosetests-postCommitIT-df-py27.xml
----------------------------------------------------------------------
XML: <https://ci-beam.apache.org/job/beam_PostCommit_Python2/ws/src/sdks/python/nosetests.xml>
----------------------------------------------------------------------
Ran 66 tests in 3811.219s
FAILED (SKIP=7, errors=1, failures=1)
> Task :sdks:python:test-suites:dataflow:py2:postCommitIT FAILED
FAILURE: Build failed with an exception.
* Where:
Script '<https://ci-beam.apache.org/job/beam_PostCommit_Python2/ws/src/sdks/python/test-suites/dataflow/common.gradle'> line: 118
* What went wrong:
Execution failed for task ':sdks:python:test-suites:dataflow:py2:postCommitIT'.
> Process 'command 'sh'' finished with non-zero exit value 1
* Try:
Run with --stacktrace option to get the stack trace. Run with --info or --debug option to get more log output. Run with --scan to get full insights.
* Get more help at https://help.gradle.org
Deprecated Gradle features were used in this build, making it incompatible with Gradle 6.0.
Use '--warning-mode all' to show the individual deprecation warnings.
See https://docs.gradle.org/5.2.1/userguide/command_line_interface.html#sec:command_line_warnings
BUILD FAILED in 1h 6m 8s
173 actionable tasks: 133 executed, 36 from cache, 4 up-to-date
Publishing build scan...
https://gradle.com/s/wv4ummfy6q55m
Build step 'Invoke Gradle script' changed build result to FAILURE
Build step 'Invoke Gradle script' marked build as failure
---------------------------------------------------------------------
To unsubscribe, e-mail: builds-unsubscribe@beam.apache.org
For additional commands, e-mail: builds-help@beam.apache.org
Build failed in Jenkins: beam_PostCommit_Python2 #2833
Posted by Apache Jenkins Server <je...@builds.apache.org>.
See <https://ci-beam.apache.org/job/beam_PostCommit_Python2/2833/display/redirect?page=changes>
Changes:
[noreply] [BEAM-10777] Add two blog posts detailing changes to the type hints
------------------------------------------
[...truncated 21.58 MB...]
"component_encodings": [],
"pipeline_proto_coder_id": "ref_Coder_FastPrimitivesCoder_3"
}
],
"is_pair_like": true,
"pipeline_proto_coder_id": "ref_Coder_FastPrimitivesCoder_3"
},
{
"@type": "kind:global_window"
}
],
"is_wrapper": true
},
"output_name": "None",
"user_name": "WriteToSpanner/make batches/ParDo(_BatchFn).out"
}
],
"parallel_input": {
"@type": "OutputReference",
"output_name": "None",
"step_name": "s3"
},
"serialized_fn": "<string of 692 bytes>",
"user_name": "WriteToSpanner/make batches/ParDo(_BatchFn)"
}
},
{
"kind": "Flatten",
"name": "s5",
"properties": {
"display_data": [],
"inputs": [
{
"@type": "OutputReference",
"output_name": "unbatchable",
"step_name": "s3"
},
{
"@type": "OutputReference",
"output_name": "None",
"step_name": "s4"
}
],
"output_info": [
{
"encoding": {
"@type": "kind:windowed_value",
"component_encodings": [
{
"@type": "FastPrimitivesCoder$<string of 176 bytes>",
"component_encodings": [
{
"@type": "FastPrimitivesCoder$<string of 176 bytes>",
"component_encodings": [],
"pipeline_proto_coder_id": "ref_Coder_FastPrimitivesCoder_3"
},
{
"@type": "FastPrimitivesCoder$<string of 176 bytes>",
"component_encodings": [],
"pipeline_proto_coder_id": "ref_Coder_FastPrimitivesCoder_3"
}
],
"is_pair_like": true,
"pipeline_proto_coder_id": "ref_Coder_FastPrimitivesCoder_3"
},
{
"@type": "kind:global_window"
}
],
"is_wrapper": true
},
"output_name": "out",
"user_name": "WriteToSpanner/make batches/Merging batchable and unbatchable.out"
}
],
"user_name": "WriteToSpanner/make batches/Merging batchable and unbatchable"
}
},
{
"kind": "ParallelDo",
"name": "s6",
"properties": {
"display_data": [
{
"key": "fn",
"label": "Transform Function",
"namespace": "apache_beam.transforms.core.ParDo",
"shortValue": "_WriteToSpannerDoFn",
"type": "STRING",
"value": "apache_beam.io.gcp.experimental.spannerio._WriteToSpannerDoFn"
}
],
"non_parallel_inputs": {},
"output_info": [
{
"encoding": {
"@type": "kind:windowed_value",
"component_encodings": [
{
"@type": "FastPrimitivesCoder$<string of 176 bytes>",
"component_encodings": [
{
"@type": "FastPrimitivesCoder$<string of 176 bytes>",
"component_encodings": [],
"pipeline_proto_coder_id": "ref_Coder_FastPrimitivesCoder_3"
},
{
"@type": "FastPrimitivesCoder$<string of 176 bytes>",
"component_encodings": [],
"pipeline_proto_coder_id": "ref_Coder_FastPrimitivesCoder_3"
}
],
"is_pair_like": true,
"pipeline_proto_coder_id": "ref_Coder_FastPrimitivesCoder_3"
},
{
"@type": "kind:global_window"
}
],
"is_wrapper": true
},
"output_name": "None",
"user_name": "WriteToSpanner/Writing to spanner.out"
}
],
"parallel_input": {
"@type": "OutputReference",
"output_name": "out",
"step_name": "s5"
},
"serialized_fn": "<string of 1176 bytes>",
"user_name": "WriteToSpanner/Writing to spanner"
}
}
],
"type": "JOB_TYPE_BATCH"
}
apache_beam.runners.dataflow.internal.apiclient: INFO: Create job: <Job
createTime: u'2020-08-25T06:19:45.826549Z'
currentStateTime: u'1970-01-01T00:00:00Z'
id: u'2020-08-24_23_19_44-10091011816540891553'
location: u'us-central1'
name: u'beamapp-jenkins-0825061935-065206'
projectId: u'apache-beam-testing'
stageStates: []
startTime: u'2020-08-25T06:19:45.826549Z'
steps: []
tempFiles: []
type: TypeValueValuesEnum(JOB_TYPE_BATCH, 1)>
apache_beam.runners.dataflow.internal.apiclient: INFO: Created job with id: [2020-08-24_23_19_44-10091011816540891553]
apache_beam.runners.dataflow.internal.apiclient: INFO: Submitted job: 2020-08-24_23_19_44-10091011816540891553
apache_beam.runners.dataflow.internal.apiclient: INFO: To access the Dataflow monitoring console, please navigate to https://console.cloud.google.com/dataflow/jobs/us-central1/2020-08-24_23_19_44-10091011816540891553?project=apache-beam-testing
--------------------- >> end captured logging << ---------------------
----------------------------------------------------------------------
XML: nosetests-postCommitIT-df-py27.xml
----------------------------------------------------------------------
XML: <https://ci-beam.apache.org/job/beam_PostCommit_Python2/ws/src/sdks/python/nosetests.xml>
----------------------------------------------------------------------
Ran 66 tests in 3857.643s
FAILED (SKIP=7, failures=1)
Worker logs: https://console.cloud.google.com/dataflow/jobs/us-central1/2020-08-24_23_03_53-4423273092653996956?project=apache-beam-testing
Worker logs: https://console.cloud.google.com/dataflow/jobs/us-central1/2020-08-24_23_15_23-2916970326460380558?project=apache-beam-testing
Worker logs: https://console.cloud.google.com/dataflow/jobs/us-central1/2020-08-24_23_22_35-8937851646252164441?project=apache-beam-testing
Worker logs: https://console.cloud.google.com/dataflow/jobs/us-central1/2020-08-24_23_30_13-13715711473080171748?project=apache-beam-testing
Worker logs: https://console.cloud.google.com/dataflow/jobs/us-central1/2020-08-24_23_37_45-17847518054902288853?project=apache-beam-testing
Worker logs: https://console.cloud.google.com/dataflow/jobs/us-central1/2020-08-24_23_44_16-2724241021827747166?project=apache-beam-testing
Worker logs: https://console.cloud.google.com/dataflow/jobs/us-central1/2020-08-24_23_51_28-15286875189440746076?project=apache-beam-testing
Worker logs: https://console.cloud.google.com/dataflow/jobs/us-central1/2020-08-24_23_59_53-4023623318636531601?project=apache-beam-testing
Worker logs: https://console.cloud.google.com/dataflow/jobs/us-central1/2020-08-24_23_03_56-16996085720445563632?project=apache-beam-testing
Worker logs: https://console.cloud.google.com/dataflow/jobs/us-central1/2020-08-24_23_17_38-10729321753332289121?project=apache-beam-testing
Worker logs: https://console.cloud.google.com/dataflow/jobs/us-central1/2020-08-24_23_24_19-17745987755810904648?project=apache-beam-testing
Worker logs: https://console.cloud.google.com/dataflow/jobs/us-central1/2020-08-24_23_31_16-13063866252551288499?project=apache-beam-testing
Worker logs: https://console.cloud.google.com/dataflow/jobs/us-central1/2020-08-24_23_38_50-7301418815466897173?project=apache-beam-testing
Worker logs: https://console.cloud.google.com/dataflow/jobs/us-central1/2020-08-24_23_46_46-18405659268936553898?project=apache-beam-testing
Worker logs: https://console.cloud.google.com/dataflow/jobs/us-central1/2020-08-24_23_53_48-11668666738723047153?project=apache-beam-testing
Worker logs: https://console.cloud.google.com/dataflow/jobs/us-central1/2020-08-24_23_03_53-11163793747787752320?project=apache-beam-testing
Worker logs: https://console.cloud.google.com/dataflow/jobs/us-central1/2020-08-24_23_24_46-8618473833357022569?project=apache-beam-testing
Worker logs: https://console.cloud.google.com/dataflow/jobs/us-central1/2020-08-24_23_25_25-10519938746646216759?project=apache-beam-testing
Worker logs: https://console.cloud.google.com/dataflow/jobs/us-central1/2020-08-24_23_26_04-15370600559336670932?project=apache-beam-testing
Worker logs: https://console.cloud.google.com/dataflow/jobs/us-central1/2020-08-24_23_33_30-12539710267355747813?project=apache-beam-testing
Worker logs: https://console.cloud.google.com/dataflow/jobs/us-central1/2020-08-24_23_49_54-10552300381084566028?project=apache-beam-testing
Worker logs: https://console.cloud.google.com/dataflow/jobs/us-central1/2020-08-24_23_03_49-5394839491591828355?project=apache-beam-testing
Worker logs: https://console.cloud.google.com/dataflow/jobs/us-central1/2020-08-24_23_22_52-196716466577803783?project=apache-beam-testing
Worker logs: https://console.cloud.google.com/dataflow/jobs/us-central1/2020-08-24_23_23_18-6317076587793658292?project=apache-beam-testing
Worker logs: https://console.cloud.google.com/dataflow/jobs/us-central1/2020-08-24_23_30_21-11983666052507397172?project=apache-beam-testing
Worker logs: https://console.cloud.google.com/dataflow/jobs/us-central1/2020-08-24_23_37_50-15794123444634688818?project=apache-beam-testing
Worker logs: https://console.cloud.google.com/dataflow/jobs/us-central1/2020-08-24_23_44_38-10295626984150055307?project=apache-beam-testing
Worker logs: https://console.cloud.google.com/dataflow/jobs/us-central1/2020-08-24_23_53_03-10371460229140868660?project=apache-beam-testing
Worker logs: https://console.cloud.google.com/dataflow/jobs/us-central1/2020-08-24_23_03_50-2450265070928756385?project=apache-beam-testing
Worker logs: https://console.cloud.google.com/dataflow/jobs/us-central1/2020-08-24_23_11_42-9451433344872773410?project=apache-beam-testing
Worker logs: https://console.cloud.google.com/dataflow/jobs/us-central1/2020-08-24_23_19_54-1726107063000453808?project=apache-beam-testing
Worker logs: https://console.cloud.google.com/dataflow/jobs/us-central1/2020-08-24_23_28_36-10098803500366510286?project=apache-beam-testing
Worker logs: https://console.cloud.google.com/dataflow/jobs/us-central1/2020-08-24_23_36_32-2844310765703494224?project=apache-beam-testing
Worker logs: https://console.cloud.google.com/dataflow/jobs/us-central1/2020-08-24_23_43_43-11203159062493147989?project=apache-beam-testing
Worker logs: https://console.cloud.google.com/dataflow/jobs/us-central1/2020-08-24_23_50_58-14991789245458791274?project=apache-beam-testing
Worker logs: https://console.cloud.google.com/dataflow/jobs/us-central1/2020-08-24_23_03_51-4992321414472749608?project=apache-beam-testing
Worker logs: https://console.cloud.google.com/dataflow/jobs/us-central1/2020-08-24_23_11_35-4499842798912735815?project=apache-beam-testing
Worker logs: https://console.cloud.google.com/dataflow/jobs/us-central1/2020-08-24_23_19_44-10091011816540891553?project=apache-beam-testing
Worker logs: https://console.cloud.google.com/dataflow/jobs/us-central1/2020-08-24_23_20_14-1812366499103876946?project=apache-beam-testing
Worker logs: https://console.cloud.google.com/dataflow/jobs/us-central1/2020-08-24_23_27_32-10019271072511422240?project=apache-beam-testing
Worker logs: https://console.cloud.google.com/dataflow/jobs/us-central1/2020-08-24_23_34_49-15746475173304265305?project=apache-beam-testing
Worker logs: https://console.cloud.google.com/dataflow/jobs/us-central1/2020-08-24_23_42_17-3452472335631790973?project=apache-beam-testing
Worker logs: https://console.cloud.google.com/dataflow/jobs/us-central1/2020-08-24_23_49_42-3410429935078995419?project=apache-beam-testing
Worker logs: https://console.cloud.google.com/dataflow/jobs/us-central1/2020-08-24_23_03_50-16621046143331884314?project=apache-beam-testing
Worker logs: https://console.cloud.google.com/dataflow/jobs/us-central1/2020-08-24_23_13_12-3914659930701693446?project=apache-beam-testing
Worker logs: https://console.cloud.google.com/dataflow/jobs/us-central1/2020-08-24_23_22_39-17830862485063656096?project=apache-beam-testing
Worker logs: https://console.cloud.google.com/dataflow/jobs/us-central1/2020-08-24_23_30_11-10791454689374449924?project=apache-beam-testing
Worker logs: https://console.cloud.google.com/dataflow/jobs/us-central1/2020-08-24_23_38_16-8074500285009898885?project=apache-beam-testing
Worker logs: https://console.cloud.google.com/dataflow/jobs/us-central1/2020-08-24_23_45_55-12442922873805669272?project=apache-beam-testing
Worker logs: https://console.cloud.google.com/dataflow/jobs/us-central1/2020-08-24_23_53_01-14248005920478765632?project=apache-beam-testing
Worker logs: https://console.cloud.google.com/dataflow/jobs/us-central1/2020-08-24_23_03_50-15064998065316100036?project=apache-beam-testing
Worker logs: https://console.cloud.google.com/dataflow/jobs/us-central1/2020-08-24_23_11_47-12512873444347271542?project=apache-beam-testing
Worker logs: https://console.cloud.google.com/dataflow/jobs/us-central1/2020-08-24_23_19_47-4613688144064540513?project=apache-beam-testing
Worker logs: https://console.cloud.google.com/dataflow/jobs/us-central1/2020-08-24_23_27_53-1693599454915704546?project=apache-beam-testing
Worker logs: https://console.cloud.google.com/dataflow/jobs/us-central1/2020-08-24_23_36_03-5482443055006476896?project=apache-beam-testing
Worker logs: https://console.cloud.google.com/dataflow/jobs/us-central1/2020-08-24_23_43_40-2945159585586958776?project=apache-beam-testing
Worker logs: https://console.cloud.google.com/dataflow/jobs/us-central1/2020-08-24_23_50_24-8981480624231027694?project=apache-beam-testing
Worker logs: https://console.cloud.google.com/dataflow/jobs/us-central1/2020-08-24_23_57_51-17940234903453818400?project=apache-beam-testing
> Task :sdks:python:test-suites:dataflow:py2:postCommitIT FAILED
FAILURE: Build failed with an exception.
* Where:
Script '<https://ci-beam.apache.org/job/beam_PostCommit_Python2/ws/src/sdks/python/test-suites/dataflow/common.gradle'> line: 118
* What went wrong:
Execution failed for task ':sdks:python:test-suites:dataflow:py2:postCommitIT'.
> Process 'command 'sh'' finished with non-zero exit value 1
* Try:
Run with --stacktrace option to get the stack trace. Run with --info or --debug option to get more log output. Run with --scan to get full insights.
* Get more help at https://help.gradle.org
Deprecated Gradle features were used in this build, making it incompatible with Gradle 6.0.
Use '--warning-mode all' to show the individual deprecation warnings.
See https://docs.gradle.org/5.2.1/userguide/command_line_interface.html#sec:command_line_warnings
BUILD FAILED in 1h 7m 16s
173 actionable tasks: 138 executed, 31 from cache, 4 up-to-date
Publishing build scan...
https://gradle.com/s/ygujlkshtjg2k
Build step 'Invoke Gradle script' changed build result to FAILURE
Build step 'Invoke Gradle script' marked build as failure
---------------------------------------------------------------------
To unsubscribe, e-mail: builds-unsubscribe@beam.apache.org
For additional commands, e-mail: builds-help@beam.apache.org
Build failed in Jenkins: beam_PostCommit_Python2 #2832
Posted by Apache Jenkins Server <je...@builds.apache.org>.
See <https://ci-beam.apache.org/job/beam_PostCommit_Python2/2832/display/redirect?page=changes>
Changes:
[Robin Qiu] Propagate BigQuery streaming insert throttled time to Dataflow worker in
[Kamil Wasilewski] [BEAM-10524] JSON decoder for ReadFromBigQuery supports repeatable
[noreply] Merge pull request #12415 from [BEAM-10603] Add the RecordingManager and
------------------------------------------
[...truncated 21.58 MB...]
}
],
"is_pair_like": true,
"pipeline_proto_coder_id": "ref_Coder_FastPrimitivesCoder_3"
},
{
"@type": "FastPrimitivesCoder$<string of 176 bytes>",
"component_encodings": [
{
"@type": "FastPrimitivesCoder$<string of 176 bytes>",
"component_encodings": [],
"pipeline_proto_coder_id": "ref_Coder_FastPrimitivesCoder_3"
},
{
"@type": "FastPrimitivesCoder$<string of 176 bytes>",
"component_encodings": [],
"pipeline_proto_coder_id": "ref_Coder_FastPrimitivesCoder_3"
}
],
"is_pair_like": true,
"pipeline_proto_coder_id": "ref_Coder_FastPrimitivesCoder_3"
}
],
"is_pair_like": true
}
],
"is_stream_like": true
}
],
"is_pair_like": true
},
{
"@type": "kind:global_window"
}
],
"is_wrapper": true
},
"output_name": "out",
"user_name": "CoGroupByKey/GroupByKey.out"
}
],
"parallel_input": {
"@type": "OutputReference",
"output_name": "out",
"step_name": "s21"
},
"serialized_fn": "%0A%88%11%22%40%0A%1Dref_Coder_GlobalWindowCoder_1%12%1F%0A%1D%0A%1Bbeam%3Acoder%3Aglobal_window%3Av1%2A%C3%10%0A%25ref_Environment_default_environment_1%12%99%10%12%12beam%3Aenv%3Adocker%3Av1%1A%3B%0A9gcr.io/cloud-dataflow/v1beta3/python%3Abeam-master-20200630%2A%14beam%3Acoder%3Avarint%3Av1%2A%13beam%3Acoder%3Abytes%3Av1%2A%13beam%3Acoder%3Atimer%3Av1%2A%1Bbeam%3Acoder%3Aglobal_window%3Av1%2A%1Dbeam%3Acoder%3Ainterval_window%3Av1%2A%16beam%3Acoder%3Aiterable%3Av1%2A%23beam%3Acoder%3Astate_backed_iterable%3Av1%2A%1Cbeam%3Acoder%3Awindowed_value%3Av1%2A%22beam%3Acoder%3Aparam_windowed_value%3Av1%2A%14beam%3Acoder%3Adouble%3Av1%2A%19beam%3Acoder%3Astring_utf8%3Av1%2A%1Bbeam%3Acoder%3Alength_prefix%3Av1%2A%12beam%3Acoder%3Abool%3Av1%2A%10beam%3Acoder%3Akv%3Av1%2A%11beam%3Acoder%3Arow%3Av1%2A%23beam%3Aprotocol%3Aprogress_reporting%3Av0%2A%1Ebeam%3Aprotocol%3Aworker_status%3Av1%2A%3Abeam%3Aversion%3Asdk_base%3Aapache/beam_python2.7_sdk%3A2.25.0.dev2q%0A%1Abeam%3Aartifact%3Atype%3Afile%3Av1%12%1D%0A%1Bpostcommit_requirements.txt%1A%20beam%3Aartifact%3Arole%3Astaging_to%3Av1%22%12%0A%10requirements.txt2%9B%01%0A%1Abeam%3Aartifact%3Atype%3Afile%3Av1%12%3D%0A%3B/tmp/dataflow-requirements-cache/parameterized-0.7.4.tar.gz%1A%20beam%3Aartifact%3Arole%3Astaging_to%3Av1%22%1C%0A%1Aparameterized-0.7.4.tar.gz2%89%01%0A%1Abeam%3Aartifact%3Atype%3Afile%3Av1%124%0A2/tmp/dataflow-requirements-cache/mock-2.0.0.tar.gz%1A%20beam%3Aartifact%3Arole%3Astaging_to%3Av1%22%13%0A%11mock-2.0.0.tar.gz2%89%01%0A%1Abeam%3Aartifact%3Atype%3Afile%3Av1%124%0A2/tmp/dataflow-requirements-cache/six-1.15.0.tar.gz%1A%20beam%3Aartifact%3Arole%3Astaging_to%3Av1%22%13%0A%11six-1.15.0.tar.gz2%91%01%0A%1Abeam%3Aartifact%3Atype%3Afile%3Av1%128%0A6/tmp/dataflow-requirements-cache/funcsigs-1.0.2.tar.gz%1A%20beam%3Aartifact%3Arole%3Astaging_to%3Av1%22%17%0A%15funcsigs-1.0.2.tar.gz2%87%01%0A%1Abeam%3Aartifact%3Atype%3Afile%3Av1%123%0A1/tmp/dataflow-requirements-cache/pbr-5.4.5.tar.gz%1A%20beam%3Aartifact%3Arole%3Astaging_to%3Av1%22%12%0A%10pbr-5.4.5.tar.gz2%97%01%0A%1Abeam%3Aartifact%3Atype%3Afile%3Av1%12%3B%0A9/tmp/dataflow-requirements-cache/PyHamcrest-1.10.1.tar.gz%1A%20beam%3Aartifact%3Arole%3Astaging_to%3Av1%22%1A%0A%18PyHamcrest-1.10.1.tar.gz2%C3%01%0A%1Abeam%3Aartifact%3Atype%3Afile%3Av1%12h%0Af<https://ci-beam.apache.org/job/beam_PostCommit_Python2/ws/src/sdks/python/build/apache-beam.tar.gz%1A%20beam%3Aartifact%3Arole%3Astaging_to%3Av1%22%19%0A%17dataflow_python_sdk.tar2%9B%02%0A%1Abeam%3Aartifact%3Atype%3Afile%3Av1%12%C3%01%0A%C0%01/home/jenkins/jenkins-slave/workspace/beam_PostCommit_Python2/src/runners/google-cloud-dataflow-java/worker/build/libs/beam-runners-google-cloud-dataflow-java-fn-api-worker-2.25.0-SNAPSHOT.jar%1A%20beam%3Aartifact%3Arole%3Astaging_to%3Av1%22%15%0A%13dataflow-worker.jarjx%0A%22%0A%20beam%3Awindow_fn%3Aglobal_windows%3Av1%10%01%1A%1Dref_Coder_GlobalWindowCoder_1%22%02%3A%00%28%010%018%01H%01Z%25ref_Environment_default_environment_1",>
"user_name": "CoGroupByKey/GroupByKey"
}
},
{
"kind": "ParallelDo",
"name": "s23",
"properties": {
"display_data": [
{
"key": "fn",
"label": "Transform Function",
"namespace": "apache_beam.transforms.core.CallableWrapperDoFn",
"type": "STRING",
"value": "_merge_tagged_vals_under_key"
},
{
"key": "fn",
"label": "Transform Function",
"namespace": "apache_beam.transforms.core.ParDo",
"shortValue": "CallableWrapperDoFn",
"type": "STRING",
"value": "apache_beam.transforms.core.CallableWrapperDoFn"
}
],
"non_parallel_inputs": {},
"output_info": [
{
"encoding": {
"@type": "kind:windowed_value",
"component_encodings": [
{
"@type": "FastPrimitivesCoder$<string of 176 bytes>",
"component_encodings": [
{
"@type": "FastPrimitivesCoder$<string of 176 bytes>",
"component_encodings": [],
"pipeline_proto_coder_id": "ref_Coder_FastPrimitivesCoder_3"
},
{
"@type": "FastPrimitivesCoder$<string of 176 bytes>",
"component_encodings": [],
"pipeline_proto_coder_id": "ref_Coder_FastPrimitivesCoder_3"
}
],
"is_pair_like": true,
"pipeline_proto_coder_id": "ref_Coder_FastPrimitivesCoder_3"
},
{
"@type": "kind:global_window"
}
],
"is_wrapper": true
},
"output_name": "None",
"user_name": "CoGroupByKey/Map(_merge_tagged_vals_under_key).out"
}
],
"parallel_input": {
"@type": "OutputReference",
"output_name": "out",
"step_name": "s22"
},
"serialized_fn": "<string of 1732 bytes>",
"user_name": "CoGroupByKey/Map(_merge_tagged_vals_under_key)"
}
},
{
"kind": "ParallelDo",
"name": "s24",
"properties": {
"display_data": [
{
"key": "fn",
"label": "Transform Function",
"namespace": "apache_beam.transforms.core.CallableWrapperDoFn",
"type": "STRING",
"value": "check"
},
{
"key": "fn",
"label": "Transform Function",
"namespace": "apache_beam.transforms.core.ParDo",
"shortValue": "CallableWrapperDoFn",
"type": "STRING",
"value": "apache_beam.transforms.core.CallableWrapperDoFn"
}
],
"non_parallel_inputs": {},
"output_info": [
{
"encoding": {
"@type": "kind:windowed_value",
"component_encodings": [
{
"@type": "FastPrimitivesCoder$<string of 176 bytes>",
"component_encodings": [
{
"@type": "FastPrimitivesCoder$<string of 176 bytes>",
"component_encodings": [],
"pipeline_proto_coder_id": "ref_Coder_FastPrimitivesCoder_3"
},
{
"@type": "FastPrimitivesCoder$<string of 176 bytes>",
"component_encodings": [],
"pipeline_proto_coder_id": "ref_Coder_FastPrimitivesCoder_3"
}
],
"is_pair_like": true,
"pipeline_proto_coder_id": "ref_Coder_FastPrimitivesCoder_3"
},
{
"@type": "kind:global_window"
}
],
"is_wrapper": true
},
"output_name": "None",
"user_name": "Map(check).out"
}
],
"parallel_input": {
"@type": "OutputReference",
"output_name": "None",
"step_name": "s23"
},
"serialized_fn": "<string of 1652 bytes>",
"user_name": "Map(check)"
}
}
],
"type": "JOB_TYPE_BATCH"
}
apache_beam.runners.dataflow.internal.apiclient: INFO: Create job: <Job
createTime: u'2020-08-25T00:12:57.859197Z'
currentStateTime: u'1970-01-01T00:00:00Z'
id: u'2020-08-24_17_12_56-3405829114019644083'
location: u'us-central1'
name: u'beamapp-jenkins-0825001246-119082'
projectId: u'apache-beam-testing'
stageStates: []
startTime: u'2020-08-25T00:12:57.859197Z'
steps: []
tempFiles: []
type: TypeValueValuesEnum(JOB_TYPE_BATCH, 1)>
apache_beam.runners.dataflow.internal.apiclient: INFO: Created job with id: [2020-08-24_17_12_56-3405829114019644083]
apache_beam.runners.dataflow.internal.apiclient: INFO: Submitted job: 2020-08-24_17_12_56-3405829114019644083
apache_beam.runners.dataflow.internal.apiclient: INFO: To access the Dataflow monitoring console, please navigate to https://console.cloud.google.com/dataflow/jobs/us-central1/2020-08-24_17_12_56-3405829114019644083?project=apache-beam-testing
--------------------- >> end captured logging << ---------------------
----------------------------------------------------------------------
XML: nosetests-postCommitIT-df-py27.xml
----------------------------------------------------------------------
XML: <https://ci-beam.apache.org/job/beam_PostCommit_Python2/ws/src/sdks/python/nosetests.xml>
----------------------------------------------------------------------
Ran 66 tests in 3769.072s
FAILED (SKIP=7, errors=1, failures=2)
> Task :sdks:python:test-suites:dataflow:py2:postCommitIT FAILED
FAILURE: Build completed with 2 failures.
1: Task failed with an exception.
-----------
* Where:
Script '<https://ci-beam.apache.org/job/beam_PostCommit_Python2/ws/src/sdks/python/test-suites/direct/common.gradle'> line: 144
* What went wrong:
Execution failed for task ':sdks:python:test-suites:direct:py2:hdfsIntegrationTest'.
> Process 'command 'sh'' finished with non-zero exit value 1
* Try:
Run with --stacktrace option to get the stack trace. Run with --info or --debug option to get more log output. Run with --scan to get full insights.
==============================================================================
2: Task failed with an exception.
-----------
* Where:
Script '<https://ci-beam.apache.org/job/beam_PostCommit_Python2/ws/src/sdks/python/test-suites/dataflow/common.gradle'> line: 118
* What went wrong:
Execution failed for task ':sdks:python:test-suites:dataflow:py2:postCommitIT'.
> Process 'command 'sh'' finished with non-zero exit value 1
* Try:
Run with --stacktrace option to get the stack trace. Run with --info or --debug option to get more log output. Run with --scan to get full insights.
==============================================================================
* Get more help at https://help.gradle.org
Deprecated Gradle features were used in this build, making it incompatible with Gradle 6.0.
Use '--warning-mode all' to show the individual deprecation warnings.
See https://docs.gradle.org/5.2.1/userguide/command_line_interface.html#sec:command_line_warnings
BUILD FAILED in 1h 5m 43s
173 actionable tasks: 133 executed, 36 from cache, 4 up-to-date
Publishing build scan...
https://gradle.com/s/7nxetrrrgt4xk
Build step 'Invoke Gradle script' changed build result to FAILURE
Build step 'Invoke Gradle script' marked build as failure
---------------------------------------------------------------------
To unsubscribe, e-mail: builds-unsubscribe@beam.apache.org
For additional commands, e-mail: builds-help@beam.apache.org
Build failed in Jenkins: beam_PostCommit_Python2 #2831
Posted by Apache Jenkins Server <je...@builds.apache.org>.
See <https://ci-beam.apache.org/job/beam_PostCommit_Python2/2831/display/redirect?page=changes>
Changes:
[Udi Meiri] Silence red PYTHONPATH warning from tox
[tobiasz.kedzierski] [BEAM-10682] Add workflow to run Java tests on Linux/Windows/Mac
------------------------------------------
[...truncated 17.16 MB...]
"output_name": "None",
"step_name": "s3"
},
"serialized_fn": "%0A%88%11%22%40%0A%1Dref_Coder_GlobalWindowCoder_1%12%1F%0A%1D%0A%1Bbeam%3Acoder%3Aglobal_window%3Av1%2A%C3%10%0A%25ref_Environment_default_environment_1%12%99%10%12%12beam%3Aenv%3Adocker%3Av1%1A%3B%0A9gcr.io/cloud-dataflow/v1beta3/python%3Abeam-master-20200630%2A%14beam%3Acoder%3Avarint%3Av1%2A%13beam%3Acoder%3Abytes%3Av1%2A%13beam%3Acoder%3Atimer%3Av1%2A%1Bbeam%3Acoder%3Aglobal_window%3Av1%2A%1Dbeam%3Acoder%3Ainterval_window%3Av1%2A%16beam%3Acoder%3Aiterable%3Av1%2A%23beam%3Acoder%3Astate_backed_iterable%3Av1%2A%1Cbeam%3Acoder%3Awindowed_value%3Av1%2A%22beam%3Acoder%3Aparam_windowed_value%3Av1%2A%14beam%3Acoder%3Adouble%3Av1%2A%19beam%3Acoder%3Astring_utf8%3Av1%2A%1Bbeam%3Acoder%3Alength_prefix%3Av1%2A%12beam%3Acoder%3Abool%3Av1%2A%10beam%3Acoder%3Akv%3Av1%2A%11beam%3Acoder%3Arow%3Av1%2A%23beam%3Aprotocol%3Aprogress_reporting%3Av0%2A%1Ebeam%3Aprotocol%3Aworker_status%3Av1%2A%3Abeam%3Aversion%3Asdk_base%3Aapache/beam_python2.7_sdk%3A2.25.0.dev2q%0A%1Abeam%3Aartifact%3Atype%3Afile%3Av1%12%1D%0A%1Bpostcommit_requirements.txt%1A%20beam%3Aartifact%3Arole%3Astaging_to%3Av1%22%12%0A%10requirements.txt2%9B%01%0A%1Abeam%3Aartifact%3Atype%3Afile%3Av1%12%3D%0A%3B/tmp/dataflow-requirements-cache/parameterized-0.7.4.tar.gz%1A%20beam%3Aartifact%3Arole%3Astaging_to%3Av1%22%1C%0A%1Aparameterized-0.7.4.tar.gz2%89%01%0A%1Abeam%3Aartifact%3Atype%3Afile%3Av1%124%0A2/tmp/dataflow-requirements-cache/mock-2.0.0.tar.gz%1A%20beam%3Aartifact%3Arole%3Astaging_to%3Av1%22%13%0A%11mock-2.0.0.tar.gz2%89%01%0A%1Abeam%3Aartifact%3Atype%3Afile%3Av1%124%0A2/tmp/dataflow-requirements-cache/six-1.15.0.tar.gz%1A%20beam%3Aartifact%3Arole%3Astaging_to%3Av1%22%13%0A%11six-1.15.0.tar.gz2%91%01%0A%1Abeam%3Aartifact%3Atype%3Afile%3Av1%128%0A6/tmp/dataflow-requirements-cache/funcsigs-1.0.2.tar.gz%1A%20beam%3Aartifact%3Arole%3Astaging_to%3Av1%22%17%0A%15funcsigs-1.0.2.tar.gz2%87%01%0A%1Abeam%3Aartifact%3Atype%3Afile%3Av1%123%0A1/tmp/dataflow-requirements-cache/pbr-5.4.5.tar.gz%1A%20beam%3Aartifact%3Arole%3Astaging_to%3Av1%22%12%0A%10pbr-5.4.5.tar.gz2%97%01%0A%1Abeam%3Aartifact%3Atype%3Afile%3Av1%12%3B%0A9/tmp/dataflow-requirements-cache/PyHamcrest-1.10.1.tar.gz%1A%20beam%3Aartifact%3Arole%3Astaging_to%3Av1%22%1A%0A%18PyHamcrest-1.10.1.tar.gz2%C3%01%0A%1Abeam%3Aartifact%3Atype%3Afile%3Av1%12h%0Af<https://ci-beam.apache.org/job/beam_PostCommit_Python2/ws/src/sdks/python/build/apache-beam.tar.gz%1A%20beam%3Aartifact%3Arole%3Astaging_to%3Av1%22%19%0A%17dataflow_python_sdk.tar2%9B%02%0A%1Abeam%3Aartifact%3Atype%3Afile%3Av1%12%C3%01%0A%C0%01/home/jenkins/jenkins-slave/workspace/beam_PostCommit_Python2/src/runners/google-cloud-dataflow-java/worker/build/libs/beam-runners-google-cloud-dataflow-java-fn-api-worker-2.25.0-SNAPSHOT.jar%1A%20beam%3Aartifact%3Arole%3Astaging_to%3Av1%22%15%0A%13dataflow-worker.jarjx%0A%22%0A%20beam%3Awindow_fn%3Aglobal_windows%3Av1%10%01%1A%1Dref_Coder_GlobalWindowCoder_1%22%02%3A%00%28%010%018%01H%01Z%25ref_Environment_default_environment_1",>
"user_name": "GroupByKey"
}
},
{
"kind": "ParallelDo",
"name": "s5",
"properties": {
"display_data": [
{
"key": "fn",
"label": "Transform Function",
"namespace": "apache_beam.transforms.core.CallableWrapperDoFn",
"type": "STRING",
"value": "<lambda>"
},
{
"key": "fn",
"label": "Transform Function",
"namespace": "apache_beam.transforms.core.ParDo",
"shortValue": "CallableWrapperDoFn",
"type": "STRING",
"value": "apache_beam.transforms.core.CallableWrapperDoFn"
}
],
"non_parallel_inputs": {},
"output_info": [
{
"encoding": {
"@type": "kind:windowed_value",
"component_encodings": [
{
"@type": "FastPrimitivesCoder$<string of 176 bytes>",
"component_encodings": [
{
"@type": "FastPrimitivesCoder$<string of 176 bytes>",
"component_encodings": [],
"pipeline_proto_coder_id": "ref_Coder_FastPrimitivesCoder_4"
},
{
"@type": "FastPrimitivesCoder$<string of 176 bytes>",
"component_encodings": [],
"pipeline_proto_coder_id": "ref_Coder_FastPrimitivesCoder_4"
}
],
"is_pair_like": true,
"pipeline_proto_coder_id": "ref_Coder_FastPrimitivesCoder_4"
},
{
"@type": "kind:global_window"
}
],
"is_wrapper": true
},
"output_name": "None",
"user_name": "m_out.out"
}
],
"parallel_input": {
"@type": "OutputReference",
"output_name": "out",
"step_name": "s4"
},
"serialized_fn": "<string of 1184 bytes>",
"user_name": "m_out"
}
}
],
"type": "JOB_TYPE_BATCH"
}
INFO:apache_beam.runners.dataflow.internal.apiclient:Create job: <Job
createTime: u'2020-08-24T19:08:25.518387Z'
currentStateTime: u'1970-01-01T00:00:00Z'
id: u'2020-08-24_12_08_24-2266394923947398840'
location: u'us-central1'
name: u'beamapp-jenkins-0824190811-375082'
projectId: u'apache-beam-testing'
stageStates: []
startTime: u'2020-08-24T19:08:25.518387Z'
steps: []
tempFiles: []
type: TypeValueValuesEnum(JOB_TYPE_BATCH, 1)>
INFO:apache_beam.runners.dataflow.internal.apiclient:Created job with id: [2020-08-24_12_08_24-2266394923947398840]
INFO:apache_beam.runners.dataflow.internal.apiclient:Submitted job: 2020-08-24_12_08_24-2266394923947398840
INFO:apache_beam.runners.dataflow.internal.apiclient:To access the Dataflow monitoring console, please navigate to https://console.cloud.google.com/dataflow/jobs/us-central1/2020-08-24_12_08_24-2266394923947398840?project=apache-beam-testing
Runs streaming Dataflow job and verifies that user metrics are reported ... ok
INFO:apache_beam.runners.dataflow.dataflow_runner:Job 2020-08-24_12_08_24-2266394923947398840 is in state JOB_STATE_RUNNING
INFO:apache_beam.runners.dataflow.dataflow_runner:2020-08-24T19:08:24.269Z: JOB_MESSAGE_DETAILED: Autoscaling is enabled for job 2020-08-24_12_08_24-2266394923947398840. The number of workers will be between 1 and 1000.
INFO:apache_beam.runners.dataflow.dataflow_runner:2020-08-24T19:08:24.269Z: JOB_MESSAGE_DETAILED: Autoscaling was automatically enabled for job 2020-08-24_12_08_24-2266394923947398840.
INFO:apache_beam.runners.dataflow.dataflow_runner:2020-08-24T19:08:28.170Z: JOB_MESSAGE_BASIC: Worker configuration: n1-standard-1 in us-central1-b.
INFO:apache_beam.runners.dataflow.dataflow_runner:2020-08-24T19:08:30.089Z: JOB_MESSAGE_DETAILED: Expanding CoGroupByKey operations into optimizable parts.
INFO:apache_beam.runners.dataflow.dataflow_runner:2020-08-24T19:08:30.129Z: JOB_MESSAGE_DEBUG: Combiner lifting skipped for step GroupByKey: GroupByKey not followed by a combiner.
INFO:apache_beam.runners.dataflow.dataflow_runner:2020-08-24T19:08:30.169Z: JOB_MESSAGE_DETAILED: Expanding GroupByKey operations into optimizable parts.
INFO:apache_beam.runners.dataflow.dataflow_runner:2020-08-24T19:08:30.199Z: JOB_MESSAGE_DETAILED: Lifting ValueCombiningMappingFns into MergeBucketsMappingFns
INFO:apache_beam.runners.dataflow.dataflow_runner:2020-08-24T19:08:30.248Z: JOB_MESSAGE_DEBUG: Annotating graph with Autotuner information.
INFO:apache_beam.runners.dataflow.dataflow_runner:2020-08-24T19:08:30.290Z: JOB_MESSAGE_DETAILED: Fusing adjacent ParDo, Read, Write, and Flatten operations
INFO:apache_beam.runners.dataflow.dataflow_runner:2020-08-24T19:08:30.325Z: JOB_MESSAGE_DETAILED: Fusing consumer metrics into Create/Read
INFO:apache_beam.runners.dataflow.dataflow_runner:2020-08-24T19:08:30.362Z: JOB_MESSAGE_DETAILED: Fusing consumer map_to_common_key into metrics
INFO:apache_beam.runners.dataflow.dataflow_runner:2020-08-24T19:08:30.395Z: JOB_MESSAGE_DETAILED: Fusing consumer GroupByKey/Reify into map_to_common_key
INFO:apache_beam.runners.dataflow.dataflow_runner:2020-08-24T19:08:30.429Z: JOB_MESSAGE_DETAILED: Fusing consumer GroupByKey/Write into GroupByKey/Reify
INFO:apache_beam.runners.dataflow.dataflow_runner:2020-08-24T19:08:30.456Z: JOB_MESSAGE_DETAILED: Fusing consumer GroupByKey/GroupByWindow into GroupByKey/Read
INFO:apache_beam.runners.dataflow.dataflow_runner:2020-08-24T19:08:30.494Z: JOB_MESSAGE_DETAILED: Fusing consumer m_out into GroupByKey/GroupByWindow
INFO:apache_beam.runners.dataflow.dataflow_runner:2020-08-24T19:08:30.530Z: JOB_MESSAGE_DEBUG: Workflow config is missing a default resource spec.
INFO:apache_beam.runners.dataflow.dataflow_runner:2020-08-24T19:08:30.562Z: JOB_MESSAGE_DEBUG: Adding StepResource setup and teardown to workflow graph.
INFO:apache_beam.runners.dataflow.dataflow_runner:2020-08-24T19:08:30.600Z: JOB_MESSAGE_DEBUG: Adding workflow start and stop steps.
INFO:apache_beam.runners.dataflow.dataflow_runner:2020-08-24T19:08:30.623Z: JOB_MESSAGE_DEBUG: Assigning stage ids.
INFO:apache_beam.runners.dataflow.dataflow_runner:2020-08-24T19:08:30.799Z: JOB_MESSAGE_DEBUG: Executing wait step start13
INFO:apache_beam.runners.dataflow.dataflow_runner:2020-08-24T19:08:30.861Z: JOB_MESSAGE_BASIC: Executing operation GroupByKey/Create
INFO:apache_beam.runners.dataflow.dataflow_runner:2020-08-24T19:08:30.907Z: JOB_MESSAGE_DEBUG: Starting worker pool setup.
INFO:apache_beam.runners.dataflow.dataflow_runner:2020-08-24T19:08:30.934Z: JOB_MESSAGE_BASIC: Starting 1 workers in us-central1-b...
INFO:apache_beam.runners.dataflow.dataflow_runner:2020-08-24T19:08:30.981Z: JOB_MESSAGE_BASIC: Finished operation GroupByKey/Create
INFO:apache_beam.runners.dataflow.dataflow_runner:2020-08-24T19:08:31.058Z: JOB_MESSAGE_DEBUG: Value "GroupByKey/Session" materialized.
INFO:apache_beam.runners.dataflow.dataflow_runner:2020-08-24T19:08:31.134Z: JOB_MESSAGE_BASIC: Executing operation Create/Read+metrics+map_to_common_key+GroupByKey/Reify+GroupByKey/Write
INFO:apache_beam.runners.dataflow.dataflow_runner:2020-08-24T19:08:50.296Z: JOB_MESSAGE_WARNING: Your project already contains 100 Dataflow-created metric descriptors and Stackdriver will not create new Dataflow custom metrics for this job. Each unique user-defined metric name (independent of the DoFn in which it is defined) produces a new metric descriptor. To delete old / unused metric descriptors see https://developers.google.com/apis-explorer/#p/monitoring/v3/monitoring.projects.metricDescriptors.list and https://developers.google.com/apis-explorer/#p/monitoring/v3/monitoring.projects.metricDescriptors.delete
INFO:apache_beam.runners.dataflow.dataflow_runner:2020-08-24T19:08:57.966Z: JOB_MESSAGE_DETAILED: Autoscaling: Raised the number of workers to 1 based on the rate of progress in the currently running stage(s).
INFO:apache_beam.runners.dataflow.dataflow_runner:2020-08-24T19:09:18.675Z: JOB_MESSAGE_BASIC: Executing BigQuery import job "dataflow_job_17493079549994029574". You can check its status with the bq tool: "bq show -j --project_id=apache-beam-testing dataflow_job_17493079549994029574".
INFO:apache_beam.runners.dataflow.dataflow_runner:2020-08-24T19:09:29.545Z: JOB_MESSAGE_BASIC: BigQuery import job "dataflow_job_17493079549994029574" done.
INFO:apache_beam.runners.dataflow.dataflow_runner:2020-08-24T19:09:30.316Z: JOB_MESSAGE_BASIC: Finished operation read+write/NativeWrite
INFO:apache_beam.runners.dataflow.dataflow_runner:2020-08-24T19:09:30.448Z: JOB_MESSAGE_DEBUG: Executing success step success1
INFO:apache_beam.runners.dataflow.dataflow_runner:2020-08-24T19:09:30.520Z: JOB_MESSAGE_DETAILED: Cleaning up.
INFO:apache_beam.runners.dataflow.dataflow_runner:2020-08-24T19:09:30.762Z: JOB_MESSAGE_DEBUG: Starting worker pool teardown.
INFO:apache_beam.runners.dataflow.dataflow_runner:2020-08-24T19:09:30.797Z: JOB_MESSAGE_BASIC: Stopping worker pool...
INFO:apache_beam.runners.dataflow.dataflow_runner:2020-08-24T19:09:52.606Z: JOB_MESSAGE_BASIC: Finished operation Create/Read+InspectForDetails/ParDo(_InspectFn)+ParDo(CallableWrapperDoFn)/ParDo(CallableWrapperDoFn)+Type matches/WindowInto(WindowIntoFn)+Type matches/ToVoidKey+Type matches/Group/pair_with_1+Type matches/Group/GroupByKey/Reify+Type matches/Group/GroupByKey/Write
INFO:apache_beam.runners.dataflow.dataflow_runner:2020-08-24T19:09:55.784Z: JOB_MESSAGE_BASIC: Finished operation Type matches/Create/Read+Type matches/Group/pair_with_0+Type matches/Group/GroupByKey/Reify+Type matches/Group/GroupByKey/Write
INFO:apache_beam.runners.dataflow.dataflow_runner:2020-08-24T19:09:55.850Z: JOB_MESSAGE_BASIC: Executing operation Type matches/Group/GroupByKey/Close
INFO:apache_beam.runners.dataflow.dataflow_runner:2020-08-24T19:09:55.905Z: JOB_MESSAGE_BASIC: Finished operation Type matches/Group/GroupByKey/Close
INFO:apache_beam.runners.dataflow.dataflow_runner:2020-08-24T19:09:55.989Z: JOB_MESSAGE_BASIC: Executing operation Type matches/Group/GroupByKey/Read+Type matches/Group/GroupByKey/GroupByWindow+Type matches/Group/Map(_merge_tagged_vals_under_key)+Type matches/Unkey+Type matches/Match
INFO:apache_beam.runners.dataflow.dataflow_runner:2020-08-24T19:10:05.290Z: JOB_MESSAGE_BASIC: Finished operation Type matches/Group/GroupByKey/Read+Type matches/Group/GroupByKey/GroupByWindow+Type matches/Group/Map(_merge_tagged_vals_under_key)+Type matches/Unkey+Type matches/Match
INFO:apache_beam.runners.dataflow.dataflow_runner:2020-08-24T19:10:05.361Z: JOB_MESSAGE_DEBUG: Executing success step success19
INFO:apache_beam.runners.dataflow.dataflow_runner:2020-08-24T19:10:05.436Z: JOB_MESSAGE_DETAILED: Cleaning up.
INFO:apache_beam.runners.dataflow.dataflow_runner:2020-08-24T19:10:05.498Z: JOB_MESSAGE_DEBUG: Starting worker pool teardown.
INFO:apache_beam.runners.dataflow.dataflow_runner:2020-08-24T19:10:05.529Z: JOB_MESSAGE_BASIC: Stopping worker pool...
INFO:apache_beam.runners.dataflow.dataflow_runner:2020-08-24T19:10:20.835Z: JOB_MESSAGE_DETAILED: Autoscaling: Resized worker pool from 1 to 0.
INFO:apache_beam.runners.dataflow.dataflow_runner:2020-08-24T19:10:20.881Z: JOB_MESSAGE_BASIC: Worker pool stopped.
INFO:apache_beam.runners.dataflow.dataflow_runner:2020-08-24T19:10:20.911Z: JOB_MESSAGE_DEBUG: Tearing down pending resources...
INFO:apache_beam.runners.dataflow.dataflow_runner:Job 2020-08-24_12_03_42-15429304958515134391 is in state JOB_STATE_DONE
INFO:apache_beam.io.gcp.tests.bigquery_matcher:Attempting to perform query SELECT fruit from `python_query_to_table_15982958114684.output_table`; to BQ
DEBUG:google.auth._default:Checking None for explicit credentials as part of auth process...
DEBUG:google.auth._default:Checking Cloud SDK credentials as part of auth process...
DEBUG:google.auth._default:Cloud SDK credentials not found on disk; not using them
DEBUG:google.auth._default:Checking for App Engine runtime as part of auth process...
DEBUG:google.auth._default:No App Engine library was found so cannot authentication via App Engine Identity Credentials.
DEBUG:google.auth.transport._http_client:Making request: GET http://169.254.169.254
DEBUG:google.auth.transport._http_client:Making request: GET http://metadata.google.internal/computeMetadata/v1/project/project-id
DEBUG:urllib3.util.retry:Converted retries value: 3 -> Retry(total=3, connect=None, read=None, redirect=None, status=None)
DEBUG:google.auth.transport.requests:Making request: GET http://metadata.google.internal/computeMetadata/v1/instance/service-accounts/default/?recursive=true
DEBUG:urllib3.connectionpool:Starting new HTTP connection (1): metadata.google.internal:80
DEBUG:urllib3.connectionpool:http://metadata.google.internal:80 "GET /computeMetadata/v1/instance/service-accounts/default/?recursive=true HTTP/1.1" 200 144
DEBUG:google.auth.transport.requests:Making request: GET http://metadata.google.internal/computeMetadata/v1/instance/service-accounts/844138762903-compute@developer.gserviceaccount.com/token
DEBUG:urllib3.connectionpool:http://metadata.google.internal:80 "GET /computeMetadata/v1/instance/service-accounts/844138762903-compute@developer.gserviceaccount.com/token HTTP/1.1" 200 221
DEBUG:urllib3.connectionpool:Starting new HTTPS connection (1): bigquery.googleapis.com:443
DEBUG:urllib3.connectionpool:https://bigquery.googleapis.com:443 "POST /bigquery/v2/projects/apache-beam-testing/jobs HTTP/1.1" 200 None
DEBUG:urllib3.connectionpool:https://bigquery.googleapis.com:443 "GET /bigquery/v2/projects/apache-beam-testing/queries/3167f3af-30a6-4313-9921-01dadff74b24?location=US&maxResults=0 HTTP/1.1" 200 None
DEBUG:urllib3.connectionpool:https://bigquery.googleapis.com:443 "GET /bigquery/v2/projects/apache-beam-testing/datasets/_7357fab0f784d2a7327ddbe81cdd1f4ca7e429cd/tables/anon8c6d95137425f94572a91f2a21482832b4633343/data HTTP/1.1" 200 None
INFO:apache_beam.io.gcp.tests.bigquery_matcher:Read from given query (SELECT fruit from `python_query_to_table_15982958114684.output_table`;), total rows 2
INFO:apache_beam.io.gcp.tests.bigquery_matcher:Generate checksum: 3b2cefe89863bf492d48f7d4da960f2999802a89
test_big_query_legacy_sql (apache_beam.io.gcp.big_query_query_to_table_it_test.BigQueryQueryToTableIT) ... ok
test_big_query_new_types (apache_beam.io.gcp.big_query_query_to_table_it_test.BigQueryQueryToTableIT) ... ok
test_big_query_new_types_avro (apache_beam.io.gcp.big_query_query_to_table_it_test.BigQueryQueryToTableIT) ... ok
test_big_query_new_types_native (apache_beam.io.gcp.big_query_query_to_table_it_test.BigQueryQueryToTableIT) ... ok
test_big_query_standard_sql (apache_beam.io.gcp.big_query_query_to_table_it_test.BigQueryQueryToTableIT) ... ok
test_big_query_standard_sql_kms_key_native (apache_beam.io.gcp.big_query_query_to_table_it_test.BigQueryQueryToTableIT) ... ok
INFO:apache_beam.runners.dataflow.dataflow_runner:2020-08-24T19:10:42.394Z: JOB_MESSAGE_DETAILED: Workers have started successfully.
INFO:apache_beam.runners.dataflow.dataflow_runner:2020-08-24T19:10:42.461Z: JOB_MESSAGE_DETAILED: Workers have started successfully.
INFO:apache_beam.runners.dataflow.dataflow_runner:2020-08-24T19:10:57.976Z: JOB_MESSAGE_DETAILED: Autoscaling: Resized worker pool from 1 to 0.
INFO:apache_beam.runners.dataflow.dataflow_runner:2020-08-24T19:10:58.024Z: JOB_MESSAGE_BASIC: Worker pool stopped.
INFO:apache_beam.runners.dataflow.dataflow_runner:2020-08-24T19:10:58.057Z: JOB_MESSAGE_DEBUG: Tearing down pending resources...
INFO:apache_beam.runners.dataflow.dataflow_runner:Job 2020-08-24_12_04_16-1940982967815736438 is in state JOB_STATE_DONE
test_deidentification (apache_beam.ml.gcp.cloud_dlp_it_test.CloudDLPIT) ... ok
test_inspection (apache_beam.ml.gcp.cloud_dlp_it_test.CloudDLPIT) ... ok
INFO:apache_beam.runners.dataflow.dataflow_runner:2020-08-24T19:11:52.996Z: JOB_MESSAGE_BASIC: Finished operation assert_that/Create/Read+assert_that/Group/pair_with_0+assert_that/Group/GroupByKey/Reify+assert_that/Group/GroupByKey/Write
INFO:apache_beam.runners.dataflow.dataflow_runner:2020-08-24T19:11:59.758Z: JOB_MESSAGE_BASIC: Finished operation Create/Read+ExternalTransform(simple)/Map(<lambda at external_it_test.py:43>)+assert_that/WindowInto(WindowIntoFn)+assert_that/ToVoidKey+assert_that/Group/pair_with_1+assert_that/Group/GroupByKey/Reify+assert_that/Group/GroupByKey/Write
INFO:apache_beam.runners.dataflow.dataflow_runner:2020-08-24T19:11:59.970Z: JOB_MESSAGE_BASIC: Executing operation assert_that/Group/GroupByKey/Close
INFO:apache_beam.runners.dataflow.dataflow_runner:2020-08-24T19:12:00.082Z: JOB_MESSAGE_BASIC: Finished operation assert_that/Group/GroupByKey/Close
INFO:apache_beam.runners.dataflow.dataflow_runner:2020-08-24T19:12:00.158Z: JOB_MESSAGE_BASIC: Executing operation assert_that/Group/GroupByKey/Read+assert_that/Group/GroupByKey/GroupByWindow+assert_that/Group/Map(_merge_tagged_vals_under_key)+assert_that/Unkey+assert_that/Match
INFO:apache_beam.runners.dataflow.dataflow_runner:2020-08-24T19:12:09.319Z: JOB_MESSAGE_BASIC: Finished operation assert_that/Group/GroupByKey/Read+assert_that/Group/GroupByKey/GroupByWindow+assert_that/Group/Map(_merge_tagged_vals_under_key)+assert_that/Unkey+assert_that/Match
INFO:apache_beam.runners.dataflow.dataflow_runner:2020-08-24T19:12:09.409Z: JOB_MESSAGE_DEBUG: Executing success step success19
INFO:apache_beam.runners.dataflow.dataflow_runner:2020-08-24T19:12:09.490Z: JOB_MESSAGE_DETAILED: Cleaning up.
INFO:apache_beam.runners.dataflow.dataflow_runner:2020-08-24T19:12:09.573Z: JOB_MESSAGE_DEBUG: Starting worker pool teardown.
INFO:apache_beam.runners.dataflow.dataflow_runner:2020-08-24T19:12:09.605Z: JOB_MESSAGE_BASIC: Stopping worker pool...
INFO:apache_beam.runners.dataflow.dataflow_runner:2020-08-24T19:13:04.409Z: JOB_MESSAGE_DETAILED: Autoscaling: Resized worker pool from 1 to 0.
INFO:apache_beam.runners.dataflow.dataflow_runner:2020-08-24T19:13:04.451Z: JOB_MESSAGE_BASIC: Worker pool stopped.
INFO:apache_beam.runners.dataflow.dataflow_runner:2020-08-24T19:13:04.484Z: JOB_MESSAGE_DEBUG: Tearing down pending resources...
INFO:apache_beam.runners.dataflow.dataflow_runner:Job 2020-08-24_12_05_59-12102870425136478780 is in state JOB_STATE_DONE
test_job_python_from_python_it (apache_beam.transforms.external_it_test.ExternalTransformIT) ... ok
INFO:apache_beam.runners.dataflow.dataflow_runner:2020-08-24T19:14:22.985Z: JOB_MESSAGE_BASIC: Finished operation Create/Read+metrics+map_to_common_key+GroupByKey/Reify+GroupByKey/Write
INFO:apache_beam.runners.dataflow.dataflow_runner:2020-08-24T19:14:23.084Z: JOB_MESSAGE_BASIC: Executing operation GroupByKey/Close
INFO:apache_beam.runners.dataflow.dataflow_runner:2020-08-24T19:14:23.132Z: JOB_MESSAGE_BASIC: Finished operation GroupByKey/Close
INFO:apache_beam.runners.dataflow.dataflow_runner:2020-08-24T19:14:23.201Z: JOB_MESSAGE_BASIC: Executing operation GroupByKey/Read+GroupByKey/GroupByWindow+m_out
INFO:apache_beam.runners.dataflow.dataflow_runner:2020-08-24T19:14:28.314Z: JOB_MESSAGE_BASIC: Finished operation GroupByKey/Read+GroupByKey/GroupByWindow+m_out
INFO:apache_beam.runners.dataflow.dataflow_runner:2020-08-24T19:14:28.373Z: JOB_MESSAGE_DEBUG: Executing success step success11
INFO:apache_beam.runners.dataflow.dataflow_runner:2020-08-24T19:14:28.447Z: JOB_MESSAGE_DETAILED: Cleaning up.
INFO:apache_beam.runners.dataflow.dataflow_runner:2020-08-24T19:14:28.498Z: JOB_MESSAGE_DEBUG: Starting worker pool teardown.
INFO:apache_beam.runners.dataflow.dataflow_runner:2020-08-24T19:14:28.526Z: JOB_MESSAGE_BASIC: Stopping worker pool...
INFO:apache_beam.runners.dataflow.dataflow_runner:2020-08-24T19:15:19.967Z: JOB_MESSAGE_DETAILED: Autoscaling: Resized worker pool from 1 to 0.
INFO:apache_beam.runners.dataflow.dataflow_runner:2020-08-24T19:15:20.006Z: JOB_MESSAGE_BASIC: Worker pool stopped.
INFO:apache_beam.runners.dataflow.dataflow_runner:2020-08-24T19:15:20.045Z: JOB_MESSAGE_DEBUG: Tearing down pending resources...
INFO:apache_beam.runners.dataflow.dataflow_runner:Job 2020-08-24_12_08_24-2266394923947398840 is in state JOB_STATE_DONE
test_metrics_fnapi_it (apache_beam.runners.dataflow.dataflow_exercise_metrics_pipeline_test.ExerciseMetricsPipelineTest) ... ok
test_metrics_it (apache_beam.runners.dataflow.dataflow_exercise_metrics_pipeline_test.ExerciseMetricsPipelineTest) ... ok
----------------------------------------------------------------------
XML: nosetests-postCommitIT-df-py27.xml
----------------------------------------------------------------------
XML: <https://ci-beam.apache.org/job/beam_PostCommit_Python2/ws/src/sdks/python/nosetests.xml>
----------------------------------------------------------------------
Ran 66 tests in 3965.875s
OK (SKIP=7)
FAILURE: Build completed with 2 failures.
1: Task failed with an exception.
-----------
* What went wrong:
Execution failed for task ':release:go-licenses:java:dockerRun'.
> Process 'command 'docker'' finished with non-zero exit value 125
* Try:
Run with --stacktrace option to get the stack trace. Run with --info or --debug option to get more log output. Run with --scan to get full insights.
==============================================================================
2: Task failed with an exception.
-----------
* What went wrong:
Execution failed for task ':release:go-licenses:py:dockerRun'.
> Process 'command 'docker'' finished with non-zero exit value 125
* Try:
Run with --stacktrace option to get the stack trace. Run with --info or --debug option to get more log output. Run with --scan to get full insights.
==============================================================================
* Get more help at https://help.gradle.org
Deprecated Gradle features were used in this build, making it incompatible with Gradle 6.0.
Use '--warning-mode all' to show the individual deprecation warnings.
See https://docs.gradle.org/5.2.1/userguide/command_line_interface.html#sec:command_line_warnings
BUILD FAILED in 1h 15m 13s
163 actionable tasks: 156 executed, 3 from cache, 4 up-to-date
Publishing build scan...
https://gradle.com/s/t7z2trckr5i6c
Build step 'Invoke Gradle script' changed build result to FAILURE
Build step 'Invoke Gradle script' marked build as failure
---------------------------------------------------------------------
To unsubscribe, e-mail: builds-unsubscribe@beam.apache.org
For additional commands, e-mail: builds-help@beam.apache.org