You are viewing a plain text version of this content. The canonical link for it is here.
Posted to yarn-dev@hadoop.apache.org by Apache Jenkins Server <je...@builds.apache.org> on 2015/03/11 21:08:40 UTC
Failed: YARN-3335 PreCommit Build #6922
Jira: https://issues.apache.org/jira/browse/YARN-3335
Build: https://builds.apache.org/job/PreCommit-YARN-Build/6922/
###################################################################################
########################## LAST 60 LINES OF THE CONSOLE ###########################
Started by remote host 127.0.0.1
Building remotely on H9 (Mapreduce Falcon Hadoop Pig Zookeeper Tez Hdfs) in workspace /home/jenkins/jenkins-slave/workspace/PreCommit-YARN-Build
> git rev-parse --is-inside-work-tree # timeout=10
Fetching changes from the remote Git repository
> git config remote.origin.url https://git-wip-us.apache.org/repos/asf/hadoop.git # timeout=10
Cleaning workspace
> git rev-parse --verify HEAD # timeout=10
Resetting working tree
> git reset --hard # timeout=10
> git clean -fdx # timeout=10
Fetching upstream changes from https://git-wip-us.apache.org/repos/asf/hadoop.git
> git --version # timeout=10
> git fetch --tags --progress https://git-wip-us.apache.org/repos/asf/hadoop.git +refs/heads/*:refs/remotes/origin/*
FATAL: Failed to fetch from https://git-wip-us.apache.org/repos/asf/hadoop.git
hudson.plugins.git.GitException: Failed to fetch from https://git-wip-us.apache.org/repos/asf/hadoop.git
at hudson.plugins.git.GitSCM.fetchFrom(GitSCM.java:647)
at hudson.plugins.git.GitSCM.retrieveChanges(GitSCM.java:889)
at hudson.plugins.git.GitSCM.checkout(GitSCM.java:914)
at hudson.model.AbstractProject.checkout(AbstractProject.java:1252)
at hudson.model.AbstractBuild$AbstractBuildExecution.defaultCheckout(AbstractBuild.java:615)
at jenkins.scm.SCMCheckoutStrategy.checkout(SCMCheckoutStrategy.java:86)
at hudson.model.AbstractBuild$AbstractBuildExecution.run(AbstractBuild.java:524)
at hudson.model.Run.execute(Run.java:1706)
at hudson.model.FreeStyleBuild.run(FreeStyleBuild.java:43)
at hudson.model.ResourceController.execute(ResourceController.java:88)
at hudson.model.Executor.run(Executor.java:232)
Caused by: hudson.plugins.git.GitException: Command "git fetch --tags --progress https://git-wip-us.apache.org/repos/asf/hadoop.git +refs/heads/*:refs/remotes/origin/*" returned status code 128:
stdout:
stderr: fatal: unable to access 'https://git-wip-us.apache.org/repos/asf/hadoop.git/': Could not resolve host: git-wip-us.apache.org
at org.jenkinsci.plugins.gitclient.CliGitAPIImpl.launchCommandIn(CliGitAPIImpl.java:1435)
at org.jenkinsci.plugins.gitclient.CliGitAPIImpl.launchCommandWithCredentials(CliGitAPIImpl.java:1223)
at org.jenkinsci.plugins.gitclient.CliGitAPIImpl.access$300(CliGitAPIImpl.java:85)
at org.jenkinsci.plugins.gitclient.CliGitAPIImpl$1.execute(CliGitAPIImpl.java:280)
at org.jenkinsci.plugins.gitclient.RemoteGitImpl$CommandInvocationHandler$1.call(RemoteGitImpl.java:153)
at org.jenkinsci.plugins.gitclient.RemoteGitImpl$CommandInvocationHandler$1.call(RemoteGitImpl.java:146)
at hudson.remoting.UserRequest.perform(UserRequest.java:118)
at hudson.remoting.UserRequest.perform(UserRequest.java:48)
at hudson.remoting.Request$2.run(Request.java:328)
at hudson.remoting.InterceptingExecutorService$1.call(InterceptingExecutorService.java:72)
at java.util.concurrent.FutureTask.run(FutureTask.java:262)
at java.util.concurrent.ThreadPoolExecutor.runWorker(ThreadPoolExecutor.java:1145)
at java.util.concurrent.ThreadPoolExecutor$Worker.run(ThreadPoolExecutor.java:615)
at java.lang.Thread.run(Thread.java:745)
###################################################################################
############################## FAILED TESTS (if any) ##############################
No tests ran.
Failed: YARN-3154 PreCommit Build #6924
Posted by Apache Jenkins Server <je...@builds.apache.org>.
Jira: https://issues.apache.org/jira/browse/YARN-3154
Build: https://builds.apache.org/job/PreCommit-YARN-Build/6924/
###################################################################################
########################## LAST 60 LINES OF THE CONSOLE ###########################
[...truncated 3727 lines...]
{color:red}-1 overall{color}. Here are the results of testing the latest attachment
http://issues.apache.org/jira/secure/attachment/12704007/YARN-3154.4.patch
against trunk revision 344d7cb.
{color:green}+1 @author{color}. The patch does not contain any @author tags.
{color:green}+1 tests included{color}. The patch appears to include 3 new or modified test files.
{color:green}+1 javac{color}. The applied patch does not increase the total number of javac compiler warnings.
{color:green}+1 javadoc{color}. There were no new javadoc warning messages.
{color:green}+1 eclipse:eclipse{color}. The patch built with eclipse:eclipse.
{color:red}-1 findbugs{color}. The patch appears to introduce 5 new Findbugs (version 2.0.3) warnings.
{color:green}+1 release audit{color}. The applied patch does not increase the total number of release audit warnings.
{color:red}-1 core tests{color}. The patch failed these unit tests in hadoop-yarn-project/hadoop-yarn/hadoop-yarn-api hadoop-yarn-project/hadoop-yarn/hadoop-yarn-common hadoop-yarn-project/hadoop-yarn/hadoop-yarn-server/hadoop-yarn-server-nodemanager hadoop-yarn-project/hadoop-yarn/hadoop-yarn-server/hadoop-yarn-server-resourcemanager:
org.apache.hadoop.yarn.server.resourcemanager.scheduler.fair.TestAllocationFileLoaderService
org.apache.hadoop.yarn.server.resourcemanager.TestRMRestart
org.apache.hadoop.yarn.server.resourcemanager.scheduler.capacity.TestCapacitySchedulerNodeLabelUpdate
Test results: https://builds.apache.org/job/PreCommit-YARN-Build/6924//testReport/
Findbugs warnings: https://builds.apache.org/job/PreCommit-YARN-Build/6924//artifact/patchprocess/newPatchFindbugsWarningshadoop-yarn-server-resourcemanager.html
Console output: https://builds.apache.org/job/PreCommit-YARN-Build/6924//console
This message is automatically generated.
======================================================================
======================================================================
Adding comment to Jira.
======================================================================
======================================================================
Comment added.
7d7b02aee5e7c4d6cf7d2a6f6476fb8f5ea40bad logged out
======================================================================
======================================================================
Finished build.
======================================================================
======================================================================
Build step 'Execute shell' marked build as failure
Archiving artifacts
[description-setter] Could not determine description.
Recording test results
Email was triggered for: Failure
Sending email for trigger: Failure
###################################################################################
############################## FAILED TESTS (if any) ##############################
3 tests failed.
REGRESSION: org.apache.hadoop.yarn.server.resourcemanager.TestRMRestart.testRMRestartGetApplicationList[1]
Error Message:
rMAppManager.logApplicationSummary(
isA(org.apache.hadoop.yarn.api.records.ApplicationId)
);
Wanted 3 times:
-> at org.apache.hadoop.yarn.server.resourcemanager.TestRMRestart.testRMRestartGetApplicationList(TestRMRestart.java:969)
But was 2 times:
-> at org.apache.hadoop.yarn.server.resourcemanager.RMAppManager.handle(RMAppManager.java:66)
Stack Trace:
org.mockito.exceptions.verification.TooLittleActualInvocations:
rMAppManager.logApplicationSummary(
isA(org.apache.hadoop.yarn.api.records.ApplicationId)
);
Wanted 3 times:
-> at org.apache.hadoop.yarn.server.resourcemanager.TestRMRestart.testRMRestartGetApplicationList(TestRMRestart.java:969)
But was 2 times:
-> at org.apache.hadoop.yarn.server.resourcemanager.RMAppManager.handle(RMAppManager.java:66)
at org.apache.hadoop.yarn.server.resourcemanager.TestRMRestart.testRMRestartGetApplicationList(TestRMRestart.java:969)
REGRESSION: org.apache.hadoop.yarn.server.resourcemanager.scheduler.capacity.TestCapacitySchedulerNodeLabelUpdate.testNodeUpdate
Error Message:
test timed out after 30000 milliseconds
Stack Trace:
java.lang.Exception: test timed out after 30000 milliseconds
at java.net.Inet4AddressImpl.lookupAllHostAddr(Native Method)
at java.net.InetAddress$1.lookupAllHostAddr(InetAddress.java:901)
at java.net.InetAddress.getAddressesFromNameService(InetAddress.java:1293)
at java.net.InetAddress.getAllByName0(InetAddress.java:1246)
at java.net.InetAddress.getAllByName(InetAddress.java:1162)
at java.net.InetAddress.getAllByName(InetAddress.java:1098)
at java.net.InetAddress.getByName(InetAddress.java:1048)
at org.apache.hadoop.net.NetUtils.normalizeHostName(NetUtils.java:563)
at org.apache.hadoop.yarn.server.resourcemanager.NodesListManager.isValidNode(NodesListManager.java:147)
at org.apache.hadoop.yarn.server.resourcemanager.ResourceTrackerService.nodeHeartbeat(ResourceTrackerService.java:367)
at org.apache.hadoop.yarn.server.resourcemanager.MockNM.nodeHeartbeat(MockNM.java:178)
at org.apache.hadoop.yarn.server.resourcemanager.MockNM.nodeHeartbeat(MockNM.java:136)
at org.apache.hadoop.yarn.server.resourcemanager.MockRM.waitForState(MockRM.java:206)
at org.apache.hadoop.yarn.server.resourcemanager.scheduler.capacity.TestCapacitySchedulerNodeLabelUpdate.testNodeUpdate(TestCapacitySchedulerNodeLabelUpdate.java:157)
REGRESSION: org.apache.hadoop.yarn.server.resourcemanager.scheduler.fair.TestAllocationFileLoaderService.testGetAllocationFileFromClasspath
Error Message:
null
Stack Trace:
java.lang.AssertionError: null
at org.junit.Assert.fail(Assert.java:86)
at org.junit.Assert.assertTrue(Assert.java:41)
at org.junit.Assert.assertTrue(Assert.java:52)
at org.apache.hadoop.yarn.server.resourcemanager.scheduler.fair.TestAllocationFileLoaderService.testGetAllocationFileFromClasspath(TestAllocationFileLoaderService.java:66)
Failed: YARN-3243 PreCommit Build #6923
Posted by Apache Jenkins Server <je...@builds.apache.org>.
Jira: https://issues.apache.org/jira/browse/YARN-3243
Build: https://builds.apache.org/job/PreCommit-YARN-Build/6923/
###################################################################################
########################## LAST 60 LINES OF THE CONSOLE ###########################
[...truncated 4168 lines...]
{color:green}+1 tests included{color}. The patch appears to include 6 new or modified test files.
{color:green}+1 javac{color}. The applied patch does not increase the total number of javac compiler warnings.
{color:red}-1 javadoc{color}. The javadoc tool appears to have generated 43 warning messages.
See https://builds.apache.org/job/PreCommit-YARN-Build/6923//artifact/patchprocess/diffJavadocWarnings.txt for details.
{color:green}+1 eclipse:eclipse{color}. The patch built with eclipse:eclipse.
{color:red}-1 findbugs{color}. The patch appears to introduce 5 new Findbugs (version 2.0.3) warnings.
{color:green}+1 release audit{color}. The applied patch does not increase the total number of release audit warnings.
{color:red}-1 core tests{color}. The patch failed these unit tests in hadoop-yarn-project/hadoop-yarn/hadoop-yarn-api hadoop-yarn-project/hadoop-yarn/hadoop-yarn-common hadoop-yarn-project/hadoop-yarn/hadoop-yarn-server/hadoop-yarn-server-nodemanager hadoop-yarn-project/hadoop-yarn/hadoop-yarn-server/hadoop-yarn-server-resourcemanager:
org.apache.hadoop.yarn.server.resourcemanager.webapp.TestRMWebServicesDelegationTokenAuthentication
org.apache.hadoop.yarn.server.resourcemanager.webapp.TestRMWebappAuthentication
org.apache.hadoop.yarn.server.resourcemanager.webapp.TestRMWebAppFairScheduler
org.apache.hadoop.yarn.server.resourcemanager.webapp.TestRMWebServicesApps
org.apache.hadoop.yarn.server.resourcemanager.scheduler.capacity.TestContainerAllocation
Test results: https://builds.apache.org/job/PreCommit-YARN-Build/6923//testReport/
Findbugs warnings: https://builds.apache.org/job/PreCommit-YARN-Build/6923//artifact/patchprocess/newPatchFindbugsWarningshadoop-yarn-server-resourcemanager.html
Console output: https://builds.apache.org/job/PreCommit-YARN-Build/6923//console
This message is automatically generated.
======================================================================
======================================================================
Adding comment to Jira.
======================================================================
======================================================================
Comment added.
08fa15eb661e8c70f60f9fc02adc6c6fa50efebe logged out
======================================================================
======================================================================
Finished build.
======================================================================
======================================================================
Build step 'Execute shell' marked build as failure
Archiving artifacts
Sending artifact delta relative to PreCommit-YARN-Build #6921
Archived 30 artifacts
Archive block size is 32768
Received 3 blocks and 10023413 bytes
Compression is 1.0%
Took 4.1 sec
[description-setter] Could not determine description.
Recording test results
Email was triggered for: Failure
Sending email for trigger: Failure
###################################################################################
############################## FAILED TESTS (if any) ##############################
28 tests failed.
FAILED: org.apache.hadoop.yarn.server.resourcemanager.scheduler.capacity.TestContainerAllocation.testAMContainerAllocationWhenDNSUnavailable
Error Message:
test timed out after 30000 milliseconds
Stack Trace:
java.lang.Exception: test timed out after 30000 milliseconds
at java.net.Inet4AddressImpl.lookupAllHostAddr(Native Method)
at java.net.InetAddress$1.lookupAllHostAddr(InetAddress.java:901)
at java.net.InetAddress.getAddressesFromNameService(InetAddress.java:1293)
at java.net.InetAddress.getAllByName0(InetAddress.java:1246)
at java.net.InetAddress.getAllByName(InetAddress.java:1162)
at java.net.InetAddress.getAllByName(InetAddress.java:1098)
at java.net.InetAddress.getByName(InetAddress.java:1048)
at org.apache.hadoop.net.NetUtils.normalizeHostName(NetUtils.java:563)
at org.apache.hadoop.yarn.server.resourcemanager.NodesListManager.isValidNode(NodesListManager.java:147)
at org.apache.hadoop.yarn.server.resourcemanager.ResourceTrackerService.nodeHeartbeat(ResourceTrackerService.java:367)
at org.apache.hadoop.yarn.server.resourcemanager.MockNM.nodeHeartbeat(MockNM.java:178)
at org.apache.hadoop.yarn.server.resourcemanager.MockNM.nodeHeartbeat(MockNM.java:136)
at org.apache.hadoop.yarn.server.resourcemanager.MockRM.launchAM(MockRM.java:659)
at org.apache.hadoop.yarn.server.resourcemanager.MockRM.launchAndRegisterAM(MockRM.java:667)
at org.apache.hadoop.yarn.server.resourcemanager.scheduler.capacity.TestContainerAllocation.testAMContainerAllocationWhenDNSUnavailable(TestContainerAllocation.java:322)
FAILED: org.apache.hadoop.yarn.server.resourcemanager.webapp.TestRMWebAppFairScheduler.initializationError
Error Message:
org/apache/hadoop/yarn/event/EventHandler
Stack Trace:
java.lang.NoClassDefFoundError: org/apache/hadoop/yarn/event/EventHandler
at java.lang.ClassLoader.defineClass1(Native Method)
at java.lang.ClassLoader.defineClass(ClassLoader.java:800)
at java.security.SecureClassLoader.defineClass(SecureClassLoader.java:142)
at java.net.URLClassLoader.defineClass(URLClassLoader.java:449)
at java.net.URLClassLoader.access$100(URLClassLoader.java:71)
at java.net.URLClassLoader$1.run(URLClassLoader.java:361)
at java.net.URLClassLoader$1.run(URLClassLoader.java:355)
at java.security.AccessController.doPrivileged(Native Method)
at java.net.URLClassLoader.findClass(URLClassLoader.java:354)
at java.lang.ClassLoader.loadClass(ClassLoader.java:425)
at sun.misc.Launcher$AppClassLoader.loadClass(Launcher.java:308)
at java.lang.ClassLoader.loadClass(ClassLoader.java:358)
at java.lang.ClassLoader.defineClass1(Native Method)
at java.lang.ClassLoader.defineClass(ClassLoader.java:800)
at java.security.SecureClassLoader.defineClass(SecureClassLoader.java:142)
at java.net.URLClassLoader.defineClass(URLClassLoader.java:449)
at java.net.URLClassLoader.access$100(URLClassLoader.java:71)
at java.net.URLClassLoader$1.run(URLClassLoader.java:361)
at java.net.URLClassLoader$1.run(URLClassLoader.java:355)
at java.security.AccessController.doPrivileged(Native Method)
at java.net.URLClassLoader.findClass(URLClassLoader.java:354)
at java.lang.ClassLoader.loadClass(ClassLoader.java:425)
at sun.misc.Launcher$AppClassLoader.loadClass(Launcher.java:308)
at java.lang.ClassLoader.loadClass(ClassLoader.java:358)
at java.lang.ClassLoader.defineClass1(Native Method)
at java.lang.ClassLoader.defineClass(ClassLoader.java:800)
at java.security.SecureClassLoader.defineClass(SecureClassLoader.java:142)
at java.net.URLClassLoader.defineClass(URLClassLoader.java:449)
at java.net.URLClassLoader.access$100(URLClassLoader.java:71)
at java.net.URLClassLoader$1.run(URLClassLoader.java:361)
at java.net.URLClassLoader$1.run(URLClassLoader.java:355)
at java.security.AccessController.doPrivileged(Native Method)
at java.net.URLClassLoader.findClass(URLClassLoader.java:354)
at java.lang.ClassLoader.loadClass(ClassLoader.java:425)
at sun.misc.Launcher$AppClassLoader.loadClass(Launcher.java:308)
at java.lang.ClassLoader.loadClass(ClassLoader.java:358)
at java.lang.ClassLoader.defineClass1(Native Method)
at java.lang.ClassLoader.defineClass(ClassLoader.java:800)
at java.security.SecureClassLoader.defineClass(SecureClassLoader.java:142)
at java.net.URLClassLoader.defineClass(URLClassLoader.java:449)
at java.net.URLClassLoader.access$100(URLClassLoader.java:71)
at java.net.URLClassLoader$1.run(URLClassLoader.java:361)
at java.net.URLClassLoader$1.run(URLClassLoader.java:355)
at java.security.AccessController.doPrivileged(Native Method)
at java.net.URLClassLoader.findClass(URLClassLoader.java:354)
at java.lang.ClassLoader.loadClass(ClassLoader.java:425)
at sun.misc.Launcher$AppClassLoader.loadClass(Launcher.java:308)
at java.lang.ClassLoader.loadClass(ClassLoader.java:358)
at java.lang.Class.getDeclaredMethods0(Native Method)
at java.lang.Class.privateGetDeclaredMethods(Class.java:2531)
at java.lang.Class.getMethod0(Class.java:2774)
at java.lang.Class.getMethod(Class.java:1663)
at org.junit.internal.builders.SuiteMethodBuilder.hasSuiteMethod(SuiteMethodBuilder.java:18)
at org.junit.internal.builders.SuiteMethodBuilder.runnerForClass(SuiteMethodBuilder.java:10)
at org.junit.runners.model.RunnerBuilder.safeRunnerForClass(RunnerBuilder.java:59)
at org.junit.internal.builders.AllDefaultPossibilitiesBuilder.runnerForClass(AllDefaultPossibilitiesBuilder.java:26)
at org.junit.runners.model.RunnerBuilder.safeRunnerForClass(RunnerBuilder.java:59)
at org.junit.internal.requests.ClassRequest.getRunner(ClassRequest.java:26)
at org.apache.maven.surefire.junit4.JUnit4Provider.execute(JUnit4Provider.java:262)
at org.apache.maven.surefire.junit4.JUnit4Provider.executeTestSet(JUnit4Provider.java:153)
at org.apache.maven.surefire.junit4.JUnit4Provider.invoke(JUnit4Provider.java:124)
at org.apache.maven.surefire.booter.ForkedBooter.invokeProviderInSameClassLoader(ForkedBooter.java:200)
at org.apache.maven.surefire.booter.ForkedBooter.runSuitesInProcess(ForkedBooter.java:153)
at org.apache.maven.surefire.booter.ForkedBooter.main(ForkedBooter.java:103)
Caused by: java.lang.ClassNotFoundException: org.apache.hadoop.yarn.event.EventHandler
at java.net.URLClassLoader$1.run(URLClassLoader.java:366)
at java.net.URLClassLoader$1.run(URLClassLoader.java:355)
at java.security.AccessController.doPrivileged(Native Method)
at java.net.URLClassLoader.findClass(URLClassLoader.java:354)
at java.lang.ClassLoader.loadClass(ClassLoader.java:425)
at sun.misc.Launcher$AppClassLoader.loadClass(Launcher.java:308)
at java.lang.ClassLoader.loadClass(ClassLoader.java:358)
at java.lang.ClassLoader.defineClass1(Native Method)
at java.lang.ClassLoader.defineClass(ClassLoader.java:800)
at java.security.SecureClassLoader.defineClass(SecureClassLoader.java:142)
at java.net.URLClassLoader.defineClass(URLClassLoader.java:449)
at java.net.URLClassLoader.access$100(URLClassLoader.java:71)
at java.net.URLClassLoader$1.run(URLClassLoader.java:361)
at java.net.URLClassLoader$1.run(URLClassLoader.java:355)
at java.security.AccessController.doPrivileged(Native Method)
at java.net.URLClassLoader.findClass(URLClassLoader.java:354)
at java.lang.ClassLoader.loadClass(ClassLoader.java:425)
at sun.misc.Launcher$AppClassLoader.loadClass(Launcher.java:308)
at java.lang.ClassLoader.loadClass(ClassLoader.java:358)
at java.lang.ClassLoader.defineClass1(Native Method)
at java.lang.ClassLoader.defineClass(ClassLoader.java:800)
at java.security.SecureClassLoader.defineClass(SecureClassLoader.java:142)
at java.net.URLClassLoader.defineClass(URLClassLoader.java:449)
at java.net.URLClassLoader.access$100(URLClassLoader.java:71)
at java.net.URLClassLoader$1.run(URLClassLoader.java:361)
at java.net.URLClassLoader$1.run(URLClassLoader.java:355)
at java.security.AccessController.doPrivileged(Native Method)
at java.net.URLClassLoader.findClass(URLClassLoader.java:354)
at java.lang.ClassLoader.loadClass(ClassLoader.java:425)
at sun.misc.Launcher$AppClassLoader.loadClass(Launcher.java:308)
at java.lang.ClassLoader.loadClass(ClassLoader.java:358)
at java.lang.ClassLoader.defineClass1(Native Method)
at java.lang.ClassLoader.defineClass(ClassLoader.java:800)
at java.security.SecureClassLoader.defineClass(SecureClassLoader.java:142)
at java.net.URLClassLoader.defineClass(URLClassLoader.java:449)
at java.net.URLClassLoader.access$100(URLClassLoader.java:71)
at java.net.URLClassLoader$1.run(URLClassLoader.java:361)
at java.net.URLClassLoader$1.run(URLClassLoader.java:355)
at java.security.AccessController.doPrivileged(Native Method)
at java.net.URLClassLoader.findClass(URLClassLoader.java:354)
at java.lang.ClassLoader.loadClass(ClassLoader.java:425)
at sun.misc.Launcher$AppClassLoader.loadClass(Launcher.java:308)
at java.lang.ClassLoader.loadClass(ClassLoader.java:358)
at java.lang.ClassLoader.defineClass1(Native Method)
at java.lang.ClassLoader.defineClass(ClassLoader.java:800)
at java.security.SecureClassLoader.defineClass(SecureClassLoader.java:142)
at java.net.URLClassLoader.defineClass(URLClassLoader.java:449)
at java.net.URLClassLoader.access$100(URLClassLoader.java:71)
at java.net.URLClassLoader$1.run(URLClassLoader.java:361)
at java.net.URLClassLoader$1.run(URLClassLoader.java:355)
at java.security.AccessController.doPrivileged(Native Method)
at java.net.URLClassLoader.findClass(URLClassLoader.java:354)
at java.lang.ClassLoader.loadClass(ClassLoader.java:425)
at sun.misc.Launcher$AppClassLoader.loadClass(Launcher.java:308)
at java.lang.ClassLoader.loadClass(ClassLoader.java:358)
at java.lang.Class.getDeclaredMethods0(Native Method)
at java.lang.Class.privateGetDeclaredMethods(Class.java:2531)
at java.lang.Class.getMethod0(Class.java:2774)
at java.lang.Class.getMethod(Class.java:1663)
at org.junit.internal.builders.SuiteMethodBuilder.hasSuiteMethod(SuiteMethodBuilder.java:18)
at org.junit.internal.builders.SuiteMethodBuilder.runnerForClass(SuiteMethodBuilder.java:10)
at org.junit.runners.model.RunnerBuilder.safeRunnerForClass(RunnerBuilder.java:59)
at org.junit.internal.builders.AllDefaultPossibilitiesBuilder.runnerForClass(AllDefaultPossibilitiesBuilder.java:26)
at org.junit.runners.model.RunnerBuilder.safeRunnerForClass(RunnerBuilder.java:59)
at org.junit.internal.requests.ClassRequest.getRunner(ClassRequest.java:26)
at org.apache.maven.surefire.junit4.JUnit4Provider.execute(JUnit4Provider.java:262)
at org.apache.maven.surefire.junit4.JUnit4Provider.executeTestSet(JUnit4Provider.java:153)
at org.apache.maven.surefire.junit4.JUnit4Provider.invoke(JUnit4Provider.java:124)
at org.apache.maven.surefire.booter.ForkedBooter.invokeProviderInSameClassLoader(ForkedBooter.java:200)
at org.apache.maven.surefire.booter.ForkedBooter.runSuitesInProcess(ForkedBooter.java:153)
at org.apache.maven.surefire.booter.ForkedBooter.main(ForkedBooter.java:103)
FAILED: org.apache.hadoop.yarn.server.resourcemanager.webapp.TestRMWebServicesApps.testAppsQueryUser
Error Message:
Guice creation errors:
1) An exception was caught and reported. Message: java.lang.RuntimeException: java.util.zip.ZipException: ZIP_Read: error reading zip file
at com.google.inject.internal.InjectorShell$Builder.build(InjectorShell.java:133)
1 error
Stack Trace:
com.google.inject.CreationException: Guice creation errors:
1) An exception was caught and reported. Message: java.lang.RuntimeException: java.util.zip.ZipException: ZIP_Read: error reading zip file
at com.google.inject.internal.InjectorShell$Builder.build(InjectorShell.java:133)
1 error
at java.util.zip.ZipFile.read(Native Method)
at java.util.zip.ZipFile.access$1400(ZipFile.java:56)
at java.util.zip.ZipFile$ZipFileInputStream.read(ZipFile.java:679)
at java.util.zip.ZipFile$ZipFileInflaterInputStream.fill(ZipFile.java:415)
at java.util.zip.InflaterInputStream.read(InflaterInputStream.java:158)
at java.util.zip.InflaterInputStream.read(InflaterInputStream.java:122)
at java.io.FilterInputStream.read(FilterInputStream.java:83)
at org.apache.xerces.impl.XMLEntityManager$RewindableInputStream.read(Unknown Source)
at org.apache.xerces.impl.XMLEntityManager.setupCurrentEntity(Unknown Source)
at org.apache.xerces.impl.XMLVersionDetector.determineDocVersion(Unknown Source)
at org.apache.xerces.parsers.XML11Configuration.parse(Unknown Source)
at org.apache.xerces.parsers.XML11Configuration.parse(Unknown Source)
at org.apache.xerces.parsers.XMLParser.parse(Unknown Source)
at org.apache.xerces.parsers.DOMParser.parse(Unknown Source)
at org.apache.xerces.jaxp.DocumentBuilderImpl.parse(Unknown Source)
at javax.xml.parsers.DocumentBuilder.parse(DocumentBuilder.java:150)
at org.apache.hadoop.conf.Configuration.parse(Configuration.java:2499)
at org.apache.hadoop.conf.Configuration.parse(Configuration.java:2487)
at org.apache.hadoop.conf.Configuration.loadResource(Configuration.java:2558)
at org.apache.hadoop.conf.Configuration.loadResources(Configuration.java:2511)
at org.apache.hadoop.conf.Configuration.getProps(Configuration.java:2424)
at org.apache.hadoop.conf.Configuration.get(Configuration.java:998)
at org.apache.hadoop.conf.Configuration.getTrimmed(Configuration.java:1048)
at org.apache.hadoop.conf.Configuration.getClass(Configuration.java:2208)
at org.apache.hadoop.conf.Configuration.getClass(Configuration.java:2238)
at org.apache.hadoop.yarn.conf.ConfigurationProviderFactory.getConfigurationProvider(ConfigurationProviderFactory.java:52)
at org.apache.hadoop.yarn.server.resourcemanager.ResourceManager.serviceInit(ResourceManager.java:191)
at org.apache.hadoop.service.AbstractService.init(AbstractService.java:163)
at org.apache.hadoop.yarn.server.resourcemanager.MockRM.<init>(MockRM.java:108)
at org.apache.hadoop.yarn.server.resourcemanager.MockRM.<init>(MockRM.java:103)
at org.apache.hadoop.yarn.server.resourcemanager.webapp.TestRMWebServicesApps$1.configureServlets(TestRMWebServicesApps.java:90)
at com.google.inject.servlet.ServletModule.configure(ServletModule.java:53)
at com.google.inject.AbstractModule.configure(AbstractModule.java:59)
at com.google.inject.spi.Elements$RecordingBinder.install(Elements.java:223)
at com.google.inject.spi.Elements.getElements(Elements.java:101)
at com.google.inject.internal.InjectorShell$Builder.build(InjectorShell.java:133)
at com.google.inject.internal.InternalInjectorCreator.build(InternalInjectorCreator.java:103)
at com.google.inject.Guice.createInjector(Guice.java:95)
at com.google.inject.Guice.createInjector(Guice.java:72)
at com.google.inject.Guice.createInjector(Guice.java:62)
at org.apache.hadoop.yarn.server.resourcemanager.webapp.TestRMWebServicesApps.<init>(TestRMWebServicesApps.java:79)
FAILED: org.apache.hadoop.yarn.server.resourcemanager.webapp.TestRMWebServicesApps.testAppsQueryStatesNone
Error Message:
java.net.BindException: Address already in use
Stack Trace:
com.sun.jersey.test.framework.spi.container.TestContainerException: java.net.BindException: Address already in use
at sun.nio.ch.Net.bind0(Native Method)
at sun.nio.ch.Net.bind(Net.java:444)
at sun.nio.ch.Net.bind(Net.java:436)
at sun.nio.ch.ServerSocketChannelImpl.bind(ServerSocketChannelImpl.java:214)
at sun.nio.ch.ServerSocketAdaptor.bind(ServerSocketAdaptor.java:74)
at org.glassfish.grizzly.nio.transport.TCPNIOTransport.bind(TCPNIOTransport.java:413)
at org.glassfish.grizzly.nio.transport.TCPNIOTransport.bind(TCPNIOTransport.java:384)
at org.glassfish.grizzly.nio.transport.TCPNIOTransport.bind(TCPNIOTransport.java:375)
at org.glassfish.grizzly.http.server.NetworkListener.start(NetworkListener.java:549)
at org.glassfish.grizzly.http.server.HttpServer.start(HttpServer.java:255)
at com.sun.jersey.api.container.grizzly2.GrizzlyServerFactory.createHttpServer(GrizzlyServerFactory.java:326)
at com.sun.jersey.api.container.grizzly2.GrizzlyServerFactory.createHttpServer(GrizzlyServerFactory.java:343)
at com.sun.jersey.test.framework.spi.container.grizzly2.web.GrizzlyWebTestContainerFactory$GrizzlyWebTestContainer.instantiateGrizzlyWebServer(GrizzlyWebTestContainerFactory.java:219)
at com.sun.jersey.test.framework.spi.container.grizzly2.web.GrizzlyWebTestContainerFactory$GrizzlyWebTestContainer.<init>(GrizzlyWebTestContainerFactory.java:129)
at com.sun.jersey.test.framework.spi.container.grizzly2.web.GrizzlyWebTestContainerFactory$GrizzlyWebTestContainer.<init>(GrizzlyWebTestContainerFactory.java:86)
at com.sun.jersey.test.framework.spi.container.grizzly2.web.GrizzlyWebTestContainerFactory.create(GrizzlyWebTestContainerFactory.java:79)
at com.sun.jersey.test.framework.JerseyTest.getContainer(JerseyTest.java:342)
at com.sun.jersey.test.framework.JerseyTest.<init>(JerseyTest.java:217)
at org.apache.hadoop.yarn.webapp.JerseyTestBase.<init>(JerseyTestBase.java:27)
at org.apache.hadoop.yarn.server.resourcemanager.webapp.TestRMWebServicesApps.<init>(TestRMWebServicesApps.java:111)
FAILED: org.apache.hadoop.yarn.server.resourcemanager.webapp.TestRMWebServicesApps.testAppAttempts
Error Message:
java.net.BindException: Address already in use
Stack Trace:
com.sun.jersey.test.framework.spi.container.TestContainerException: java.net.BindException: Address already in use
at sun.nio.ch.Net.bind0(Native Method)
at sun.nio.ch.Net.bind(Net.java:444)
at sun.nio.ch.Net.bind(Net.java:436)
at sun.nio.ch.ServerSocketChannelImpl.bind(ServerSocketChannelImpl.java:214)
at sun.nio.ch.ServerSocketAdaptor.bind(ServerSocketAdaptor.java:74)
at org.glassfish.grizzly.nio.transport.TCPNIOTransport.bind(TCPNIOTransport.java:413)
at org.glassfish.grizzly.nio.transport.TCPNIOTransport.bind(TCPNIOTransport.java:384)
at org.glassfish.grizzly.nio.transport.TCPNIOTransport.bind(TCPNIOTransport.java:375)
at org.glassfish.grizzly.http.server.NetworkListener.start(NetworkListener.java:549)
at org.glassfish.grizzly.http.server.HttpServer.start(HttpServer.java:255)
at com.sun.jersey.api.container.grizzly2.GrizzlyServerFactory.createHttpServer(GrizzlyServerFactory.java:326)
at com.sun.jersey.api.container.grizzly2.GrizzlyServerFactory.createHttpServer(GrizzlyServerFactory.java:343)
at com.sun.jersey.test.framework.spi.container.grizzly2.web.GrizzlyWebTestContainerFactory$GrizzlyWebTestContainer.instantiateGrizzlyWebServer(GrizzlyWebTestContainerFactory.java:219)
at com.sun.jersey.test.framework.spi.container.grizzly2.web.GrizzlyWebTestContainerFactory$GrizzlyWebTestContainer.<init>(GrizzlyWebTestContainerFactory.java:129)
at com.sun.jersey.test.framework.spi.container.grizzly2.web.GrizzlyWebTestContainerFactory$GrizzlyWebTestContainer.<init>(GrizzlyWebTestContainerFactory.java:86)
at com.sun.jersey.test.framework.spi.container.grizzly2.web.GrizzlyWebTestContainerFactory.create(GrizzlyWebTestContainerFactory.java:79)
at com.sun.jersey.test.framework.JerseyTest.getContainer(JerseyTest.java:342)
at com.sun.jersey.test.framework.JerseyTest.<init>(JerseyTest.java:217)
at org.apache.hadoop.yarn.webapp.JerseyTestBase.<init>(JerseyTestBase.java:27)
at org.apache.hadoop.yarn.server.resourcemanager.webapp.TestRMWebServicesApps.<init>(TestRMWebServicesApps.java:111)
FAILED: org.apache.hadoop.yarn.server.resourcemanager.webapp.TestRMWebServicesApps.testMultipleAppAttempts
Error Message:
java.net.BindException: Address already in use
Stack Trace:
com.sun.jersey.test.framework.spi.container.TestContainerException: java.net.BindException: Address already in use
at sun.nio.ch.Net.bind0(Native Method)
at sun.nio.ch.Net.bind(Net.java:444)
at sun.nio.ch.Net.bind(Net.java:436)
at sun.nio.ch.ServerSocketChannelImpl.bind(ServerSocketChannelImpl.java:214)
at sun.nio.ch.ServerSocketAdaptor.bind(ServerSocketAdaptor.java:74)
at org.glassfish.grizzly.nio.transport.TCPNIOTransport.bind(TCPNIOTransport.java:413)
at org.glassfish.grizzly.nio.transport.TCPNIOTransport.bind(TCPNIOTransport.java:384)
at org.glassfish.grizzly.nio.transport.TCPNIOTransport.bind(TCPNIOTransport.java:375)
at org.glassfish.grizzly.http.server.NetworkListener.start(NetworkListener.java:549)
at org.glassfish.grizzly.http.server.HttpServer.start(HttpServer.java:255)
at com.sun.jersey.api.container.grizzly2.GrizzlyServerFactory.createHttpServer(GrizzlyServerFactory.java:326)
at com.sun.jersey.api.container.grizzly2.GrizzlyServerFactory.createHttpServer(GrizzlyServerFactory.java:343)
at com.sun.jersey.test.framework.spi.container.grizzly2.web.GrizzlyWebTestContainerFactory$GrizzlyWebTestContainer.instantiateGrizzlyWebServer(GrizzlyWebTestContainerFactory.java:219)
at com.sun.jersey.test.framework.spi.container.grizzly2.web.GrizzlyWebTestContainerFactory$GrizzlyWebTestContainer.<init>(GrizzlyWebTestContainerFactory.java:129)
at com.sun.jersey.test.framework.spi.container.grizzly2.web.GrizzlyWebTestContainerFactory$GrizzlyWebTestContainer.<init>(GrizzlyWebTestContainerFactory.java:86)
at com.sun.jersey.test.framework.spi.container.grizzly2.web.GrizzlyWebTestContainerFactory.create(GrizzlyWebTestContainerFactory.java:79)
at com.sun.jersey.test.framework.JerseyTest.getContainer(JerseyTest.java:342)
at com.sun.jersey.test.framework.JerseyTest.<init>(JerseyTest.java:217)
at org.apache.hadoop.yarn.webapp.JerseyTestBase.<init>(JerseyTestBase.java:27)
at org.apache.hadoop.yarn.server.resourcemanager.webapp.TestRMWebServicesApps.<init>(TestRMWebServicesApps.java:111)
FAILED: org.apache.hadoop.yarn.server.resourcemanager.webapp.TestRMWebServicesApps.testAppsQueryFinishEnd
Error Message:
java.net.BindException: Address already in use
Stack Trace:
com.sun.jersey.test.framework.spi.container.TestContainerException: java.net.BindException: Address already in use
at sun.nio.ch.Net.bind0(Native Method)
at sun.nio.ch.Net.bind(Net.java:444)
at sun.nio.ch.Net.bind(Net.java:436)
at sun.nio.ch.ServerSocketChannelImpl.bind(ServerSocketChannelImpl.java:214)
at sun.nio.ch.ServerSocketAdaptor.bind(ServerSocketAdaptor.java:74)
at org.glassfish.grizzly.nio.transport.TCPNIOTransport.bind(TCPNIOTransport.java:413)
at org.glassfish.grizzly.nio.transport.TCPNIOTransport.bind(TCPNIOTransport.java:384)
at org.glassfish.grizzly.nio.transport.TCPNIOTransport.bind(TCPNIOTransport.java:375)
at org.glassfish.grizzly.http.server.NetworkListener.start(NetworkListener.java:549)
at org.glassfish.grizzly.http.server.HttpServer.start(HttpServer.java:255)
at com.sun.jersey.api.container.grizzly2.GrizzlyServerFactory.createHttpServer(GrizzlyServerFactory.java:326)
at com.sun.jersey.api.container.grizzly2.GrizzlyServerFactory.createHttpServer(GrizzlyServerFactory.java:343)
at com.sun.jersey.test.framework.spi.container.grizzly2.web.GrizzlyWebTestContainerFactory$GrizzlyWebTestContainer.instantiateGrizzlyWebServer(GrizzlyWebTestContainerFactory.java:219)
at com.sun.jersey.test.framework.spi.container.grizzly2.web.GrizzlyWebTestContainerFactory$GrizzlyWebTestContainer.<init>(GrizzlyWebTestContainerFactory.java:129)
at com.sun.jersey.test.framework.spi.container.grizzly2.web.GrizzlyWebTestContainerFactory$GrizzlyWebTestContainer.<init>(GrizzlyWebTestContainerFactory.java:86)
at com.sun.jersey.test.framework.spi.container.grizzly2.web.GrizzlyWebTestContainerFactory.create(GrizzlyWebTestContainerFactory.java:79)
at com.sun.jersey.test.framework.JerseyTest.getContainer(JerseyTest.java:342)
at com.sun.jersey.test.framework.JerseyTest.<init>(JerseyTest.java:217)
at org.apache.hadoop.yarn.webapp.JerseyTestBase.<init>(JerseyTestBase.java:27)
at org.apache.hadoop.yarn.server.resourcemanager.webapp.TestRMWebServicesApps.<init>(TestRMWebServicesApps.java:111)
FAILED: org.apache.hadoop.yarn.server.resourcemanager.webapp.TestRMWebServicesApps.testAppsQueryLimit
Error Message:
java.net.BindException: Address already in use
Stack Trace:
com.sun.jersey.test.framework.spi.container.TestContainerException: java.net.BindException: Address already in use
at sun.nio.ch.Net.bind0(Native Method)
at sun.nio.ch.Net.bind(Net.java:444)
at sun.nio.ch.Net.bind(Net.java:436)
at sun.nio.ch.ServerSocketChannelImpl.bind(ServerSocketChannelImpl.java:214)
at sun.nio.ch.ServerSocketAdaptor.bind(ServerSocketAdaptor.java:74)
at org.glassfish.grizzly.nio.transport.TCPNIOTransport.bind(TCPNIOTransport.java:413)
at org.glassfish.grizzly.nio.transport.TCPNIOTransport.bind(TCPNIOTransport.java:384)
at org.glassfish.grizzly.nio.transport.TCPNIOTransport.bind(TCPNIOTransport.java:375)
at org.glassfish.grizzly.http.server.NetworkListener.start(NetworkListener.java:549)
at org.glassfish.grizzly.http.server.HttpServer.start(HttpServer.java:255)
at com.sun.jersey.api.container.grizzly2.GrizzlyServerFactory.createHttpServer(GrizzlyServerFactory.java:326)
at com.sun.jersey.api.container.grizzly2.GrizzlyServerFactory.createHttpServer(GrizzlyServerFactory.java:343)
at com.sun.jersey.test.framework.spi.container.grizzly2.web.GrizzlyWebTestContainerFactory$GrizzlyWebTestContainer.instantiateGrizzlyWebServer(GrizzlyWebTestContainerFactory.java:219)
at com.sun.jersey.test.framework.spi.container.grizzly2.web.GrizzlyWebTestContainerFactory$GrizzlyWebTestContainer.<init>(GrizzlyWebTestContainerFactory.java:129)
at com.sun.jersey.test.framework.spi.container.grizzly2.web.GrizzlyWebTestContainerFactory$GrizzlyWebTestContainer.<init>(GrizzlyWebTestContainerFactory.java:86)
at com.sun.jersey.test.framework.spi.container.grizzly2.web.GrizzlyWebTestContainerFactory.create(GrizzlyWebTestContainerFactory.java:79)
at com.sun.jersey.test.framework.JerseyTest.getContainer(JerseyTest.java:342)
at com.sun.jersey.test.framework.JerseyTest.<init>(JerseyTest.java:217)
at org.apache.hadoop.yarn.webapp.JerseyTestBase.<init>(JerseyTestBase.java:27)
at org.apache.hadoop.yarn.server.resourcemanager.webapp.TestRMWebServicesApps.<init>(TestRMWebServicesApps.java:111)
FAILED: org.apache.hadoop.yarn.server.resourcemanager.webapp.TestRMWebServicesApps.testAppsQueryQueue
Error Message:
java.net.BindException: Address already in use
Stack Trace:
com.sun.jersey.test.framework.spi.container.TestContainerException: java.net.BindException: Address already in use
at sun.nio.ch.Net.bind0(Native Method)
at sun.nio.ch.Net.bind(Net.java:444)
at sun.nio.ch.Net.bind(Net.java:436)
at sun.nio.ch.ServerSocketChannelImpl.bind(ServerSocketChannelImpl.java:214)
at sun.nio.ch.ServerSocketAdaptor.bind(ServerSocketAdaptor.java:74)
at org.glassfish.grizzly.nio.transport.TCPNIOTransport.bind(TCPNIOTransport.java:413)
at org.glassfish.grizzly.nio.transport.TCPNIOTransport.bind(TCPNIOTransport.java:384)
at org.glassfish.grizzly.nio.transport.TCPNIOTransport.bind(TCPNIOTransport.java:375)
at org.glassfish.grizzly.http.server.NetworkListener.start(NetworkListener.java:549)
at org.glassfish.grizzly.http.server.HttpServer.start(HttpServer.java:255)
at com.sun.jersey.api.container.grizzly2.GrizzlyServerFactory.createHttpServer(GrizzlyServerFactory.java:326)
at com.sun.jersey.api.container.grizzly2.GrizzlyServerFactory.createHttpServer(GrizzlyServerFactory.java:343)
at com.sun.jersey.test.framework.spi.container.grizzly2.web.GrizzlyWebTestContainerFactory$GrizzlyWebTestContainer.instantiateGrizzlyWebServer(GrizzlyWebTestContainerFactory.java:219)
at com.sun.jersey.test.framework.spi.container.grizzly2.web.GrizzlyWebTestContainerFactory$GrizzlyWebTestContainer.<init>(GrizzlyWebTestContainerFactory.java:129)
at com.sun.jersey.test.framework.spi.container.grizzly2.web.GrizzlyWebTestContainerFactory$GrizzlyWebTestContainer.<init>(GrizzlyWebTestContainerFactory.java:86)
at com.sun.jersey.test.framework.spi.container.grizzly2.web.GrizzlyWebTestContainerFactory.create(GrizzlyWebTestContainerFactory.java:79)
at com.sun.jersey.test.framework.JerseyTest.getContainer(JerseyTest.java:342)
at com.sun.jersey.test.framework.JerseyTest.<init>(JerseyTest.java:217)
at org.apache.hadoop.yarn.webapp.JerseyTestBase.<init>(JerseyTestBase.java:27)
at org.apache.hadoop.yarn.server.resourcemanager.webapp.TestRMWebServicesApps.<init>(TestRMWebServicesApps.java:111)
FAILED: org.apache.hadoop.yarn.server.resourcemanager.webapp.TestRMWebServicesApps.testAppsQueryState
Error Message:
java.net.BindException: Address already in use
Stack Trace:
com.sun.jersey.test.framework.spi.container.TestContainerException: java.net.BindException: Address already in use
at sun.nio.ch.Net.bind0(Native Method)
at sun.nio.ch.Net.bind(Net.java:444)
at sun.nio.ch.Net.bind(Net.java:436)
at sun.nio.ch.ServerSocketChannelImpl.bind(ServerSocketChannelImpl.java:214)
at sun.nio.ch.ServerSocketAdaptor.bind(ServerSocketAdaptor.java:74)
at org.glassfish.grizzly.nio.transport.TCPNIOTransport.bind(TCPNIOTransport.java:413)
at org.glassfish.grizzly.nio.transport.TCPNIOTransport.bind(TCPNIOTransport.java:384)
at org.glassfish.grizzly.nio.transport.TCPNIOTransport.bind(TCPNIOTransport.java:375)
at org.glassfish.grizzly.http.server.NetworkListener.start(NetworkListener.java:549)
at org.glassfish.grizzly.http.server.HttpServer.start(HttpServer.java:255)
at com.sun.jersey.api.container.grizzly2.GrizzlyServerFactory.createHttpServer(GrizzlyServerFactory.java:326)
at com.sun.jersey.api.container.grizzly2.GrizzlyServerFactory.createHttpServer(GrizzlyServerFactory.java:343)
at com.sun.jersey.test.framework.spi.container.grizzly2.web.GrizzlyWebTestContainerFactory$GrizzlyWebTestContainer.instantiateGrizzlyWebServer(GrizzlyWebTestContainerFactory.java:219)
at com.sun.jersey.test.framework.spi.container.grizzly2.web.GrizzlyWebTestContainerFactory$GrizzlyWebTestContainer.<init>(GrizzlyWebTestContainerFactory.java:129)
at com.sun.jersey.test.framework.spi.container.grizzly2.web.GrizzlyWebTestContainerFactory$GrizzlyWebTestContainer.<init>(GrizzlyWebTestContainerFactory.java:86)
at com.sun.jersey.test.framework.spi.container.grizzly2.web.GrizzlyWebTestContainerFactory.create(GrizzlyWebTestContainerFactory.java:79)
at com.sun.jersey.test.framework.JerseyTest.getContainer(JerseyTest.java:342)
at com.sun.jersey.test.framework.JerseyTest.<init>(JerseyTest.java:217)
at org.apache.hadoop.yarn.webapp.JerseyTestBase.<init>(JerseyTestBase.java:27)
at org.apache.hadoop.yarn.server.resourcemanager.webapp.TestRMWebServicesApps.<init>(TestRMWebServicesApps.java:111)
FAILED: org.apache.hadoop.yarn.server.resourcemanager.webapp.TestRMWebServicesApps.testSingleAppsDefault
Error Message:
java.net.BindException: Address already in use
Stack Trace:
com.sun.jersey.test.framework.spi.container.TestContainerException: java.net.BindException: Address already in use
at sun.nio.ch.Net.bind0(Native Method)
at sun.nio.ch.Net.bind(Net.java:444)
at sun.nio.ch.Net.bind(Net.java:436)
at sun.nio.ch.ServerSocketChannelImpl.bind(ServerSocketChannelImpl.java:214)
at sun.nio.ch.ServerSocketAdaptor.bind(ServerSocketAdaptor.java:74)
at org.glassfish.grizzly.nio.transport.TCPNIOTransport.bind(TCPNIOTransport.java:413)
at org.glassfish.grizzly.nio.transport.TCPNIOTransport.bind(TCPNIOTransport.java:384)
at org.glassfish.grizzly.nio.transport.TCPNIOTransport.bind(TCPNIOTransport.java:375)
at org.glassfish.grizzly.http.server.NetworkListener.start(NetworkListener.java:549)
at org.glassfish.grizzly.http.server.HttpServer.start(HttpServer.java:255)
at com.sun.jersey.api.container.grizzly2.GrizzlyServerFactory.createHttpServer(GrizzlyServerFactory.java:326)
at com.sun.jersey.api.container.grizzly2.GrizzlyServerFactory.createHttpServer(GrizzlyServerFactory.java:343)
at com.sun.jersey.test.framework.spi.container.grizzly2.web.GrizzlyWebTestContainerFactory$GrizzlyWebTestContainer.instantiateGrizzlyWebServer(GrizzlyWebTestContainerFactory.java:219)
at com.sun.jersey.test.framework.spi.container.grizzly2.web.GrizzlyWebTestContainerFactory$GrizzlyWebTestContainer.<init>(GrizzlyWebTestContainerFactory.java:129)
at com.sun.jersey.test.framework.spi.container.grizzly2.web.GrizzlyWebTestContainerFactory$GrizzlyWebTestContainer.<init>(GrizzlyWebTestContainerFactory.java:86)
at com.sun.jersey.test.framework.spi.container.grizzly2.web.GrizzlyWebTestContainerFactory.create(GrizzlyWebTestContainerFactory.java:79)
at com.sun.jersey.test.framework.JerseyTest.getContainer(JerseyTest.java:342)
at com.sun.jersey.test.framework.JerseyTest.<init>(JerseyTest.java:217)
at org.apache.hadoop.yarn.webapp.JerseyTestBase.<init>(JerseyTestBase.java:27)
at org.apache.hadoop.yarn.server.resourcemanager.webapp.TestRMWebServicesApps.<init>(TestRMWebServicesApps.java:111)
FAILED: org.apache.hadoop.yarn.server.resourcemanager.webapp.TestRMWebServicesApps.testAppsQueryStateInvalid
Error Message:
java.net.BindException: Address already in use
Stack Trace:
com.sun.jersey.test.framework.spi.container.TestContainerException: java.net.BindException: Address already in use
at sun.nio.ch.Net.bind0(Native Method)
at sun.nio.ch.Net.bind(Net.java:444)
at sun.nio.ch.Net.bind(Net.java:436)
at sun.nio.ch.ServerSocketChannelImpl.bind(ServerSocketChannelImpl.java:214)
at sun.nio.ch.ServerSocketAdaptor.bind(ServerSocketAdaptor.java:74)
at org.glassfish.grizzly.nio.transport.TCPNIOTransport.bind(TCPNIOTransport.java:413)
at org.glassfish.grizzly.nio.transport.TCPNIOTransport.bind(TCPNIOTransport.java:384)
at org.glassfish.grizzly.nio.transport.TCPNIOTransport.bind(TCPNIOTransport.java:375)
at org.glassfish.grizzly.http.server.NetworkListener.start(NetworkListener.java:549)
at org.glassfish.grizzly.http.server.HttpServer.start(HttpServer.java:255)
at com.sun.jersey.api.container.grizzly2.GrizzlyServerFactory.createHttpServer(GrizzlyServerFactory.java:326)
at com.sun.jersey.api.container.grizzly2.GrizzlyServerFactory.createHttpServer(GrizzlyServerFactory.java:343)
at com.sun.jersey.test.framework.spi.container.grizzly2.web.GrizzlyWebTestContainerFactory$GrizzlyWebTestContainer.instantiateGrizzlyWebServer(GrizzlyWebTestContainerFactory.java:219)
at com.sun.jersey.test.framework.spi.container.grizzly2.web.GrizzlyWebTestContainerFactory$GrizzlyWebTestContainer.<init>(GrizzlyWebTestContainerFactory.java:129)
at com.sun.jersey.test.framework.spi.container.grizzly2.web.GrizzlyWebTestContainerFactory$GrizzlyWebTestContainer.<init>(GrizzlyWebTestContainerFactory.java:86)
at com.sun.jersey.test.framework.spi.container.grizzly2.web.GrizzlyWebTestContainerFactory.create(GrizzlyWebTestContainerFactory.java:79)
at com.sun.jersey.test.framework.JerseyTest.getContainer(JerseyTest.java:342)
at com.sun.jersey.test.framework.JerseyTest.<init>(JerseyTest.java:217)
at org.apache.hadoop.yarn.webapp.JerseyTestBase.<init>(JerseyTestBase.java:27)
at org.apache.hadoop.yarn.server.resourcemanager.webapp.TestRMWebServicesApps.<init>(TestRMWebServicesApps.java:111)
FAILED: org.apache.hadoop.yarn.server.resourcemanager.webapp.TestRMWebServicesApps.testAppsQueryAppTypes
Error Message:
java.net.BindException: Address already in use
Stack Trace:
com.sun.jersey.test.framework.spi.container.TestContainerException: java.net.BindException: Address already in use
at sun.nio.ch.Net.bind0(Native Method)
at sun.nio.ch.Net.bind(Net.java:444)
at sun.nio.ch.Net.bind(Net.java:436)
at sun.nio.ch.ServerSocketChannelImpl.bind(ServerSocketChannelImpl.java:214)
at sun.nio.ch.ServerSocketAdaptor.bind(ServerSocketAdaptor.java:74)
at org.glassfish.grizzly.nio.transport.TCPNIOTransport.bind(TCPNIOTransport.java:413)
at org.glassfish.grizzly.nio.transport.TCPNIOTransport.bind(TCPNIOTransport.java:384)
at org.glassfish.grizzly.nio.transport.TCPNIOTransport.bind(TCPNIOTransport.java:375)
at org.glassfish.grizzly.http.server.NetworkListener.start(NetworkListener.java:549)
at org.glassfish.grizzly.http.server.HttpServer.start(HttpServer.java:255)
at com.sun.jersey.api.container.grizzly2.GrizzlyServerFactory.createHttpServer(GrizzlyServerFactory.java:326)
at com.sun.jersey.api.container.grizzly2.GrizzlyServerFactory.createHttpServer(GrizzlyServerFactory.java:343)
at com.sun.jersey.test.framework.spi.container.grizzly2.web.GrizzlyWebTestContainerFactory$GrizzlyWebTestContainer.instantiateGrizzlyWebServer(GrizzlyWebTestContainerFactory.java:219)
at com.sun.jersey.test.framework.spi.container.grizzly2.web.GrizzlyWebTestContainerFactory$GrizzlyWebTestContainer.<init>(GrizzlyWebTestContainerFactory.java:129)
at com.sun.jersey.test.framework.spi.container.grizzly2.web.GrizzlyWebTestContainerFactory$GrizzlyWebTestContainer.<init>(GrizzlyWebTestContainerFactory.java:86)
at com.sun.jersey.test.framework.spi.container.grizzly2.web.GrizzlyWebTestContainerFactory.create(GrizzlyWebTestContainerFactory.java:79)
at com.sun.jersey.test.framework.JerseyTest.getContainer(JerseyTest.java:342)
at com.sun.jersey.test.framework.JerseyTest.<init>(JerseyTest.java:217)
at org.apache.hadoop.yarn.webapp.JerseyTestBase.<init>(JerseyTestBase.java:27)
at org.apache.hadoop.yarn.server.resourcemanager.webapp.TestRMWebServicesApps.<init>(TestRMWebServicesApps.java:111)
FAILED: org.apache.hadoop.yarn.server.resourcemanager.webapp.TestRMWebServicesApps.testAppsQueryFinalStatusInvalid
Error Message:
java.net.BindException: Address already in use
Stack Trace:
com.sun.jersey.test.framework.spi.container.TestContainerException: java.net.BindException: Address already in use
at sun.nio.ch.Net.bind0(Native Method)
at sun.nio.ch.Net.bind(Net.java:444)
at sun.nio.ch.Net.bind(Net.java:436)
at sun.nio.ch.ServerSocketChannelImpl.bind(ServerSocketChannelImpl.java:214)
at sun.nio.ch.ServerSocketAdaptor.bind(ServerSocketAdaptor.java:74)
at org.glassfish.grizzly.nio.transport.TCPNIOTransport.bind(TCPNIOTransport.java:413)
at org.glassfish.grizzly.nio.transport.TCPNIOTransport.bind(TCPNIOTransport.java:384)
at org.glassfish.grizzly.nio.transport.TCPNIOTransport.bind(TCPNIOTransport.java:375)
at org.glassfish.grizzly.http.server.NetworkListener.start(NetworkListener.java:549)
at org.glassfish.grizzly.http.server.HttpServer.start(HttpServer.java:255)
at com.sun.jersey.api.container.grizzly2.GrizzlyServerFactory.createHttpServer(GrizzlyServerFactory.java:326)
at com.sun.jersey.api.container.grizzly2.GrizzlyServerFactory.createHttpServer(GrizzlyServerFactory.java:343)
at com.sun.jersey.test.framework.spi.container.grizzly2.web.GrizzlyWebTestContainerFactory$GrizzlyWebTestContainer.instantiateGrizzlyWebServer(GrizzlyWebTestContainerFactory.java:219)
at com.sun.jersey.test.framework.spi.container.grizzly2.web.GrizzlyWebTestContainerFactory$GrizzlyWebTestContainer.<init>(GrizzlyWebTestContainerFactory.java:129)
at com.sun.jersey.test.framework.spi.container.grizzly2.web.GrizzlyWebTestContainerFactory$GrizzlyWebTestContainer.<init>(GrizzlyWebTestContainerFactory.java:86)
at com.sun.jersey.test.framework.spi.container.grizzly2.web.GrizzlyWebTestContainerFactory.create(GrizzlyWebTestContainerFactory.java:79)
at com.sun.jersey.test.framework.JerseyTest.getContainer(JerseyTest.java:342)
at com.sun.jersey.test.framework.JerseyTest.<init>(JerseyTest.java:217)
at org.apache.hadoop.yarn.webapp.JerseyTestBase.<init>(JerseyTestBase.java:27)
at org.apache.hadoop.yarn.server.resourcemanager.webapp.TestRMWebServicesApps.<init>(TestRMWebServicesApps.java:111)
FAILED: org.apache.hadoop.yarn.server.resourcemanager.webapp.TestRMWebServicesApps.testInvalidApp
Error Message:
java.net.BindException: Address already in use
Stack Trace:
com.sun.jersey.test.framework.spi.container.TestContainerException: java.net.BindException: Address already in use
at sun.nio.ch.Net.bind0(Native Method)
at sun.nio.ch.Net.bind(Net.java:444)
at sun.nio.ch.Net.bind(Net.java:436)
at sun.nio.ch.ServerSocketChannelImpl.bind(ServerSocketChannelImpl.java:214)
at sun.nio.ch.ServerSocketAdaptor.bind(ServerSocketAdaptor.java:74)
at org.glassfish.grizzly.nio.transport.TCPNIOTransport.bind(TCPNIOTransport.java:413)
at org.glassfish.grizzly.nio.transport.TCPNIOTransport.bind(TCPNIOTransport.java:384)
at org.glassfish.grizzly.nio.transport.TCPNIOTransport.bind(TCPNIOTransport.java:375)
at org.glassfish.grizzly.http.server.NetworkListener.start(NetworkListener.java:549)
at org.glassfish.grizzly.http.server.HttpServer.start(HttpServer.java:255)
at com.sun.jersey.api.container.grizzly2.GrizzlyServerFactory.createHttpServer(GrizzlyServerFactory.java:326)
at com.sun.jersey.api.container.grizzly2.GrizzlyServerFactory.createHttpServer(GrizzlyServerFactory.java:343)
at com.sun.jersey.test.framework.spi.container.grizzly2.web.GrizzlyWebTestContainerFactory$GrizzlyWebTestContainer.instantiateGrizzlyWebServer(GrizzlyWebTestContainerFactory.java:219)
at com.sun.jersey.test.framework.spi.container.grizzly2.web.GrizzlyWebTestContainerFactory$GrizzlyWebTestContainer.<init>(GrizzlyWebTestContainerFactory.java:129)
at com.sun.jersey.test.framework.spi.container.grizzly2.web.GrizzlyWebTestContainerFactory$GrizzlyWebTestContainer.<init>(GrizzlyWebTestContainerFactory.java:86)
at com.sun.jersey.test.framework.spi.container.grizzly2.web.GrizzlyWebTestContainerFactory.create(GrizzlyWebTestContainerFactory.java:79)
at com.sun.jersey.test.framework.JerseyTest.getContainer(JerseyTest.java:342)
at com.sun.jersey.test.framework.JerseyTest.<init>(JerseyTest.java:217)
at org.apache.hadoop.yarn.webapp.JerseyTestBase.<init>(JerseyTestBase.java:27)
at org.apache.hadoop.yarn.server.resourcemanager.webapp.TestRMWebServicesApps.<init>(TestRMWebServicesApps.java:111)
FAILED: org.apache.hadoop.yarn.server.resourcemanager.webapp.TestRMWebServicesApps.testAppsQueryStartEnd
Error Message:
java.net.BindException: Address already in use
Stack Trace:
com.sun.jersey.test.framework.spi.container.TestContainerException: java.net.BindException: Address already in use
at sun.nio.ch.Net.bind0(Native Method)
at sun.nio.ch.Net.bind(Net.java:444)
at sun.nio.ch.Net.bind(Net.java:436)
at sun.nio.ch.ServerSocketChannelImpl.bind(ServerSocketChannelImpl.java:214)
at sun.nio.ch.ServerSocketAdaptor.bind(ServerSocketAdaptor.java:74)
at org.glassfish.grizzly.nio.transport.TCPNIOTransport.bind(TCPNIOTransport.java:413)
at org.glassfish.grizzly.nio.transport.TCPNIOTransport.bind(TCPNIOTransport.java:384)
at org.glassfish.grizzly.nio.transport.TCPNIOTransport.bind(TCPNIOTransport.java:375)
at org.glassfish.grizzly.http.server.NetworkListener.start(NetworkListener.java:549)
at org.glassfish.grizzly.http.server.HttpServer.start(HttpServer.java:255)
at com.sun.jersey.api.container.grizzly2.GrizzlyServerFactory.createHttpServer(GrizzlyServerFactory.java:326)
at com.sun.jersey.api.container.grizzly2.GrizzlyServerFactory.createHttpServer(GrizzlyServerFactory.java:343)
at com.sun.jersey.test.framework.spi.container.grizzly2.web.GrizzlyWebTestContainerFactory$GrizzlyWebTestContainer.instantiateGrizzlyWebServer(GrizzlyWebTestContainerFactory.java:219)
at com.sun.jersey.test.framework.spi.container.grizzly2.web.GrizzlyWebTestContainerFactory$GrizzlyWebTestContainer.<init>(GrizzlyWebTestContainerFactory.java:129)
at com.sun.jersey.test.framework.spi.container.grizzly2.web.GrizzlyWebTestContainerFactory$GrizzlyWebTestContainer.<init>(GrizzlyWebTestContainerFactory.java:86)
at com.sun.jersey.test.framework.spi.container.grizzly2.web.GrizzlyWebTestContainerFactory.create(GrizzlyWebTestContainerFactory.java:79)
at com.sun.jersey.test.framework.JerseyTest.getContainer(JerseyTest.java:342)
at com.sun.jersey.test.framework.JerseyTest.<init>(JerseyTest.java:217)
at org.apache.hadoop.yarn.webapp.JerseyTestBase.<init>(JerseyTestBase.java:27)
at org.apache.hadoop.yarn.server.resourcemanager.webapp.TestRMWebServicesApps.<init>(TestRMWebServicesApps.java:111)
FAILED: org.apache.hadoop.yarn.server.resourcemanager.webapp.TestRMWebServicesApps.testAppsDefault
Error Message:
java.net.BindException: Address already in use
Stack Trace:
com.sun.jersey.test.framework.spi.container.TestContainerException: java.net.BindException: Address already in use
at sun.nio.ch.Net.bind0(Native Method)
at sun.nio.ch.Net.bind(Net.java:444)
at sun.nio.ch.Net.bind(Net.java:436)
at sun.nio.ch.ServerSocketChannelImpl.bind(ServerSocketChannelImpl.java:214)
at sun.nio.ch.ServerSocketAdaptor.bind(ServerSocketAdaptor.java:74)
at org.glassfish.grizzly.nio.transport.TCPNIOTransport.bind(TCPNIOTransport.java:413)
at org.glassfish.grizzly.nio.transport.TCPNIOTransport.bind(TCPNIOTransport.java:384)
at org.glassfish.grizzly.nio.transport.TCPNIOTransport.bind(TCPNIOTransport.java:375)
at org.glassfish.grizzly.http.server.NetworkListener.start(NetworkListener.java:549)
at org.glassfish.grizzly.http.server.HttpServer.start(HttpServer.java:255)
at com.sun.jersey.api.container.grizzly2.GrizzlyServerFactory.createHttpServer(GrizzlyServerFactory.java:326)
at com.sun.jersey.api.container.grizzly2.GrizzlyServerFactory.createHttpServer(GrizzlyServerFactory.java:343)
at com.sun.jersey.test.framework.spi.container.grizzly2.web.GrizzlyWebTestContainerFactory$GrizzlyWebTestContainer.instantiateGrizzlyWebServer(GrizzlyWebTestContainerFactory.java:219)
at com.sun.jersey.test.framework.spi.container.grizzly2.web.GrizzlyWebTestContainerFactory$GrizzlyWebTestContainer.<init>(GrizzlyWebTestContainerFactory.java:129)
at com.sun.jersey.test.framework.spi.container.grizzly2.web.GrizzlyWebTestContainerFactory$GrizzlyWebTestContainer.<init>(GrizzlyWebTestContainerFactory.java:86)
at com.sun.jersey.test.framework.spi.container.grizzly2.web.GrizzlyWebTestContainerFactory.create(GrizzlyWebTestContainerFactory.java:79)
at com.sun.jersey.test.framework.JerseyTest.getContainer(JerseyTest.java:342)
at com.sun.jersey.test.framework.JerseyTest.<init>(JerseyTest.java:217)
at org.apache.hadoop.yarn.webapp.JerseyTestBase.<init>(JerseyTestBase.java:27)
at org.apache.hadoop.yarn.server.resourcemanager.webapp.TestRMWebServicesApps.<init>(TestRMWebServicesApps.java:111)
FAILED: org.apache.hadoop.yarn.server.resourcemanager.webapp.TestRMWebServicesApps.testAppsQueryFinishBeginEnd
Error Message:
java.net.BindException: Address already in use
Stack Trace:
com.sun.jersey.test.framework.spi.container.TestContainerException: java.net.BindException: Address already in use
at sun.nio.ch.Net.bind0(Native Method)
at sun.nio.ch.Net.bind(Net.java:444)
at sun.nio.ch.Net.bind(Net.java:436)
at sun.nio.ch.ServerSocketChannelImpl.bind(ServerSocketChannelImpl.java:214)
at sun.nio.ch.ServerSocketAdaptor.bind(ServerSocketAdaptor.java:74)
at org.glassfish.grizzly.nio.transport.TCPNIOTransport.bind(TCPNIOTransport.java:413)
at org.glassfish.grizzly.nio.transport.TCPNIOTransport.bind(TCPNIOTransport.java:384)
at org.glassfish.grizzly.nio.transport.TCPNIOTransport.bind(TCPNIOTransport.java:375)
at org.glassfish.grizzly.http.server.NetworkListener.start(NetworkListener.java:549)
at org.glassfish.grizzly.http.server.HttpServer.start(HttpServer.java:255)
at com.sun.jersey.api.container.grizzly2.GrizzlyServerFactory.createHttpServer(GrizzlyServerFactory.java:326)
at com.sun.jersey.api.container.grizzly2.GrizzlyServerFactory.createHttpServer(GrizzlyServerFactory.java:343)
at com.sun.jersey.test.framework.spi.container.grizzly2.web.GrizzlyWebTestContainerFactory$GrizzlyWebTestContainer.instantiateGrizzlyWebServer(GrizzlyWebTestContainerFactory.java:219)
at com.sun.jersey.test.framework.spi.container.grizzly2.web.GrizzlyWebTestContainerFactory$GrizzlyWebTestContainer.<init>(GrizzlyWebTestContainerFactory.java:129)
at com.sun.jersey.test.framework.spi.container.grizzly2.web.GrizzlyWebTestContainerFactory$GrizzlyWebTestContainer.<init>(GrizzlyWebTestContainerFactory.java:86)
at com.sun.jersey.test.framework.spi.container.grizzly2.web.GrizzlyWebTestContainerFactory.create(GrizzlyWebTestContainerFactory.java:79)
at com.sun.jersey.test.framework.JerseyTest.getContainer(JerseyTest.java:342)
at com.sun.jersey.test.framework.JerseyTest.<init>(JerseyTest.java:217)
at org.apache.hadoop.yarn.webapp.JerseyTestBase.<init>(JerseyTestBase.java:27)
at org.apache.hadoop.yarn.server.resourcemanager.webapp.TestRMWebServicesApps.<init>(TestRMWebServicesApps.java:111)
FAILED: org.apache.hadoop.yarn.server.resourcemanager.webapp.TestRMWebServicesDelegationTokenAuthentication.testDelegationTokenAuth[0]
Error Message:
Server returned HTTP response code: 500 for URL: http://localhost:8088/ws/v1/cluster/delegation-token
Stack Trace:
java.io.IOException: Server returned HTTP response code: 500 for URL: http://localhost:8088/ws/v1/cluster/delegation-token
at sun.net.www.protocol.http.HttpURLConnection.getInputStream(HttpURLConnection.java:1626)
at org.apache.hadoop.yarn.server.resourcemanager.webapp.TestRMWebServicesDelegationTokenAuthentication$3.call(TestRMWebServicesDelegationTokenAuthentication.java:407)
at org.apache.hadoop.yarn.server.resourcemanager.webapp.TestRMWebServicesDelegationTokenAuthentication$3.call(TestRMWebServicesDelegationTokenAuthentication.java:398)
at org.apache.hadoop.security.authentication.KerberosTestUtils$1.run(KerberosTestUtils.java:120)
at java.security.AccessController.doPrivileged(Native Method)
at javax.security.auth.Subject.doAs(Subject.java:415)
at org.apache.hadoop.security.authentication.KerberosTestUtils.doAs(KerberosTestUtils.java:117)
at org.apache.hadoop.security.authentication.KerberosTestUtils.doAsClient(KerberosTestUtils.java:133)
at org.apache.hadoop.yarn.server.resourcemanager.webapp.TestRMWebServicesDelegationTokenAuthentication.getDelegationToken(TestRMWebServicesDelegationTokenAuthentication.java:398)
at org.apache.hadoop.yarn.server.resourcemanager.webapp.TestRMWebServicesDelegationTokenAuthentication.testDelegationTokenAuth(TestRMWebServicesDelegationTokenAuthentication.java:195)
FAILED: org.apache.hadoop.yarn.server.resourcemanager.webapp.TestRMWebServicesDelegationTokenAuthentication.testDoAs[0]
Error Message:
Server returned HTTP response code: 500 for URL: http://localhost:8088/ws/v1/cluster/delegation-token?doAs=client2
Stack Trace:
java.io.IOException: Server returned HTTP response code: 500 for URL: http://localhost:8088/ws/v1/cluster/delegation-token?doAs=client2
at sun.net.www.protocol.http.HttpURLConnection.getInputStream(HttpURLConnection.java:1626)
at org.apache.hadoop.yarn.server.resourcemanager.webapp.TestRMWebServicesDelegationTokenAuthentication$1.call(TestRMWebServicesDelegationTokenAuthentication.java:330)
at org.apache.hadoop.yarn.server.resourcemanager.webapp.TestRMWebServicesDelegationTokenAuthentication$1.call(TestRMWebServicesDelegationTokenAuthentication.java:319)
at org.apache.hadoop.security.authentication.KerberosTestUtils$1.run(KerberosTestUtils.java:120)
at java.security.AccessController.doPrivileged(Native Method)
at javax.security.auth.Subject.doAs(Subject.java:415)
at org.apache.hadoop.security.authentication.KerberosTestUtils.doAs(KerberosTestUtils.java:117)
at org.apache.hadoop.security.authentication.KerberosTestUtils.doAsClient(KerberosTestUtils.java:133)
at org.apache.hadoop.yarn.server.resourcemanager.webapp.TestRMWebServicesDelegationTokenAuthentication.testDoAs(TestRMWebServicesDelegationTokenAuthentication.java:319)
FAILED: org.apache.hadoop.yarn.server.resourcemanager.webapp.TestRMWebServicesDelegationTokenAuthentication.testCancelledDelegationToken[0]
Error Message:
Server returned HTTP response code: 500 for URL: http://localhost:8088/ws/v1/cluster/delegation-token
Stack Trace:
java.io.IOException: Server returned HTTP response code: 500 for URL: http://localhost:8088/ws/v1/cluster/delegation-token
at sun.net.www.protocol.http.HttpURLConnection.getInputStream(HttpURLConnection.java:1626)
at org.apache.hadoop.yarn.server.resourcemanager.webapp.TestRMWebServicesDelegationTokenAuthentication$3.call(TestRMWebServicesDelegationTokenAuthentication.java:407)
at org.apache.hadoop.yarn.server.resourcemanager.webapp.TestRMWebServicesDelegationTokenAuthentication$3.call(TestRMWebServicesDelegationTokenAuthentication.java:398)
at org.apache.hadoop.security.authentication.KerberosTestUtils$1.run(KerberosTestUtils.java:120)
at java.security.AccessController.doPrivileged(Native Method)
at javax.security.auth.Subject.doAs(Subject.java:415)
at org.apache.hadoop.security.authentication.KerberosTestUtils.doAs(KerberosTestUtils.java:117)
at org.apache.hadoop.security.authentication.KerberosTestUtils.doAsClient(KerberosTestUtils.java:133)
at org.apache.hadoop.yarn.server.resourcemanager.webapp.TestRMWebServicesDelegationTokenAuthentication.getDelegationToken(TestRMWebServicesDelegationTokenAuthentication.java:398)
at org.apache.hadoop.yarn.server.resourcemanager.webapp.TestRMWebServicesDelegationTokenAuthentication.testCancelledDelegationToken(TestRMWebServicesDelegationTokenAuthentication.java:252)
FAILED: org.apache.hadoop.yarn.server.resourcemanager.webapp.TestRMWebServicesDelegationTokenAuthentication.testDelegationTokenOps[0]
Error Message:
Server returned HTTP response code: 500 for URL: http://localhost:8088/ws/v1/cluster/delegation-token
Stack Trace:
java.io.IOException: Server returned HTTP response code: 500 for URL: http://localhost:8088/ws/v1/cluster/delegation-token
at sun.net.www.protocol.http.HttpURLConnection.getInputStream(HttpURLConnection.java:1626)
at org.apache.hadoop.yarn.server.resourcemanager.webapp.TestRMWebServicesDelegationTokenAuthentication$3.call(TestRMWebServicesDelegationTokenAuthentication.java:407)
at org.apache.hadoop.yarn.server.resourcemanager.webapp.TestRMWebServicesDelegationTokenAuthentication$3.call(TestRMWebServicesDelegationTokenAuthentication.java:398)
at org.apache.hadoop.security.authentication.KerberosTestUtils$1.run(KerberosTestUtils.java:120)
at java.security.AccessController.doPrivileged(Native Method)
at javax.security.auth.Subject.doAs(Subject.java:415)
at org.apache.hadoop.security.authentication.KerberosTestUtils.doAs(KerberosTestUtils.java:117)
at org.apache.hadoop.security.authentication.KerberosTestUtils.doAsClient(KerberosTestUtils.java:133)
at org.apache.hadoop.yarn.server.resourcemanager.webapp.TestRMWebServicesDelegationTokenAuthentication.getDelegationToken(TestRMWebServicesDelegationTokenAuthentication.java:398)
at org.apache.hadoop.yarn.server.resourcemanager.webapp.TestRMWebServicesDelegationTokenAuthentication.testDelegationTokenOps(TestRMWebServicesDelegationTokenAuthentication.java:279)
FAILED: org.apache.hadoop.yarn.server.resourcemanager.webapp.TestRMWebServicesDelegationTokenAuthentication.testDelegationTokenAuth[1]
Error Message:
Server returned HTTP response code: 500 for URL: http://localhost:8088/ws/v1/cluster/delegation-token
Stack Trace:
java.io.IOException: Server returned HTTP response code: 500 for URL: http://localhost:8088/ws/v1/cluster/delegation-token
at sun.net.www.protocol.http.HttpURLConnection.getInputStream(HttpURLConnection.java:1626)
at org.apache.hadoop.yarn.server.resourcemanager.webapp.TestRMWebServicesDelegationTokenAuthentication$3.call(TestRMWebServicesDelegationTokenAuthentication.java:407)
at org.apache.hadoop.yarn.server.resourcemanager.webapp.TestRMWebServicesDelegationTokenAuthentication$3.call(TestRMWebServicesDelegationTokenAuthentication.java:398)
at org.apache.hadoop.security.authentication.KerberosTestUtils$1.run(KerberosTestUtils.java:120)
at java.security.AccessController.doPrivileged(Native Method)
at javax.security.auth.Subject.doAs(Subject.java:415)
at org.apache.hadoop.security.authentication.KerberosTestUtils.doAs(KerberosTestUtils.java:117)
at org.apache.hadoop.security.authentication.KerberosTestUtils.doAsClient(KerberosTestUtils.java:133)
at org.apache.hadoop.yarn.server.resourcemanager.webapp.TestRMWebServicesDelegationTokenAuthentication.getDelegationToken(TestRMWebServicesDelegationTokenAuthentication.java:398)
at org.apache.hadoop.yarn.server.resourcemanager.webapp.TestRMWebServicesDelegationTokenAuthentication.testDelegationTokenAuth(TestRMWebServicesDelegationTokenAuthentication.java:195)
FAILED: org.apache.hadoop.yarn.server.resourcemanager.webapp.TestRMWebServicesDelegationTokenAuthentication.testDoAs[1]
Error Message:
Server returned HTTP response code: 500 for URL: http://localhost:8088/ws/v1/cluster/delegation-token?doAs=client2
Stack Trace:
java.io.IOException: Server returned HTTP response code: 500 for URL: http://localhost:8088/ws/v1/cluster/delegation-token?doAs=client2
at sun.net.www.protocol.http.HttpURLConnection.getInputStream(HttpURLConnection.java:1626)
at org.apache.hadoop.yarn.server.resourcemanager.webapp.TestRMWebServicesDelegationTokenAuthentication$1.call(TestRMWebServicesDelegationTokenAuthentication.java:330)
at org.apache.hadoop.yarn.server.resourcemanager.webapp.TestRMWebServicesDelegationTokenAuthentication$1.call(TestRMWebServicesDelegationTokenAuthentication.java:319)
at org.apache.hadoop.security.authentication.KerberosTestUtils$1.run(KerberosTestUtils.java:120)
at java.security.AccessController.doPrivileged(Native Method)
at javax.security.auth.Subject.doAs(Subject.java:415)
at org.apache.hadoop.security.authentication.KerberosTestUtils.doAs(KerberosTestUtils.java:117)
at org.apache.hadoop.security.authentication.KerberosTestUtils.doAsClient(KerberosTestUtils.java:133)
at org.apache.hadoop.yarn.server.resourcemanager.webapp.TestRMWebServicesDelegationTokenAuthentication.testDoAs(TestRMWebServicesDelegationTokenAuthentication.java:319)
FAILED: org.apache.hadoop.yarn.server.resourcemanager.webapp.TestRMWebServicesDelegationTokenAuthentication.testCancelledDelegationToken[1]
Error Message:
Server returned HTTP response code: 500 for URL: http://localhost:8088/ws/v1/cluster/delegation-token
Stack Trace:
java.io.IOException: Server returned HTTP response code: 500 for URL: http://localhost:8088/ws/v1/cluster/delegation-token
at sun.net.www.protocol.http.HttpURLConnection.getInputStream(HttpURLConnection.java:1626)
at org.apache.hadoop.yarn.server.resourcemanager.webapp.TestRMWebServicesDelegationTokenAuthentication$3.call(TestRMWebServicesDelegationTokenAuthentication.java:407)
at org.apache.hadoop.yarn.server.resourcemanager.webapp.TestRMWebServicesDelegationTokenAuthentication$3.call(TestRMWebServicesDelegationTokenAuthentication.java:398)
at org.apache.hadoop.security.authentication.KerberosTestUtils$1.run(KerberosTestUtils.java:120)
at java.security.AccessController.doPrivileged(Native Method)
at javax.security.auth.Subject.doAs(Subject.java:415)
at org.apache.hadoop.security.authentication.KerberosTestUtils.doAs(KerberosTestUtils.java:117)
at org.apache.hadoop.security.authentication.KerberosTestUtils.doAsClient(KerberosTestUtils.java:133)
at org.apache.hadoop.yarn.server.resourcemanager.webapp.TestRMWebServicesDelegationTokenAuthentication.getDelegationToken(TestRMWebServicesDelegationTokenAuthentication.java:398)
at org.apache.hadoop.yarn.server.resourcemanager.webapp.TestRMWebServicesDelegationTokenAuthentication.testCancelledDelegationToken(TestRMWebServicesDelegationTokenAuthentication.java:252)
FAILED: org.apache.hadoop.yarn.server.resourcemanager.webapp.TestRMWebServicesDelegationTokenAuthentication.testDelegationTokenOps[1]
Error Message:
Server returned HTTP response code: 500 for URL: http://localhost:8088/ws/v1/cluster/delegation-token
Stack Trace:
java.io.IOException: Server returned HTTP response code: 500 for URL: http://localhost:8088/ws/v1/cluster/delegation-token
at sun.net.www.protocol.http.HttpURLConnection.getInputStream(HttpURLConnection.java:1626)
at org.apache.hadoop.yarn.server.resourcemanager.webapp.TestRMWebServicesDelegationTokenAuthentication$3.call(TestRMWebServicesDelegationTokenAuthentication.java:407)
at org.apache.hadoop.yarn.server.resourcemanager.webapp.TestRMWebServicesDelegationTokenAuthentication$3.call(TestRMWebServicesDelegationTokenAuthentication.java:398)
at org.apache.hadoop.security.authentication.KerberosTestUtils$1.run(KerberosTestUtils.java:120)
at java.security.AccessController.doPrivileged(Native Method)
at javax.security.auth.Subject.doAs(Subject.java:415)
at org.apache.hadoop.security.authentication.KerberosTestUtils.doAs(KerberosTestUtils.java:117)
at org.apache.hadoop.security.authentication.KerberosTestUtils.doAsClient(KerberosTestUtils.java:133)
at org.apache.hadoop.yarn.server.resourcemanager.webapp.TestRMWebServicesDelegationTokenAuthentication.getDelegationToken(TestRMWebServicesDelegationTokenAuthentication.java:398)
at org.apache.hadoop.yarn.server.resourcemanager.webapp.TestRMWebServicesDelegationTokenAuthentication.testDelegationTokenOps(TestRMWebServicesDelegationTokenAuthentication.java:279)
FAILED: org.apache.hadoop.yarn.server.resourcemanager.webapp.TestRMWebappAuthentication.testSimpleAuth[0]
Error Message:
org/apache/hadoop/yarn/server/webproxy/AppReportFetcher
Stack Trace:
java.lang.NoClassDefFoundError: org/apache/hadoop/yarn/server/webproxy/AppReportFetcher
at java.net.URLClassLoader$1.run(URLClassLoader.java:366)
at java.net.URLClassLoader$1.run(URLClassLoader.java:355)
at java.security.AccessController.doPrivileged(Native Method)
at java.net.URLClassLoader.findClass(URLClassLoader.java:354)
at java.lang.ClassLoader.loadClass(ClassLoader.java:425)
at sun.misc.Launcher$AppClassLoader.loadClass(Launcher.java:308)
at java.lang.ClassLoader.loadClass(ClassLoader.java:358)
at org.apache.hadoop.yarn.server.resourcemanager.ResourceManager.startWepApp(ResourceManager.java:965)
at org.apache.hadoop.yarn.server.resourcemanager.MockRM.startWepApp(MockRM.java:635)
at org.apache.hadoop.yarn.server.resourcemanager.ResourceManager.serviceStart(ResourceManager.java:1074)
at org.apache.hadoop.service.AbstractService.start(AbstractService.java:193)
at org.apache.hadoop.yarn.server.resourcemanager.webapp.TestRMWebappAuthentication.testSimpleAuth(TestRMWebappAuthentication.java:147)
FAILED: org.apache.hadoop.yarn.server.resourcemanager.webapp.TestRMWebappAuthentication.testSimpleAuth[1]
Error Message:
org/apache/hadoop/yarn/server/webproxy/AppReportFetcher
Stack Trace:
java.lang.NoClassDefFoundError: org/apache/hadoop/yarn/server/webproxy/AppReportFetcher
at org.apache.hadoop.yarn.server.resourcemanager.ResourceManager.startWepApp(ResourceManager.java:965)
at org.apache.hadoop.yarn.server.resourcemanager.MockRM.startWepApp(MockRM.java:635)
at org.apache.hadoop.yarn.server.resourcemanager.ResourceManager.serviceStart(ResourceManager.java:1074)
at org.apache.hadoop.service.AbstractService.start(AbstractService.java:193)
at org.apache.hadoop.yarn.server.resourcemanager.webapp.TestRMWebappAuthentication.testSimpleAuth(TestRMWebappAuthentication.java:147)