You are viewing a plain text version of this content. The canonical link for it is here.
Posted to builds@lucene.apache.org by Policeman Jenkins Server <je...@thetaphi.de> on 2025/01/13 06:19:40 UTC

[JENKINS] Lucene-MMAPv2-Windows (64bit/hotspot/jdk-22) - Build # 1767 - Failure!

Build: https://jenkins.thetaphi.de/job/Lucene-MMAPv2-Windows/1767/
Java: 64bit/hotspot/jdk-22 -XX:-UseCompressedOops -XX:+UseSerialGC

3 tests failed.
FAILED:  TEST-org.apache.lucene.classification.Test20NewsgroupsClassification.xml.[empty]

Error Message:


Stack Trace:
Test report file C:\Users\jenkins\workspace\Lucene-MMAPv2-Windows\lucene\classification\build\test-results\test\TEST-org.apache.lucene.classification.Test20NewsgroupsClassification.xml was length 0

FAILED:  TEST-org.apache.lucene.classification.document.TestSimpleNaiveBayesDocumentClassifier.xml.[empty]

Error Message:


Stack Trace:
Test report file C:\Users\jenkins\workspace\Lucene-MMAPv2-Windows\lucene\classification\build\test-results\test\TEST-org.apache.lucene.classification.document.TestSimpleNaiveBayesDocumentClassifier.xml was length 0

FAILED:  TEST-org.apache.lucene.classification.utils.TestConfusionMatrixGenerator.xml.[empty]

Error Message:


Stack Trace:
Test report file C:\Users\jenkins\workspace\Lucene-MMAPv2-Windows\lucene\classification\build\test-results\test\TEST-org.apache.lucene.classification.utils.TestConfusionMatrixGenerator.xml was length 0