You are viewing a plain text version of this content. The canonical link for it is here.
Posted to notifications@jclouds.apache.org by BuildHive <bu...@cloudbees.com> on 2014/09/11 13:24:48 UTC
Build failed in Jenkins: jclouds » jclouds-labs-google #1352
See <https://buildhive.cloudbees.com/job/jclouds/job/jclouds-labs-google/1352/changes>
Changes:
[stuarthendren] JCLOUDS-703 missing imageSpaceGb from machineType
[stuarthendren] JCLOUDS-703 removing imageSpaceGb from machineType
------------------------------------------
[...truncated 188 lines...]
[WARNING] <https://buildhive.cloudbees.com/job/jclouds/job/jclouds-labs-google/ws/oauth/src/test/java/org/jclouds/oauth/v2/json/JWTTokenRequestFormatTest.java>: Recompile with -Xlint:deprecation for details.
[INFO]
[INFO] --- maven-surefire-plugin:2.17:test (default-test) @ oauth ---
[INFO] Surefire report directory: <https://buildhive.cloudbees.com/job/jclouds/job/jclouds-labs-google/ws/oauth/target/surefire-reports>
-------------------------------------------------------
T E S T S
-------------------------------------------------------
Running TestSuite
Configuring TestNG with: TestNG652Configurator
Starting test testAllContains(org.jclouds.oauth.v2.OAuthApiMetadataTest)
Starting test testUsedBase64IsUrlSafe(org.jclouds.oauth.v2.internal.Base64UrlSafeTest)
Starting test test(org.jclouds.oauth.v2.parse.ParseTokenTest)
Starting test testTransformableToContains(org.jclouds.oauth.v2.OAuthApiMetadataTest)
Starting test testWithId(org.jclouds.oauth.v2.OAuthApiMetadataTest)
[pool-1-thread-3] Test testTransformableToContains(org.jclouds.oauth.v2.OAuthApiMetadataTest) succeeded: 97ms
Test suite progress: tests succeeded: 1, failed: 0, skipped: 0.
Starting test testPayloadIsUrlSafe(org.jclouds.oauth.v2.json.JWTTokenRequestFormatTest)
[pool-1-thread-1] Test testUsedBase64IsUrlSafe(org.jclouds.oauth.v2.internal.Base64UrlSafeTest) succeeded: 151ms
Test suite progress: tests succeeded: 2, failed: 0, skipped: 0.
[pool-1-thread-2] Test testAllContains(org.jclouds.oauth.v2.OAuthApiMetadataTest) succeeded: 150ms
Test suite progress: tests succeeded: 3, failed: 0, skipped: 0.
Starting test testGenerateJWTRequest(org.jclouds.oauth.v2.features.OAuthApiExpectTest)
Starting test testLoadPKString(org.jclouds.oauth.v2.functions.OAuthCredentialsFromPKTest)
[pool-1-thread-4] Test testWithId(org.jclouds.oauth.v2.OAuthApiMetadataTest) succeeded: 182ms
Test suite progress: tests succeeded: 4, failed: 0, skipped: 0.
Starting test testAuthorizationExceptionIsThrownOnBadKeys(org.jclouds.oauth.v2.functions.OAuthCredentialsSupplierTest)
[pool-1-thread-4] Test testAuthorizationExceptionIsThrownOnBadKeys(org.jclouds.oauth.v2.functions.OAuthCredentialsSupplierTest) succeeded: 211ms
Test suite progress: tests succeeded: 5, failed: 0, skipped: 0.
Starting test testCredentialsAreLoadedOnRightAlgoAndCredentials(org.jclouds.oauth.v2.functions.OAuthCredentialsSupplierTest)
[pool-1-thread-2] Test testLoadPKString(org.jclouds.oauth.v2.functions.OAuthCredentialsFromPKTest) succeeded: 582ms
Test suite progress: tests succeeded: 6, failed: 0, skipped: 0.
[pool-1-thread-4] Test testCredentialsAreLoadedOnRightAlgoAndCredentials(org.jclouds.oauth.v2.functions.OAuthCredentialsSupplierTest) succeeded: 194ms
Test suite progress: tests succeeded: 7, failed: 0, skipped: 0.
Starting test test409MakesIllegalStateException(org.jclouds.oauth.v2.handlers.OAuthErrorHandlerTest)
Starting test testGSEChildExceptionsPropagateAsAuthorizationException(org.jclouds.oauth.v2.functions.OAuthCredentialsSupplierTest)
[pool-1-thread-2] Test testGSEChildExceptionsPropagateAsAuthorizationException(org.jclouds.oauth.v2.functions.OAuthCredentialsSupplierTest) succeeded: 1ms
Test suite progress: tests succeeded: 8, failed: 0, skipped: 0.
Starting test testSignPayload(org.jclouds.oauth.v2.functions.SignerFunctionTest)
[pool-1-thread-2] Test testSignPayload(org.jclouds.oauth.v2.functions.SignerFunctionTest) succeeded: 727ms
Test suite progress: tests succeeded: 9, failed: 0, skipped: 0.
[pool-1-thread-4] Test test409MakesIllegalStateException(org.jclouds.oauth.v2.handlers.OAuthErrorHandlerTest) succeeded: 1373ms
Test suite progress: tests succeeded: 10, failed: 0, skipped: 0.
[pool-1-thread-5] Test test(org.jclouds.oauth.v2.parse.ParseTokenTest) succeeded: 4853ms
Test suite progress: tests succeeded: 11, failed: 0, skipped: 0.
[pool-1-thread-3] Test testPayloadIsUrlSafe(org.jclouds.oauth.v2.json.JWTTokenRequestFormatTest) succeeded: 6858ms
Test suite progress: tests succeeded: 12, failed: 0, skipped: 0.
[pool-1-thread-1] Test testGenerateJWTRequest(org.jclouds.oauth.v2.features.OAuthApiExpectTest) succeeded: 6929ms
Test suite progress: tests succeeded: 13, failed: 0, skipped: 0.
Tests run: 13, Failures: 0, Errors: 0, Skipped: 0, Time elapsed: 11.469 sec - in TestSuite
Results :
Tests run: 13, Failures: 0, Errors: 0, Skipped: 0
[JENKINS] Recording test results
[INFO]
[INFO] --- maven-jar-plugin:2.4:jar (default-jar) @ oauth ---
[INFO] Building jar: <https://buildhive.cloudbees.com/job/jclouds/job/jclouds-labs-google/ws/oauth/target/oauth-2.0.0-SNAPSHOT.jar>
[INFO]
[INFO] --- maven-site-plugin:3.3:attach-descriptor (attach-descriptor) @ oauth ---
[INFO]
[INFO] --- apache-rat-plugin:0.10:check (default) @ oauth ---
[INFO] 51 implicit excludes (use -debug for more details).
[INFO] Exclude: **/src/test/resources/**/*.sh
[INFO] Exclude: **/src/test/resources/**/*.bat
[INFO] Exclude: **/src/test/resources/**/*.cmd
[INFO] Exclude: **/src/test/resources/**/*.txt
[INFO] Exclude: **/src/test/resources/**/*.gz
[INFO] Exclude: **/src/test/resources/**/*.xml
[INFO] Exclude: **/services/*LoggingModule
[INFO] Exclude: **/services/*ApiMetadata
[INFO] Exclude: **/services/*ProviderMetadata
[INFO] Exclude: **/LICENSE.txt
[INFO] Exclude: **/header.txt
[INFO] Exclude: **/NOTICE.txt
[INFO] Exclude: **/DISCLAIMER
[INFO] Exclude: **/BUILD.txt
[INFO] Exclude: **/CHANGES.txt
[INFO] Exclude: **/README.md
[INFO] Exclude: **/README.txt
[INFO] Exclude: **/DEPENDENCIES
[INFO] Exclude: **/CONTRIBUTING.md
[INFO] Exclude: **/*json
[INFO] Exclude: **/*readme
[INFO] Exclude: **/test
[INFO] Exclude: **/test.pub
[INFO] Exclude: **/target/**
[INFO] Exclude: **/test-output/**
[INFO] Exclude: **/bin/**
[INFO] Exclude: **/.settings/**
[INFO] Exclude: **/.classpath
[INFO] Exclude: **/.dir-locals.el
[INFO] Exclude: **/.project
[INFO] Exclude: **/.idea/**
[INFO] Exclude: **/*.iml
[INFO] Exclude: **/*.eml
[INFO] Exclude: **/*.ipr
[INFO] Exclude: **/*.iws
[INFO] Exclude: **/*.DS_STORE
[INFO] Exclude: **/TAGS
[INFO] Exclude: **/.metadata/**
[INFO] Exclude: **/atlassian-ide-plugin.xml
[INFO] Exclude: **/.DS_Store
[INFO] Exclude: .mailmap
[INFO] Exclude: .git/**
[INFO] Exclude: **/.gitignore
[INFO] Exclude: **/.gitattributes
[INFO] Exclude: **/.java-version
[INFO] Exclude: .repository/**
[INFO] Exclude: gc.log
[INFO] 46 resources included (use -debug for more details)
Warning: org.apache.xerces.jaxp.SAXParserImpl$JAXPSAXParser: Property 'http://www.oracle.com/xml/jaxp/properties/entityExpansionLimit' is not recognized.
Compiler warnings:
WARNING: 'org.apache.xerces.jaxp.SAXParserImpl: Property 'http://javax.xml.XMLConstants/property/accessExternalDTD' is not recognized.'
Warning: org.apache.xerces.parsers.SAXParser: Feature 'http://javax.xml.XMLConstants/feature/secure-processing' is not recognized.
Warning: org.apache.xerces.parsers.SAXParser: Property 'http://javax.xml.XMLConstants/property/accessExternalDTD' is not recognized.
Warning: org.apache.xerces.parsers.SAXParser: Property 'http://www.oracle.com/xml/jaxp/properties/entityExpansionLimit' is not recognized.
[INFO] Rat check: Summary of files. Unapproved: 0 unknown: 0 generated: 0 approved: 44 licence.
[INFO]
[INFO] --- maven-jar-plugin:2.4:test-jar (default) @ oauth ---
[INFO] Building jar: <https://buildhive.cloudbees.com/job/jclouds/job/jclouds-labs-google/ws/oauth/target/oauth-2.0.0-SNAPSHOT-tests.jar>
[INFO]
[INFO] --- maven-surefire-plugin:2.17:test (integration) @ oauth ---
[JENKINS] Recording test results
[INFO]
[INFO] --- maven-duplicate-finder-plugin:1.0.5:check (default) @ oauth ---
[INFO] Checking compile classpath
[INFO] Checking runtime classpath
[INFO] Checking test classpath
[INFO]
[INFO] ------------------------------------------------------------------------
[INFO] Building jclouds Google Compute Engine provider 2.0.0-SNAPSHOT
[INFO] ------------------------------------------------------------------------
[INFO] Downloading: https://repository.apache.org/content/repositories/snapshots/org/apache/jclouds/jclouds-compute/2.0.0-SNAPSHOT/maven-metadata.xml
[INFO] Downloading: http://repository.apache.org/snapshots/org/apache/jclouds/jclouds-compute/2.0.0-SNAPSHOT/maven-metadata.xml
[INFO] Downloaded: http://repository.apache.org/snapshots/org/apache/jclouds/jclouds-compute/2.0.0-SNAPSHOT/maven-metadata.xml (2 KB at 3.2 KB/sec)
[INFO] Downloaded: https://repository.apache.org/content/repositories/snapshots/org/apache/jclouds/jclouds-compute/2.0.0-SNAPSHOT/maven-metadata.xml (2 KB at 2.8 KB/sec)
[INFO] Downloading: https://repository.apache.org/content/repositories/snapshots/org/apache/jclouds/jclouds-scriptbuilder/2.0.0-SNAPSHOT/maven-metadata.xml
[INFO] Downloading: http://repository.apache.org/snapshots/org/apache/jclouds/jclouds-scriptbuilder/2.0.0-SNAPSHOT/maven-metadata.xml
[INFO] Downloaded: https://repository.apache.org/content/repositories/snapshots/org/apache/jclouds/jclouds-scriptbuilder/2.0.0-SNAPSHOT/maven-metadata.xml (2 KB at 3.4 KB/sec)
[INFO] Downloaded: http://repository.apache.org/snapshots/org/apache/jclouds/jclouds-scriptbuilder/2.0.0-SNAPSHOT/maven-metadata.xml (2 KB at 3.1 KB/sec)
[INFO] Downloading: https://repository.apache.org/content/repositories/snapshots/org/apache/jclouds/driver/jclouds-sshj/2.0.0-SNAPSHOT/maven-metadata.xml
[INFO] Downloading: http://repository.apache.org/snapshots/org/apache/jclouds/driver/jclouds-sshj/2.0.0-SNAPSHOT/maven-metadata.xml
[INFO] Downloaded: http://repository.apache.org/snapshots/org/apache/jclouds/driver/jclouds-sshj/2.0.0-SNAPSHOT/maven-metadata.xml (2 KB at 4.2 KB/sec)
[INFO] Downloaded: https://repository.apache.org/content/repositories/snapshots/org/apache/jclouds/driver/jclouds-sshj/2.0.0-SNAPSHOT/maven-metadata.xml (2 KB at 3.9 KB/sec)
[INFO] Downloading: https://repository.apache.org/content/repositories/snapshots/org/apache/jclouds/driver/jclouds-bouncycastle/2.0.0-SNAPSHOT/maven-metadata.xml
[INFO] Downloading: http://repository.apache.org/snapshots/org/apache/jclouds/driver/jclouds-bouncycastle/2.0.0-SNAPSHOT/maven-metadata.xml
[INFO] Downloading: https://oss.sonatype.org/content/repositories/snapshots/org/apache/jclouds/driver/jclouds-bouncycastle/2.0.0-SNAPSHOT/maven-metadata.xml
[INFO] Downloaded: https://repository.apache.org/content/repositories/snapshots/org/apache/jclouds/driver/jclouds-bouncycastle/2.0.0-SNAPSHOT/maven-metadata.xml (2 KB at 4.4 KB/sec)
[INFO] Downloaded: http://repository.apache.org/snapshots/org/apache/jclouds/driver/jclouds-bouncycastle/2.0.0-SNAPSHOT/maven-metadata.xml (2 KB at 4.1 KB/sec)
[INFO] Downloading: http://repo.cloudbees.com/content/repositories/central/net/schmizz/sshj/maven-metadata.xml
[INFO] Downloading: http://repository.apache.org/snapshots/net/schmizz/sshj/maven-metadata.xml
[INFO] Downloading: https://repository.apache.org/content/repositories/snapshots/net/schmizz/sshj/maven-metadata.xml
[INFO] Downloading: https://oss.sonatype.org/content/repositories/snapshots/net/schmizz/sshj/maven-metadata.xml
[INFO] Downloaded: http://repo.cloudbees.com/content/repositories/central/net/schmizz/sshj/maven-metadata.xml (790 B at 7.6 KB/sec)
[INFO] Downloading: https://oss.sonatype.org/content/repositories/snapshots/net/schmizz/sshj/maven-metadata.xml
[INFO] Downloaded: https://oss.sonatype.org/content/repositories/snapshots/net/schmizz/sshj/maven-metadata.xml (398 B at 1.1 KB/sec)
[INFO] Downloaded: https://oss.sonatype.org/content/repositories/snapshots/net/schmizz/sshj/maven-metadata.xml (398 B at 1.0 KB/sec)
[INFO] Downloading: https://repository.apache.org/content/repositories/snapshots/net/schmizz/sshj/0.9.1-SNAPSHOT/maven-metadata.xml
[INFO] Downloading: https://oss.sonatype.org/content/repositories/snapshots/net/schmizz/sshj/0.9.1-SNAPSHOT/maven-metadata.xml
[INFO] Downloading: http://repository.apache.org/snapshots/net/schmizz/sshj/0.9.1-SNAPSHOT/maven-metadata.xml
[INFO] Downloading: https://oss.sonatype.org/content/repositories/snapshots/net/schmizz/sshj/0.9.1-SNAPSHOT/maven-metadata.xml
[INFO] Downloaded: https://oss.sonatype.org/content/repositories/snapshots/net/schmizz/sshj/0.9.1-SNAPSHOT/maven-metadata.xml (2 KB at 13.1 KB/sec)
[INFO] Downloaded: https://oss.sonatype.org/content/repositories/snapshots/net/schmizz/sshj/0.9.1-SNAPSHOT/maven-metadata.xml (2 KB at 11.9 KB/sec)
[INFO] Downloading: https://repository.apache.org/content/repositories/snapshots/net/schmizz/sshj/0.10.1-SNAPSHOT/maven-metadata.xml
[INFO] Downloading: https://oss.sonatype.org/content/repositories/snapshots/net/schmizz/sshj/0.10.1-SNAPSHOT/maven-metadata.xml
[INFO] Downloading: http://repository.apache.org/snapshots/net/schmizz/sshj/0.10.1-SNAPSHOT/maven-metadata.xml
[INFO] Downloading: https://oss.sonatype.org/content/repositories/snapshots/net/schmizz/sshj/0.10.1-SNAPSHOT/maven-metadata.xml
[INFO] Downloaded: https://oss.sonatype.org/content/repositories/snapshots/net/schmizz/sshj/0.10.1-SNAPSHOT/maven-metadata.xml (2 KB at 16.6 KB/sec)
[INFO] Downloaded: https://oss.sonatype.org/content/repositories/snapshots/net/schmizz/sshj/0.10.1-SNAPSHOT/maven-metadata.xml (2 KB at 16.2 KB/sec)
[INFO]
[INFO] --- maven-clean-plugin:2.5:clean (default-clean) @ google-compute-engine ---
[INFO]
[INFO] --- maven-enforcer-plugin:1.1.1:enforce (enforce-banned-dependencies) @ google-compute-engine ---
[INFO]
[INFO] --- maven-enforcer-plugin:1.1.1:enforce (enforce-java) @ google-compute-engine ---
[INFO]
[INFO] --- maven-checkstyle-plugin:2.12.1:check (checkstyle) @ google-compute-engine ---
[INFO]
[INFO] ------------------------------------------------------------------------
[INFO] Reactor Summary:
[INFO]
[INFO] Apache jclouds labs google ........................ SUCCESS [41.441s]
[INFO] jclouds OAuth core ................................ SUCCESS [56.249s]
[INFO] jclouds Google Compute Engine provider ............ FAILURE [11.715s]
[INFO] jclouds Google Cloud Storage provider ............. SKIPPED
[INFO] ------------------------------------------------------------------------
[INFO] BUILD FAILURE
[INFO] ------------------------------------------------------------------------
[INFO] Total time: 1:59.632s
[INFO] Finished at: Thu Sep 11 11:24:46 UTC 2014
[INFO] Final Memory: 34M/81M
[INFO] ------------------------------------------------------------------------
Waiting for Jenkins to finish collecting data
[ERROR] Failed to execute goal org.apache.maven.plugins:maven-checkstyle-plugin:2.12.1:check (checkstyle) on project google-compute-engine: You have 1 Checkstyle violation. -> [Help 1]
org.apache.maven.lifecycle.LifecycleExecutionException: Failed to execute goal org.apache.maven.plugins:maven-checkstyle-plugin:2.12.1:check (checkstyle) on project google-compute-engine: You have 1 Checkstyle violation.
at org.apache.maven.lifecycle.internal.MojoExecutor.execute(MojoExecutor.java:212)
at org.apache.maven.lifecycle.internal.MojoExecutor.execute(MojoExecutor.java:153)
at org.apache.maven.lifecycle.internal.MojoExecutor.execute(MojoExecutor.java:145)
at org.apache.maven.lifecycle.internal.LifecycleModuleBuilder.buildProject(LifecycleModuleBuilder.java:84)
at org.apache.maven.lifecycle.internal.LifecycleModuleBuilder.buildProject(LifecycleModuleBuilder.java:59)
at org.apache.maven.lifecycle.internal.LifecycleStarter.singleThreadedBuild(LifecycleStarter.java:183)
at org.apache.maven.lifecycle.internal.LifecycleStarter.execute(LifecycleStarter.java:161)
at org.apache.maven.DefaultMaven.doExecute(DefaultMaven.java:317)
at org.apache.maven.DefaultMaven.execute(DefaultMaven.java:152)
at org.jvnet.hudson.maven3.launcher.Maven31Launcher.main(Maven31Launcher.java:132)
at sun.reflect.NativeMethodAccessorImpl.invoke0(Native Method)
at sun.reflect.NativeMethodAccessorImpl.invoke(NativeMethodAccessorImpl.java:57)
at sun.reflect.DelegatingMethodAccessorImpl.invoke(DelegatingMethodAccessorImpl.java:43)
at java.lang.reflect.Method.invoke(Method.java:606)
at org.codehaus.plexus.classworlds.launcher.Launcher.launchStandard(Launcher.java:330)
at org.codehaus.plexus.classworlds.launcher.Launcher.launch(Launcher.java:238)
at jenkins.maven3.agent.Maven31Main.launch(Maven31Main.java:181)
at sun.reflect.NativeMethodAccessorImpl.invoke0(Native Method)
at sun.reflect.NativeMethodAccessorImpl.invoke(NativeMethodAccessorImpl.java:57)
at sun.reflect.DelegatingMethodAccessorImpl.invoke(DelegatingMethodAccessorImpl.java:43)
at java.lang.reflect.Method.invoke(Method.java:606)
at hudson.maven.Maven3Builder.call(Maven3Builder.java:134)
at hudson.maven.Maven3Builder.call(Maven3Builder.java:69)
at hudson.remoting.UserRequest.perform(UserRequest.java:118)
at hudson.remoting.UserRequest.perform(UserRequest.java:48)
at hudson.remoting.Request$2.run(Request.java:328)
at hudson.remoting.InterceptingExecutorService$1.call(InterceptingExecutorService.java:72)
at java.util.concurrent.FutureTask.run(FutureTask.java:262)
at java.util.concurrent.ThreadPoolExecutor.runWorker(ThreadPoolExecutor.java:1145)
at java.util.concurrent.ThreadPoolExecutor$Worker.run(ThreadPoolExecutor.java:615)
at java.lang.Thread.run(Thread.java:744)
Caused by: org.apache.maven.plugin.MojoFailureException: You have 1 Checkstyle violation.
at org.apache.maven.plugin.checkstyle.CheckstyleViolationCheckMojo.execute(CheckstyleViolationCheckMojo.java:542)
at org.apache.maven.plugin.DefaultBuildPluginManager.executeMojo(DefaultBuildPluginManager.java:106)
at org.apache.maven.lifecycle.internal.MojoExecutor.execute(MojoExecutor.java:208)
... 30 more
[ERROR]
[ERROR] Re-run Maven using the -X switch to enable full debug logging.
[ERROR]
[ERROR] For more information about the errors and possible solutions, please read the following articles:
[ERROR] [Help 1] http://cwiki.apache.org/confluence/display/MAVEN/MojoFailureException
[ERROR]
[ERROR] After correcting the problems, you can resume the build with the command
[ERROR] mvn <goals> -rf :google-compute-engine
[JENKINS] Archiving <https://buildhive.cloudbees.com/job/jclouds/job/jclouds-labs-google/ws/pom.xml> to org.apache.jclouds.labs/jclouds-labs-google/2.0.0-SNAPSHOT/jclouds-labs-google-2.0.0-SNAPSHOT.pom
[JENKINS] Archiving <https://buildhive.cloudbees.com/job/jclouds/job/jclouds-labs-google/ws/target/jclouds-labs-google-2.0.0-SNAPSHOT-tests.jar> to org.apache.jclouds.labs/jclouds-labs-google/2.0.0-SNAPSHOT/jclouds-labs-google-2.0.0-SNAPSHOT-tests.jar
[JENKINS] Archiving <https://buildhive.cloudbees.com/job/jclouds/job/jclouds-labs-google/ws/google-cloud-storage/pom.xml> to org.apache.jclouds.labs/google-cloud-storage/2.0.0-SNAPSHOT/google-cloud-storage-2.0.0-SNAPSHOT.pom
[JENKINS] Archiving <https://buildhive.cloudbees.com/job/jclouds/job/jclouds-labs-google/ws/google-compute-engine/pom.xml> to org.apache.jclouds.labs/google-compute-engine/2.0.0-SNAPSHOT/google-compute-engine-2.0.0-SNAPSHOT.pom
[JENKINS] Archiving <https://buildhive.cloudbees.com/job/jclouds/job/jclouds-labs-google/ws/oauth/pom.xml> to org.apache.jclouds.labs/oauth/2.0.0-SNAPSHOT/oauth-2.0.0-SNAPSHOT.pom
[JENKINS] Archiving <https://buildhive.cloudbees.com/job/jclouds/job/jclouds-labs-google/ws/oauth/target/oauth-2.0.0-SNAPSHOT.jar> to org.apache.jclouds.labs/oauth/2.0.0-SNAPSHOT/oauth-2.0.0-SNAPSHOT.jar
[JENKINS] Archiving <https://buildhive.cloudbees.com/job/jclouds/job/jclouds-labs-google/ws/oauth/target/oauth-2.0.0-SNAPSHOT-tests.jar> to org.apache.jclouds.labs/oauth/2.0.0-SNAPSHOT/oauth-2.0.0-SNAPSHOT-tests.jar
channel stopped