You are viewing a plain text version of this content. The canonical link for it is here.
Posted to dev@zookeeper.apache.org by Apache Jenkins Server <je...@builds.apache.org> on 2013/10/31 22:09:11 UTC
ZooKeeper-trunk-openjdk7 - Build # 308 - Still Failing
See https://builds.apache.org/job/ZooKeeper-trunk-openjdk7/308/
###################################################################################
########################## LAST 60 LINES OF THE CONSOLE ###########################
[...truncated 402243 lines...]
[junit] 2013-10-31 21:08:54,554 [myid:] - INFO [main:ZooKeeperServer@428] - shutting down
[junit] 2013-10-31 21:08:54,554 [myid:] - INFO [main:SessionTrackerImpl@183] - Shutting down
[junit] 2013-10-31 21:08:54,554 [myid:] - INFO [main:PrepRequestProcessor@972] - Shutting down
[junit] 2013-10-31 21:08:54,554 [myid:] - INFO [main:SyncRequestProcessor@190] - Shutting down
[junit] 2013-10-31 21:08:54,554 [myid:] - INFO [ProcessThread(sid:0 cport:-1)::PrepRequestProcessor@156] - PrepRequestProcessor exited loop!
[junit] 2013-10-31 21:08:54,554 [myid:] - INFO [SyncThread:0:SyncRequestProcessor@168] - SyncRequestProcessor exited!
[junit] 2013-10-31 21:08:54,555 [myid:] - INFO [main:FinalRequestProcessor@442] - shutdown of request processor complete
[junit] 2013-10-31 21:08:54,555 [myid:] - INFO [main:FourLetterWordMain@43] - connecting to 127.0.0.1 11221
[junit] 2013-10-31 21:08:54,556 [myid:] - INFO [main:JMXEnv@133] - ensureOnly:[]
[junit] 2013-10-31 21:08:54,557 [myid:] - INFO [main:ClientBase@414] - STARTING server
[junit] 2013-10-31 21:08:54,557 [myid:] - INFO [main:ZooKeeperServer@149] - Created server with tickTime 3000 minSessionTimeout 6000 maxSessionTimeout 60000 datadir /home/jenkins/jenkins-slave/workspace/ZooKeeper-trunk-openjdk7/trunk/build/test/tmp/test5207999988306855383.junit.dir/version-2 snapdir /home/jenkins/jenkins-slave/workspace/ZooKeeper-trunk-openjdk7/trunk/build/test/tmp/test5207999988306855383.junit.dir/version-2
[junit] 2013-10-31 21:08:54,558 [myid:] - INFO [main:NIOServerCnxnFactory@670] - Configuring NIO connection handler with 10s sessionless connection timeout, 2 selector thread(s), 16 worker threads, and 64 kB direct buffers.
[junit] 2013-10-31 21:08:54,558 [myid:] - INFO [main:NIOServerCnxnFactory@683] - binding to port 0.0.0.0/0.0.0.0:11221
[junit] 2013-10-31 21:08:54,559 [myid:] - INFO [main:FileSnap@83] - Reading snapshot /home/jenkins/jenkins-slave/workspace/ZooKeeper-trunk-openjdk7/trunk/build/test/tmp/test5207999988306855383.junit.dir/version-2/snapshot.b
[junit] 2013-10-31 21:08:54,562 [myid:] - INFO [main:FileTxnSnapLog@297] - Snapshotting: 0xb to /home/jenkins/jenkins-slave/workspace/ZooKeeper-trunk-openjdk7/trunk/build/test/tmp/test5207999988306855383.junit.dir/version-2/snapshot.b
[junit] 2013-10-31 21:08:54,564 [myid:] - INFO [main:FourLetterWordMain@43] - connecting to 127.0.0.1 11221
[junit] 2013-10-31 21:08:54,564 [myid:] - INFO [NIOServerCxnFactory.AcceptThread:0.0.0.0/0.0.0.0:11221:NIOServerCnxnFactory$AcceptThread@296] - Accepted socket connection from /127.0.0.1:43516
[junit] 2013-10-31 21:08:54,565 [myid:] - INFO [NIOWorkerThread-1:NIOServerCnxn@828] - Processing stat command from /127.0.0.1:43516
[junit] 2013-10-31 21:08:54,565 [myid:] - INFO [NIOWorkerThread-1:NIOServerCnxn$StatCommand@677] - Stat command output
[junit] 2013-10-31 21:08:54,566 [myid:] - INFO [NIOWorkerThread-1:NIOServerCnxn@999] - Closed socket connection for client /127.0.0.1:43516 (no session established for client)
[junit] 2013-10-31 21:08:54,566 [myid:] - INFO [main:JMXEnv@133] - ensureOnly:[InMemoryDataTree, StandaloneServer_port]
[junit] 2013-10-31 21:08:54,568 [myid:] - INFO [main:JMXEnv@105] - expect:InMemoryDataTree
[junit] 2013-10-31 21:08:54,568 [myid:] - INFO [main:JMXEnv@108] - found:InMemoryDataTree org.apache.ZooKeeperService:name0=StandaloneServer_port-1,name1=InMemoryDataTree
[junit] 2013-10-31 21:08:54,568 [myid:] - INFO [main:JMXEnv@105] - expect:StandaloneServer_port
[junit] 2013-10-31 21:08:54,568 [myid:] - INFO [main:JMXEnv@108] - found:StandaloneServer_port org.apache.ZooKeeperService:name0=StandaloneServer_port-1
[junit] 2013-10-31 21:08:54,569 [myid:] - INFO [main:JUnit4ZKTestRunner$LoggedInvokeMethod@57] - FINISHED TEST METHOD testQuota
[junit] 2013-10-31 21:08:54,569 [myid:] - INFO [main:ClientBase@451] - tearDown starting
[junit] 2013-10-31 21:08:54,635 [myid:] - INFO [main:ZooKeeper@777] - Session: 0x1421058f32f0000 closed
[junit] 2013-10-31 21:08:54,635 [myid:] - INFO [main-EventThread:ClientCnxn$EventThread@513] - EventThread shut down
[junit] 2013-10-31 21:08:54,635 [myid:] - INFO [main:ClientBase@421] - STOPPING server
[junit] 2013-10-31 21:08:54,636 [myid:] - INFO [ConnnectionExpirer:NIOServerCnxnFactory$ConnectionExpirerThread@583] - ConnnectionExpirerThread interrupted
[junit] 2013-10-31 21:08:54,636 [myid:] - INFO [NIOServerCxnFactory.AcceptThread:0.0.0.0/0.0.0.0:11221:NIOServerCnxnFactory$AcceptThread@219] - accept thread exitted run method
[junit] 2013-10-31 21:08:54,636 [myid:] - INFO [NIOServerCxnFactory.SelectorThread-1:NIOServerCnxnFactory$SelectorThread@420] - selector thread exitted run method
[junit] 2013-10-31 21:08:54,636 [myid:] - INFO [NIOServerCxnFactory.SelectorThread-0:NIOServerCnxnFactory$SelectorThread@420] - selector thread exitted run method
[junit] 2013-10-31 21:08:54,636 [myid:] - INFO [main:ZooKeeperServer@428] - shutting down
[junit] 2013-10-31 21:08:54,637 [myid:] - INFO [main:SessionTrackerImpl@183] - Shutting down
[junit] 2013-10-31 21:08:54,637 [myid:] - INFO [main:PrepRequestProcessor@972] - Shutting down
[junit] 2013-10-31 21:08:54,637 [myid:] - INFO [main:SyncRequestProcessor@190] - Shutting down
[junit] 2013-10-31 21:08:54,637 [myid:] - INFO [ProcessThread(sid:0 cport:-1)::PrepRequestProcessor@156] - PrepRequestProcessor exited loop!
[junit] 2013-10-31 21:08:54,637 [myid:] - INFO [SyncThread:0:SyncRequestProcessor@168] - SyncRequestProcessor exited!
[junit] 2013-10-31 21:08:54,638 [myid:] - INFO [main:FinalRequestProcessor@442] - shutdown of request processor complete
[junit] 2013-10-31 21:08:54,638 [myid:] - INFO [main:FourLetterWordMain@43] - connecting to 127.0.0.1 11221
[junit] 2013-10-31 21:08:54,639 [myid:] - INFO [main:JMXEnv@133] - ensureOnly:[]
[junit] 2013-10-31 21:08:54,642 [myid:] - INFO [main:ClientBase@476] - fdcount after test is: 49 at start it was 37
[junit] 2013-10-31 21:08:54,642 [myid:] - INFO [main:ClientBase@478] - sleeping for 20 secs
[junit] 2013-10-31 21:08:54,644 [myid:] - INFO [main:ZKTestCase$1@61] - SUCCEEDED testQuota
[junit] 2013-10-31 21:08:54,644 [myid:] - INFO [main:ZKTestCase$1@56] - FINISHED testQuota
[junit] Tests run: 1, Failures: 0, Errors: 0, Time elapsed: 0.805 sec
BUILD FAILED
/home/jenkins/jenkins-slave/workspace/ZooKeeper-trunk-openjdk7/trunk/build.xml:1264: Tests failed!
Total time: 49 minutes 26 seconds
Build step 'Execute shell' marked build as failure
[locks-and-latches] Releasing all the locks
[locks-and-latches] All the locks released
Recording test results
Email was triggered for: Failure
Sending email for trigger: Failure
###################################################################################
############################## FAILED TESTS (if any) ##############################
4 tests failed.
REGRESSION: org.apache.zookeeper.test.GetProposalFromTxnTest.testGetProposalFromTxn
Error Message:
KeeperErrorCode = ConnectionLoss for /invalidsnap-0
Stack Trace:
org.apache.zookeeper.KeeperException$ConnectionLossException: KeeperErrorCode = ConnectionLoss for /invalidsnap-0
at org.apache.zookeeper.KeeperException.create(KeeperException.java:99)
at org.apache.zookeeper.KeeperException.create(KeeperException.java:51)
at org.apache.zookeeper.ZooKeeper.create(ZooKeeper.java:876)
at org.apache.zookeeper.test.GetProposalFromTxnTest.testGetProposalFromTxn(GetProposalFromTxnTest.java:85)
at org.apache.zookeeper.JUnit4ZKTestRunner$LoggedInvokeMethod.evaluate(JUnit4ZKTestRunner.java:52)
REGRESSION: org.apache.zookeeper.test.LoadFromLogTest.testLoadFailure
Error Message:
KeeperErrorCode = ConnectionLoss for /data-
Stack Trace:
org.apache.zookeeper.KeeperException$ConnectionLossException: KeeperErrorCode = ConnectionLoss for /data-
at org.apache.zookeeper.KeeperException.create(KeeperException.java:99)
at org.apache.zookeeper.KeeperException.create(KeeperException.java:51)
at org.apache.zookeeper.ZooKeeper.create(ZooKeeper.java:876)
at org.apache.zookeeper.test.LoadFromLogTest.testLoadFailure(LoadFromLogTest.java:154)
at org.apache.zookeeper.JUnit4ZKTestRunner$LoggedInvokeMethod.evaluate(JUnit4ZKTestRunner.java:52)
REGRESSION: org.apache.zookeeper.test.QuorumZxidSyncTest.testLateLogs
Error Message:
KeeperErrorCode = ConnectionLoss for /1
Stack Trace:
org.apache.zookeeper.KeeperException$ConnectionLossException: KeeperErrorCode = ConnectionLoss for /1
at org.apache.zookeeper.KeeperException.create(KeeperException.java:99)
at org.apache.zookeeper.KeeperException.create(KeeperException.java:51)
at org.apache.zookeeper.ZooKeeper.create(ZooKeeper.java:876)
at org.apache.zookeeper.test.QuorumZxidSyncTest.testLateLogs(QuorumZxidSyncTest.java:124)
at org.apache.zookeeper.JUnit4ZKTestRunner$LoggedInvokeMethod.evaluate(JUnit4ZKTestRunner.java:52)
REGRESSION: org.apache.zookeeper.test.ReadOnlyModeTest.testSeekForRwServer
Error Message:
KeeperErrorCode = Not a read-only call for /test
Stack Trace:
org.apache.zookeeper.KeeperException$NotReadOnlyException: KeeperErrorCode = Not a read-only call for /test
at org.apache.zookeeper.KeeperException.create(KeeperException.java:137)
at org.apache.zookeeper.KeeperException.create(KeeperException.java:51)
at org.apache.zookeeper.ZooKeeper.create(ZooKeeper.java:876)
at org.apache.zookeeper.test.ReadOnlyModeTest.testSeekForRwServer(ReadOnlyModeTest.java:280)
at org.apache.zookeeper.JUnit4ZKTestRunner$LoggedInvokeMethod.evaluate(JUnit4ZKTestRunner.java:52)