You are viewing a plain text version of this content. The canonical link for it is here.
Posted to builds@lucene.apache.org by Apache Jenkins Server <je...@builds.apache.org> on 2025/06/21 01:01:16 UTC

[JENKINS] Lucene » Lucene-Check-main - Build # 13247 - Still Failing!

Build: https://ci-builds.apache.org/job/Lucene/job/Lucene-Check-main/13247/

All tests passed

Build Log:
[...truncated 1545 lines...]
BUILD FAILED in 19m 12s
900 actionable tasks: 860 executed, 40 up-to-date
Build step 'Invoke Gradle script' changed build result to FAILURE
Build step 'Invoke Gradle script' marked build as failure
Archiving artifacts
Recording test results
[Checks API] No suitable checks publisher found.
Email was triggered for: Failure - Any
Sending email for trigger: Failure - Any

[JENKINS] Lucene » Lucene-Check-main - Build # 13248 - Still Failing!

Posted by Apache Jenkins Server <je...@builds.apache.org>.
Build: https://ci-builds.apache.org/job/Lucene/job/Lucene-Check-main/13248/

All tests passed

Build Log:
[...truncated 1545 lines...]
BUILD FAILED in 19m 13s
900 actionable tasks: 860 executed, 40 up-to-date
Build step 'Invoke Gradle script' changed build result to FAILURE
Build step 'Invoke Gradle script' marked build as failure
Archiving artifacts
Recording test results
[Checks API] No suitable checks publisher found.
Email was triggered for: Failure - Any
Sending email for trigger: Failure - Any