You are viewing a plain text version of this content. The canonical link for it is here.
Posted to builds@lucene.apache.org by Apache Jenkins Server <je...@builds.apache.org> on 2021/07/27 11:49:01 UTC
[JENKINS] Lucene » Lucene-Solr-Tests-8.x - Build # 2881 - Unstable!
Build: https://ci-builds.apache.org/job/Lucene/job/Lucene-Solr-Tests-8.x/2881/
1 tests failed.
FAILED: org.apache.solr.cloud.TestCloudSearcherWarming.testPeersyncFailureReplicationSuccess
Error Message:
No registered leader was found after waiting for 1000ms , collection: testPeersyncFailureReplicationSuccess slice: shard1 saw state=DocCollection(testPeersyncFailureReplicationSuccess//collections/testPeersyncFailureReplicationSuccess/state.json/10 )={ "pullReplicas":"0", "replicationFactor":"1", "shards":{"shard1":{ "range":"80000000-7fffffff", "state":"active", "replicas":{ "core_node2":{ "core":"testPeersyncFailureReplicationSuccess_shard1_replica_n1", "node_name":"127.0.0.1:37177_solr", "base_url":"https://127.0.0.1:37177/solr", "state":"down", "type":"NRT", "force_set_state":"false"}, "core_node4":{ "core":"testPeersyncFailureReplicationSuccess_shard1_replica_n3", "node_name":"127.0.0.1:33169_solr", "base_url":"https://127.0.0.1:33169/solr", "state":"active", "type":"NRT", "force_set_state":"false"}}}}, "router":{"name":"compositeId"}, "maxShardsPerNode":"2", "autoAddReplicas":"false", "nrtReplicas":"1", "tlogReplicas":"0"} with live_nodes=[127.0.0.1:33169_solr]
Stack Trace:
org.apache.solr.common.SolrException: No registered leader was found after waiting for 1000ms , collection: testPeersyncFailureReplicationSuccess slice: shard1 saw state=DocCollection(testPeersyncFailureReplicationSuccess//collections/testPeersyncFailureReplicationSuccess/state.json/10 )={
"pullReplicas":"0",
"replicationFactor":"1",
"shards":{"shard1":{
"range":"80000000-7fffffff",
"state":"active",
"replicas":{
"core_node2":{
"core":"testPeersyncFailureReplicationSuccess_shard1_replica_n1",
"node_name":"127.0.0.1:37177_solr",
"base_url":"https://127.0.0.1:37177/solr",
"state":"down",
"type":"NRT",
"force_set_state":"false"},
"core_node4":{
"core":"testPeersyncFailureReplicationSuccess_shard1_replica_n3",
"node_name":"127.0.0.1:33169_solr",
"base_url":"https://127.0.0.1:33169/solr",
"state":"active",
"type":"NRT",
"force_set_state":"false"}}}},
"router":{"name":"compositeId"},
"maxShardsPerNode":"2",
"autoAddReplicas":"false",
"nrtReplicas":"1",
"tlogReplicas":"0"} with live_nodes=[127.0.0.1:33169_solr]
at __randomizedtesting.SeedInfo.seed([6F8C1F8AD10722DA:BBDD7CC500B915B9]:0)
at org.apache.solr.common.cloud.ZkStateReader.getLeaderRetry(ZkStateReader.java:993)
at org.apache.solr.common.cloud.ZkStateReader.getLeaderRetry(ZkStateReader.java:968)
at org.apache.solr.cloud.TestCloudSearcherWarming.testPeersyncFailureReplicationSuccess(TestCloudSearcherWarming.java:205)
at sun.reflect.NativeMethodAccessorImpl.invoke0(Native Method)
at sun.reflect.NativeMethodAccessorImpl.invoke(NativeMethodAccessorImpl.java:62)
at sun.reflect.DelegatingMethodAccessorImpl.invoke(DelegatingMethodAccessorImpl.java:43)
at java.lang.reflect.Method.invoke(Method.java:498)
at com.carrotsearch.randomizedtesting.RandomizedRunner.invoke(RandomizedRunner.java:1750)
at com.carrotsearch.randomizedtesting.RandomizedRunner$8.evaluate(RandomizedRunner.java:938)
at com.carrotsearch.randomizedtesting.RandomizedRunner$9.evaluate(RandomizedRunner.java:974)
at com.carrotsearch.randomizedtesting.RandomizedRunner$10.evaluate(RandomizedRunner.java:988)
at com.carrotsearch.randomizedtesting.rules.SystemPropertiesRestoreRule$1.evaluate(SystemPropertiesRestoreRule.java:57)
at org.junit.rules.RunRules.evaluate(RunRules.java:20)
at org.apache.lucene.util.TestRuleSetupTeardownChained$1.evaluate(TestRuleSetupTeardownChained.java:49)
at org.apache.lucene.util.AbstractBeforeAfterRule$1.evaluate(AbstractBeforeAfterRule.java:45)
at org.apache.lucene.util.TestRuleThreadAndTestName$1.evaluate(TestRuleThreadAndTestName.java:48)
at org.apache.lucene.util.TestRuleIgnoreAfterMaxFailures$1.evaluate(TestRuleIgnoreAfterMaxFailures.java:64)
at org.apache.lucene.util.TestRuleMarkFailure$1.evaluate(TestRuleMarkFailure.java:47)
at org.junit.rules.RunRules.evaluate(RunRules.java:20)
at com.carrotsearch.randomizedtesting.rules.StatementAdapter.evaluate(StatementAdapter.java:36)
at com.carrotsearch.randomizedtesting.ThreadLeakControl$StatementRunner.run(ThreadLeakControl.java:368)
at com.carrotsearch.randomizedtesting.ThreadLeakControl.forkTimeoutingTask(ThreadLeakControl.java:817)
at com.carrotsearch.randomizedtesting.ThreadLeakControl$3.evaluate(ThreadLeakControl.java:468)
at com.carrotsearch.randomizedtesting.RandomizedRunner.runSingleTest(RandomizedRunner.java:947)
at com.carrotsearch.randomizedtesting.RandomizedRunner$5.evaluate(RandomizedRunner.java:832)
at com.carrotsearch.randomizedtesting.RandomizedRunner$6.evaluate(RandomizedRunner.java:883)
at com.carrotsearch.randomizedtesting.RandomizedRunner$7.evaluate(RandomizedRunner.java:894)
at com.carrotsearch.randomizedtesting.rules.StatementAdapter.evaluate(StatementAdapter.java:36)
at com.carrotsearch.randomizedtesting.rules.SystemPropertiesRestoreRule$1.evaluate(SystemPropertiesRestoreRule.java:57)
at org.junit.rules.RunRules.evaluate(RunRules.java:20)
at org.apache.lucene.util.AbstractBeforeAfterRule$1.evaluate(AbstractBeforeAfterRule.java:45)
at com.carrotsearch.randomizedtesting.rules.StatementAdapter.evaluate(StatementAdapter.java:36)
at org.apache.lucene.util.TestRuleStoreClassName$1.evaluate(TestRuleStoreClassName.java:41)
at com.carrotsearch.randomizedtesting.rules.NoShadowingOrOverridesOnMethodsRule$1.evaluate(NoShadowingOrOverridesOnMethodsRule.java:40)
at com.carrotsearch.randomizedtesting.rules.NoShadowingOrOverridesOnMethodsRule$1.evaluate(NoShadowingOrOverridesOnMethodsRule.java:40)
at com.carrotsearch.randomizedtesting.rules.StatementAdapter.evaluate(StatementAdapter.java:36)
at com.carrotsearch.randomizedtesting.rules.StatementAdapter.evaluate(StatementAdapter.java:36)
at com.carrotsearch.randomizedtesting.rules.StatementAdapter.evaluate(StatementAdapter.java:36)
at org.apache.lucene.util.TestRuleAssertionsRequired$1.evaluate(TestRuleAssertionsRequired.java:53)
at org.apache.lucene.util.TestRuleMarkFailure$1.evaluate(TestRuleMarkFailure.java:47)
at org.apache.lucene.util.TestRuleIgnoreAfterMaxFailures$1.evaluate(TestRuleIgnoreAfterMaxFailures.java:64)
at org.apache.lucene.util.TestRuleIgnoreTestSuites$1.evaluate(TestRuleIgnoreTestSuites.java:54)
at org.junit.rules.RunRules.evaluate(RunRules.java:20)
at com.carrotsearch.randomizedtesting.rules.StatementAdapter.evaluate(StatementAdapter.java:36)
at com.carrotsearch.randomizedtesting.ThreadLeakControl$StatementRunner.run(ThreadLeakControl.java:368)
at java.lang.Thread.run(Thread.java:748)
Build Log:
[...truncated 15119 lines...]
[junit4] Suite: org.apache.solr.cloud.TestCloudSearcherWarming
[junit4] 2> 1471608 INFO (SUITE-TestCloudSearcherWarming-seed#[6F8C1F8AD10722DA]-worker) [ ] o.a.s.SolrTestCase Setting 'solr.default.confdir' system property to test-framework derived value of '/home/jenkins/jenkins-slave/workspace/Lucene/Lucene-Solr-Tests-8.x/solr/server/solr/configsets/_default/conf'
[junit4] 2> 1471609 INFO (SUITE-TestCloudSearcherWarming-seed#[6F8C1F8AD10722DA]-worker) [ ] o.a.s.SolrTestCaseJ4 Created dataDir: /home/jenkins/jenkins-slave/workspace/Lucene/Lucene-Solr-Tests-8.x/solr/build/solr-core/test/J0/temp/solr.cloud.TestCloudSearcherWarming_6F8C1F8AD10722DA-001/data-dir-140-001
[junit4] 2> 1471610 WARN (SUITE-TestCloudSearcherWarming-seed#[6F8C1F8AD10722DA]-worker) [ ] o.a.s.SolrTestCaseJ4 startTrackingSearchers: numOpens=16 numCloses=16
[junit4] 2> 1471610 INFO (SUITE-TestCloudSearcherWarming-seed#[6F8C1F8AD10722DA]-worker) [ ] o.a.s.SolrTestCaseJ4 Using PointFields (NUMERIC_POINTS_SYSPROP=true) w/NUMERIC_DOCVALUES_SYSPROP=true
[junit4] 2> 1471611 INFO (SUITE-TestCloudSearcherWarming-seed#[6F8C1F8AD10722DA]-worker) [ ] o.a.s.SolrTestCaseJ4 Randomized ssl (true) and clientAuth (false) via: @org.apache.solr.util.RandomizeSSL(reason=, ssl=NaN, value=NaN, clientAuth=NaN)
[junit4] 2> 1471612 INFO (SUITE-TestCloudSearcherWarming-seed#[6F8C1F8AD10722DA]-worker) [ ] o.a.s.SolrTestCaseJ4 SecureRandom sanity checks: test.solr.allowed.securerandom=null & java.security.egd=file:/dev/./urandom
[junit4] 2> 1471612 INFO (SUITE-TestCloudSearcherWarming-seed#[6F8C1F8AD10722DA]-worker) [ ] o.a.s.c.SolrCloudTestCase Using per-replica state
[junit4] 2> 1471614 INFO (TEST-TestCloudSearcherWarming.testPeersyncFailureReplicationSuccess-seed#[6F8C1F8AD10722DA]) [ ] o.a.s.SolrTestCaseJ4 ###Starting testPeersyncFailureReplicationSuccess
[junit4] 2> 1471614 INFO (TEST-TestCloudSearcherWarming.testPeersyncFailureReplicationSuccess-seed#[6F8C1F8AD10722DA]) [ ] o.a.s.c.MiniSolrCloudCluster Starting cluster of 1 servers in /home/jenkins/jenkins-slave/workspace/Lucene/Lucene-Solr-Tests-8.x/solr/build/solr-core/test/J0/temp/solr.cloud.TestCloudSearcherWarming_6F8C1F8AD10722DA-001/tempDir-001
[junit4] 2> 1471615 INFO (TEST-TestCloudSearcherWarming.testPeersyncFailureReplicationSuccess-seed#[6F8C1F8AD10722DA]) [ ] o.a.s.c.ZkTestServer STARTING ZK TEST SERVER
[junit4] 2> 1471615 INFO (ZkTestServer Run Thread) [ ] o.a.s.c.ZkTestServer client port: 0.0.0.0/0.0.0.0:0
[junit4] 2> 1471615 INFO (ZkTestServer Run Thread) [ ] o.a.s.c.ZkTestServer Starting server
[junit4] 2> 1471616 WARN (ZkTestServer Run Thread) [ ] o.a.z.s.ServerCnxnFactory maxCnxns is not configured, using default value 0.
[junit4] 2> 1471715 INFO (TEST-TestCloudSearcherWarming.testPeersyncFailureReplicationSuccess-seed#[6F8C1F8AD10722DA]) [ ] o.a.s.c.ZkTestServer start zk server on port: 41643
[junit4] 2> 1471715 INFO (TEST-TestCloudSearcherWarming.testPeersyncFailureReplicationSuccess-seed#[6F8C1F8AD10722DA]) [ ] o.a.s.c.ZkTestServer waitForServerUp: 127.0.0.1:41643
[junit4] 2> 1471715 INFO (TEST-TestCloudSearcherWarming.testPeersyncFailureReplicationSuccess-seed#[6F8C1F8AD10722DA]) [ ] o.a.s.c.ZkTestServer parse host and port list: 127.0.0.1:41643
[junit4] 2> 1471715 INFO (TEST-TestCloudSearcherWarming.testPeersyncFailureReplicationSuccess-seed#[6F8C1F8AD10722DA]) [ ] o.a.s.c.ZkTestServer connecting to 127.0.0.1 41643
[junit4] 2> 1471719 INFO (TEST-TestCloudSearcherWarming.testPeersyncFailureReplicationSuccess-seed#[6F8C1F8AD10722DA]) [ ] o.a.s.c.c.ConnectionManager Waiting for client to connect to ZooKeeper
[junit4] 2> 1471722 INFO (zkConnectionManagerCallback-12794-thread-1) [ ] o.a.s.c.c.ConnectionManager zkClient has connected
[junit4] 2> 1471722 INFO (TEST-TestCloudSearcherWarming.testPeersyncFailureReplicationSuccess-seed#[6F8C1F8AD10722DA]) [ ] o.a.s.c.c.ConnectionManager Client is connected to ZooKeeper
[junit4] 2> 1471728 INFO (TEST-TestCloudSearcherWarming.testPeersyncFailureReplicationSuccess-seed#[6F8C1F8AD10722DA]) [ ] o.a.s.c.c.ConnectionManager Waiting for client to connect to ZooKeeper
[junit4] 2> 1471733 INFO (zkConnectionManagerCallback-12796-thread-1) [ ] o.a.s.c.c.ConnectionManager zkClient has connected
[junit4] 2> 1471733 INFO (TEST-TestCloudSearcherWarming.testPeersyncFailureReplicationSuccess-seed#[6F8C1F8AD10722DA]) [ ] o.a.s.c.c.ConnectionManager Client is connected to ZooKeeper
[junit4] 2> 1471735 INFO (TEST-TestCloudSearcherWarming.testPeersyncFailureReplicationSuccess-seed#[6F8C1F8AD10722DA]) [ ] o.a.s.c.c.ConnectionManager Waiting for client to connect to ZooKeeper
[junit4] 2> 1471736 INFO (zkConnectionManagerCallback-12798-thread-1) [ ] o.a.s.c.c.ConnectionManager zkClient has connected
[junit4] 2> 1471736 INFO (TEST-TestCloudSearcherWarming.testPeersyncFailureReplicationSuccess-seed#[6F8C1F8AD10722DA]) [ ] o.a.s.c.c.ConnectionManager Client is connected to ZooKeeper
[junit4] 2> 1471738 WARN (TEST-TestCloudSearcherWarming.testPeersyncFailureReplicationSuccess-seed#[6F8C1F8AD10722DA]-SendThread(127.0.0.1:41643)) [ ] o.a.z.ClientCnxn An exception was thrown while closing send thread for session 0x1004130dd900002.
[junit4] 2> => EndOfStreamException: Unable to read additional data from server sessionid 0x1004130dd900002, likely server has closed socket
[junit4] 2> at org.apache.zookeeper.ClientCnxnSocketNIO.doIO(ClientCnxnSocketNIO.java:77)
[junit4] 2> org.apache.zookeeper.ClientCnxn$EndOfStreamException: Unable to read additional data from server sessionid 0x1004130dd900002, likely server has closed socket
[junit4] 2> at org.apache.zookeeper.ClientCnxnSocketNIO.doIO(ClientCnxnSocketNIO.java:77) ~[zookeeper-3.6.2.jar:3.6.2]
[junit4] 2> at org.apache.zookeeper.ClientCnxnSocketNIO.doTransport(ClientCnxnSocketNIO.java:350) ~[zookeeper-3.6.2.jar:3.6.2]
[junit4] 2> at org.apache.zookeeper.ClientCnxn$SendThread.run(ClientCnxn.java:1275) [zookeeper-3.6.2.jar:3.6.2]
[junit4] 2> 1471840 INFO (jetty-launcher-12799-thread-1) [ ] o.a.s.c.s.e.JettySolrRunner Start Jetty (configured port=0, binding port=0)
[junit4] 2> 1471840 INFO (jetty-launcher-12799-thread-1) [ ] o.a.s.c.s.e.JettySolrRunner Trying to start Jetty on port 0 try number 2 ...
[junit4] 2> 1471840 INFO (jetty-launcher-12799-thread-1) [ ] o.e.j.s.Server jetty-9.4.41.v20210516; built: 2021-05-16T23:56:28.993Z; git: 98607f93c7833e7dc59489b13f3cb0a114fb9f4c; jvm 1.8.0_291-b10
[junit4] 2> 1471841 INFO (jetty-launcher-12799-thread-1) [ ] o.e.j.s.session DefaultSessionIdManager workerName=node0
[junit4] 2> 1471841 INFO (jetty-launcher-12799-thread-1) [ ] o.e.j.s.session No SessionScavenger set, using defaults
[junit4] 2> 1471841 INFO (jetty-launcher-12799-thread-1) [ ] o.e.j.s.session node0 Scavenging every 600000ms
[junit4] 2> 1471841 INFO (jetty-launcher-12799-thread-1) [ ] o.e.j.s.h.ContextHandler Started o.e.j.s.ServletContextHandler@28e54cb2{/solr,null,AVAILABLE}
[junit4] 2> 1471842 INFO (jetty-launcher-12799-thread-1) [ ] o.e.j.s.AbstractConnector Started ServerConnector@14af0d2c{SSL, (ssl, http/1.1)}{127.0.0.1:37177}
[junit4] 2> 1471842 INFO (jetty-launcher-12799-thread-1) [ ] o.e.j.s.Server Started @1471882ms
[junit4] 2> 1471842 INFO (jetty-launcher-12799-thread-1) [ ] o.a.s.c.s.e.JettySolrRunner Jetty properties: {hostContext=/solr, zkHost=127.0.0.1:41643/solr, hostPort=37177}
[junit4] 2> 1471842 ERROR (jetty-launcher-12799-thread-1) [ ] o.a.s.u.StartupLoggingUtils Missing Java Option solr.log.dir. Logging may be missing or incomplete.
[junit4] 2> 1471842 INFO (jetty-launcher-12799-thread-1) [ ] o.a.s.s.SolrDispatchFilter Using logger factory org.apache.logging.slf4j.Log4jLoggerFactory
[junit4] 2> 1471842 INFO (jetty-launcher-12799-thread-1) [ ] o.a.s.s.SolrDispatchFilter ___ _ Welcome to Apache Solr? version 8.10.0
[junit4] 2> 1471842 INFO (jetty-launcher-12799-thread-1) [ ] o.a.s.s.SolrDispatchFilter / __| ___| |_ _ Starting in cloud mode on port null
[junit4] 2> 1471842 INFO (jetty-launcher-12799-thread-1) [ ] o.a.s.s.SolrDispatchFilter \__ \/ _ \ | '_| Install dir: /home/jenkins/jenkins-slave/workspace/Lucene/Lucene-Solr-Tests-8.x/solr
[junit4] 2> 1471842 INFO (jetty-launcher-12799-thread-1) [ ] o.a.s.s.SolrDispatchFilter |___/\___/_|_| Start time: 2021-07-27T11:12:29.280Z
[junit4] 2> 1471843 INFO (jetty-launcher-12799-thread-1) [ ] o.a.s.c.c.ConnectionManager Waiting for client to connect to ZooKeeper
[junit4] 2> 1471844 INFO (zkConnectionManagerCallback-12801-thread-1) [ ] o.a.s.c.c.ConnectionManager zkClient has connected
[junit4] 2> 1471844 INFO (jetty-launcher-12799-thread-1) [ ] o.a.s.c.c.ConnectionManager Client is connected to ZooKeeper
[junit4] 2> 1471844 INFO (jetty-launcher-12799-thread-1) [ ] o.a.s.s.SolrDispatchFilter solr.xml found in ZooKeeper. Loading...
[junit4] 2> 1471848 INFO (jetty-launcher-12799-thread-1) [ ] o.a.s.c.SolrXmlConfig Metrics collection is disabled.
[junit4] 2> 1472989 INFO (jetty-launcher-12799-thread-1) [ ] o.a.s.h.c.HttpShardHandlerFactory Host whitelist initialized: WhitelistHostChecker [whitelistHosts=null, whitelistHostCheckingEnabled=true]
[junit4] 2> 1472990 WARN (jetty-launcher-12799-thread-1) [ ] o.a.s.c.s.i.Http2SolrClient Create Http2SolrClient with HTTP/1.1 transport since Java 8 or lower versions does not support SSL + HTTP/2
[junit4] 2> 1472990 WARN (jetty-launcher-12799-thread-1) [ ] o.e.j.u.s.S.config Trusting all certificates configured for Client@3e504624[provider=null,keyStore=null,trustStore=null]
[junit4] 2> 1472991 WARN (jetty-launcher-12799-thread-1) [ ] o.e.j.u.s.S.config No Client EndPointIdentificationAlgorithm configured for Client@3e504624[provider=null,keyStore=null,trustStore=null]
[junit4] 2> 1472992 WARN (jetty-launcher-12799-thread-1) [ ] o.a.s.c.s.i.Http2SolrClient Create Http2SolrClient with HTTP/1.1 transport since Java 8 or lower versions does not support SSL + HTTP/2
[junit4] 2> 1472993 WARN (jetty-launcher-12799-thread-1) [ ] o.e.j.u.s.S.config Trusting all certificates configured for Client@c6b6cfd[provider=null,keyStore=null,trustStore=null]
[junit4] 2> 1472993 WARN (jetty-launcher-12799-thread-1) [ ] o.e.j.u.s.S.config No Client EndPointIdentificationAlgorithm configured for Client@c6b6cfd[provider=null,keyStore=null,trustStore=null]
[junit4] 2> 1472994 INFO (jetty-launcher-12799-thread-1) [ ] o.a.s.c.ZkContainer Zookeeper client=127.0.0.1:41643/solr
[junit4] 2> 1472994 INFO (jetty-launcher-12799-thread-1) [ ] o.a.s.c.c.ConnectionManager Waiting for client to connect to ZooKeeper
[junit4] 2> 1472995 INFO (zkConnectionManagerCallback-12812-thread-1) [ ] o.a.s.c.c.ConnectionManager zkClient has connected
[junit4] 2> 1472995 INFO (jetty-launcher-12799-thread-1) [ ] o.a.s.c.c.ConnectionManager Client is connected to ZooKeeper
[junit4] 2> 1473097 INFO (jetty-launcher-12799-thread-1) [n:127.0.0.1:37177_solr ] o.a.s.c.c.ConnectionManager Waiting for client to connect to ZooKeeper
[junit4] 2> 1473098 INFO (zkConnectionManagerCallback-12814-thread-1) [ ] o.a.s.c.c.ConnectionManager zkClient has connected
[junit4] 2> 1473098 INFO (jetty-launcher-12799-thread-1) [n:127.0.0.1:37177_solr ] o.a.s.c.c.ConnectionManager Client is connected to ZooKeeper
[junit4] 2> 1473151 WARN (jetty-launcher-12799-thread-1) [n:127.0.0.1:37177_solr ] o.a.s.c.ZkController Contents of zookeeper /security.json are world-readable; consider setting up ACLs as described in https://solr.apache.org/guide/zookeeper-access-control.html
[junit4] 2> 1473155 INFO (jetty-launcher-12799-thread-1) [n:127.0.0.1:37177_solr ] o.a.s.c.OverseerElectionContext I am going to be the leader 127.0.0.1:37177_solr
[junit4] 2> 1473156 INFO (jetty-launcher-12799-thread-1) [n:127.0.0.1:37177_solr ] o.a.s.c.Overseer Overseer (id=72129272169365509-127.0.0.1:37177_solr-n_0000000000) starting
[junit4] 2> 1473160 INFO (OverseerStateUpdate-72129272169365509-127.0.0.1:37177_solr-n_0000000000) [n:127.0.0.1:37177_solr ] o.a.s.c.Overseer Starting to work on the main queue : 127.0.0.1:37177_solr
[junit4] 2> 1473160 INFO (jetty-launcher-12799-thread-1) [n:127.0.0.1:37177_solr ] o.a.s.c.ZkController Register node as live in ZooKeeper:/live_nodes/127.0.0.1:37177_solr
[junit4] 2> 1473161 INFO (OverseerStateUpdate-72129272169365509-127.0.0.1:37177_solr-n_0000000000) [n:127.0.0.1:37177_solr ] o.a.s.c.c.ZkStateReader Updated live nodes from ZooKeeper... (0) -> (1)
[junit4] 2> 1473162 INFO (jetty-launcher-12799-thread-1) [n:127.0.0.1:37177_solr ] o.a.s.p.PackageLoader /packages.json updated to version -1
[junit4] 2> 1473163 WARN (jetty-launcher-12799-thread-1) [n:127.0.0.1:37177_solr ] o.a.s.c.CoreContainer Not all security plugins configured! authentication=disabled authorization=disabled. Solr is only as secure as you make it. Consider configuring authentication/authorization before exposing Solr to users internal or external. See https://s.apache.org/solrsecurity for more info
[junit4] 2> 1473176 INFO (jetty-launcher-12799-thread-1) [n:127.0.0.1:37177_solr ] o.a.s.c.CorePropertiesLocator Found 0 core definitions underneath /home/jenkins/jenkins-slave/workspace/Lucene/Lucene-Solr-Tests-8.x/solr/build/solr-core/test/J0/temp/solr.cloud.TestCloudSearcherWarming_6F8C1F8AD10722DA-001/tempDir-001/node1
[junit4] 2> 1473195 INFO (TEST-TestCloudSearcherWarming.testPeersyncFailureReplicationSuccess-seed#[6F8C1F8AD10722DA]) [ ] o.a.s.c.MiniSolrCloudCluster waitForAllNodes: numServers=1
[junit4] 2> 1473196 INFO (TEST-TestCloudSearcherWarming.testPeersyncFailureReplicationSuccess-seed#[6F8C1F8AD10722DA]) [ ] o.a.s.c.c.ConnectionManager Waiting for client to connect to ZooKeeper
[junit4] 2> 1473197 INFO (zkConnectionManagerCallback-12829-thread-1) [ ] o.a.s.c.c.ConnectionManager zkClient has connected
[junit4] 2> 1473197 INFO (TEST-TestCloudSearcherWarming.testPeersyncFailureReplicationSuccess-seed#[6F8C1F8AD10722DA]) [ ] o.a.s.c.c.ConnectionManager Client is connected to ZooKeeper
[junit4] 2> 1473198 INFO (TEST-TestCloudSearcherWarming.testPeersyncFailureReplicationSuccess-seed#[6F8C1F8AD10722DA]) [ ] o.a.s.c.c.ZkStateReader Updated live nodes from ZooKeeper... (0) -> (1)
[junit4] 2> 1473199 INFO (TEST-TestCloudSearcherWarming.testPeersyncFailureReplicationSuccess-seed#[6F8C1F8AD10722DA]) [ ] o.a.s.c.s.i.ZkClientClusterStateProvider Cluster at 127.0.0.1:41643/solr ready
[junit4] 2> 1473231 INFO (OverseerThreadFactory-12821-thread-1-processing-n:127.0.0.1:37177_solr) [n:127.0.0.1:37177_solr ] o.a.s.c.a.c.CreateCollectionCmd Create collection testPeersyncFailureReplicationSuccess
[junit4] 2> 1473231 INFO (OverseerThreadFactory-12821-thread-1-processing-n:127.0.0.1:37177_solr) [n:127.0.0.1:37177_solr ] o.a.s.c.c.ZkConfigManager Copying zk node /configs/_default to /configs/testPeersyncFailureReplicationSuccess.AUTOCREATED
[junit4] 2> 1473232 INFO (OverseerThreadFactory-12821-thread-1-processing-n:127.0.0.1:37177_solr) [n:127.0.0.1:37177_solr ] o.a.s.c.c.ZkConfigManager Copying zk node /configs/_default/protwords.txt to /configs/testPeersyncFailureReplicationSuccess.AUTOCREATED/protwords.txt
[junit4] 2> 1473234 INFO (OverseerThreadFactory-12821-thread-1-processing-n:127.0.0.1:37177_solr) [n:127.0.0.1:37177_solr ] o.a.s.c.c.ZkConfigManager Copying zk node /configs/_default/managed-schema to /configs/testPeersyncFailureReplicationSuccess.AUTOCREATED/managed-schema
[junit4] 2> 1473235 INFO (OverseerThreadFactory-12821-thread-1-processing-n:127.0.0.1:37177_solr) [n:127.0.0.1:37177_solr ] o.a.s.c.c.ZkConfigManager Copying zk node /configs/_default/solrconfig.xml to /configs/testPeersyncFailureReplicationSuccess.AUTOCREATED/solrconfig.xml
[junit4] 2> 1473237 INFO (OverseerThreadFactory-12821-thread-1-processing-n:127.0.0.1:37177_solr) [n:127.0.0.1:37177_solr ] o.a.s.c.c.ZkConfigManager Copying zk node /configs/_default/lang/contractions_it.txt to /configs/testPeersyncFailureReplicationSuccess.AUTOCREATED/lang/contractions_it.txt
[junit4] 2> 1473239 INFO (OverseerThreadFactory-12821-thread-1-processing-n:127.0.0.1:37177_solr) [n:127.0.0.1:37177_solr ] o.a.s.c.c.ZkConfigManager Copying zk node /configs/_default/lang/stopwords_no.txt to /configs/testPeersyncFailureReplicationSuccess.AUTOCREATED/lang/stopwords_no.txt
[junit4] 2> 1473240 INFO (OverseerThreadFactory-12821-thread-1-processing-n:127.0.0.1:37177_solr) [n:127.0.0.1:37177_solr ] o.a.s.c.c.ZkConfigManager Copying zk node /configs/_default/lang/contractions_ca.txt to /configs/testPeersyncFailureReplicationSuccess.AUTOCREATED/lang/contractions_ca.txt
[junit4] 2> 1473241 INFO (OverseerThreadFactory-12821-thread-1-processing-n:127.0.0.1:37177_solr) [n:127.0.0.1:37177_solr ] o.a.s.c.c.ZkConfigManager Copying zk node /configs/_default/lang/stemdict_nl.txt to /configs/testPeersyncFailureReplicationSuccess.AUTOCREATED/lang/stemdict_nl.txt
[junit4] 2> 1473242 INFO (OverseerThreadFactory-12821-thread-1-processing-n:127.0.0.1:37177_solr) [n:127.0.0.1:37177_solr ] o.a.s.c.c.ZkConfigManager Copying zk node /configs/_default/lang/stopwords_hy.txt to /configs/testPeersyncFailureReplicationSuccess.AUTOCREATED/lang/stopwords_hy.txt
[junit4] 2> 1473244 INFO (OverseerThreadFactory-12821-thread-1-processing-n:127.0.0.1:37177_solr) [n:127.0.0.1:37177_solr ] o.a.s.c.c.ZkConfigManager Copying zk node /configs/_default/lang/stopwords_id.txt to /configs/testPeersyncFailureReplicationSuccess.AUTOCREATED/lang/stopwords_id.txt
[junit4] 2> 1473250 INFO (OverseerThreadFactory-12821-thread-1-processing-n:127.0.0.1:37177_solr) [n:127.0.0.1:37177_solr ] o.a.s.c.c.ZkConfigManager Copying zk node /configs/_default/lang/stopwords_et.txt to /configs/testPeersyncFailureReplicationSuccess.AUTOCREATED/lang/stopwords_et.txt
[junit4] 2> 1473251 INFO (OverseerThreadFactory-12821-thread-1-processing-n:127.0.0.1:37177_solr) [n:127.0.0.1:37177_solr ] o.a.s.c.c.ZkConfigManager Copying zk node /configs/_default/lang/stopwords_ga.txt to /configs/testPeersyncFailureReplicationSuccess.AUTOCREATED/lang/stopwords_ga.txt
[junit4] 2> 1473253 INFO (OverseerThreadFactory-12821-thread-1-processing-n:127.0.0.1:37177_solr) [n:127.0.0.1:37177_solr ] o.a.s.c.c.ZkConfigManager Copying zk node /configs/_default/lang/stopwords_da.txt to /configs/testPeersyncFailureReplicationSuccess.AUTOCREATED/lang/stopwords_da.txt
[junit4] 2> 1473254 INFO (OverseerThreadFactory-12821-thread-1-processing-n:127.0.0.1:37177_solr) [n:127.0.0.1:37177_solr ] o.a.s.c.c.ZkConfigManager Copying zk node /configs/_default/lang/stopwords_hi.txt to /configs/testPeersyncFailureReplicationSuccess.AUTOCREATED/lang/stopwords_hi.txt
[junit4] 2> 1473255 INFO (OverseerThreadFactory-12821-thread-1-processing-n:127.0.0.1:37177_solr) [n:127.0.0.1:37177_solr ] o.a.s.c.c.ZkConfigManager Copying zk node /configs/_default/lang/stopwords_ja.txt to /configs/testPeersyncFailureReplicationSuccess.AUTOCREATED/lang/stopwords_ja.txt
[junit4] 2> 1473256 INFO (OverseerThreadFactory-12821-thread-1-processing-n:127.0.0.1:37177_solr) [n:127.0.0.1:37177_solr ] o.a.s.c.c.ZkConfigManager Copying zk node /configs/_default/lang/stopwords_pt.txt to /configs/testPeersyncFailureReplicationSuccess.AUTOCREATED/lang/stopwords_pt.txt
[junit4] 2> 1473258 INFO (OverseerThreadFactory-12821-thread-1-processing-n:127.0.0.1:37177_solr) [n:127.0.0.1:37177_solr ] o.a.s.c.c.ZkConfigManager Copying zk node /configs/_default/lang/stopwords_hu.txt to /configs/testPeersyncFailureReplicationSuccess.AUTOCREATED/lang/stopwords_hu.txt
[junit4] 2> 1473259 INFO (OverseerThreadFactory-12821-thread-1-processing-n:127.0.0.1:37177_solr) [n:127.0.0.1:37177_solr ] o.a.s.c.c.ZkConfigManager Copying zk node /configs/_default/lang/stopwords_el.txt to /configs/testPeersyncFailureReplicationSuccess.AUTOCREATED/lang/stopwords_el.txt
[junit4] 2> 1473260 INFO (OverseerThreadFactory-12821-thread-1-processing-n:127.0.0.1:37177_solr) [n:127.0.0.1:37177_solr ] o.a.s.c.c.ZkConfigManager Copying zk node /configs/_default/lang/stopwords_ru.txt to /configs/testPeersyncFailureReplicationSuccess.AUTOCREATED/lang/stopwords_ru.txt
[junit4] 2> 1473262 INFO (OverseerThreadFactory-12821-thread-1-processing-n:127.0.0.1:37177_solr) [n:127.0.0.1:37177_solr ] o.a.s.c.c.ZkConfigManager Copying zk node /configs/_default/lang/stopwords_tr.txt to /configs/testPeersyncFailureReplicationSuccess.AUTOCREATED/lang/stopwords_tr.txt
[junit4] 2> 1473263 INFO (OverseerThreadFactory-12821-thread-1-processing-n:127.0.0.1:37177_solr) [n:127.0.0.1:37177_solr ] o.a.s.c.c.ZkConfigManager Copying zk node /configs/_default/lang/stopwords_ar.txt to /configs/testPeersyncFailureReplicationSuccess.AUTOCREATED/lang/stopwords_ar.txt
[junit4] 2> 1473264 INFO (OverseerThreadFactory-12821-thread-1-processing-n:127.0.0.1:37177_solr) [n:127.0.0.1:37177_solr ] o.a.s.c.c.ZkConfigManager Copying zk node /configs/_default/lang/userdict_ja.txt to /configs/testPeersyncFailureReplicationSuccess.AUTOCREATED/lang/userdict_ja.txt
[junit4] 2> 1473266 INFO (OverseerThreadFactory-12821-thread-1-processing-n:127.0.0.1:37177_solr) [n:127.0.0.1:37177_solr ] o.a.s.c.c.ZkConfigManager Copying zk node /configs/_default/lang/stopwords_it.txt to /configs/testPeersyncFailureReplicationSuccess.AUTOCREATED/lang/stopwords_it.txt
[junit4] 2> 1473267 INFO (OverseerThreadFactory-12821-thread-1-processing-n:127.0.0.1:37177_solr) [n:127.0.0.1:37177_solr ] o.a.s.c.c.ZkConfigManager Copying zk node /configs/_default/lang/stopwords_eu.txt to /configs/testPeersyncFailureReplicationSuccess.AUTOCREATED/lang/stopwords_eu.txt
[junit4] 2> 1473268 INFO (OverseerThreadFactory-12821-thread-1-processing-n:127.0.0.1:37177_solr) [n:127.0.0.1:37177_solr ] o.a.s.c.c.ZkConfigManager Copying zk node /configs/_default/lang/stopwords_cz.txt to /configs/testPeersyncFailureReplicationSuccess.AUTOCREATED/lang/stopwords_cz.txt
[junit4] 2> 1473269 INFO (OverseerThreadFactory-12821-thread-1-processing-n:127.0.0.1:37177_solr) [n:127.0.0.1:37177_solr ] o.a.s.c.c.ZkConfigManager Copying zk node /configs/_default/lang/stoptags_ja.txt to /configs/testPeersyncFailureReplicationSuccess.AUTOCREATED/lang/stoptags_ja.txt
[junit4] 2> 1473271 INFO (OverseerThreadFactory-12821-thread-1-processing-n:127.0.0.1:37177_solr) [n:127.0.0.1:37177_solr ] o.a.s.c.c.ZkConfigManager Copying zk node /configs/_default/lang/contractions_fr.txt to /configs/testPeersyncFailureReplicationSuccess.AUTOCREATED/lang/contractions_fr.txt
[junit4] 2> 1473272 INFO (OverseerThreadFactory-12821-thread-1-processing-n:127.0.0.1:37177_solr) [n:127.0.0.1:37177_solr ] o.a.s.c.c.ZkConfigManager Copying zk node /configs/_default/lang/stopwords_de.txt to /configs/testPeersyncFailureReplicationSuccess.AUTOCREATED/lang/stopwords_de.txt
[junit4] 2> 1473273 INFO (OverseerThreadFactory-12821-thread-1-processing-n:127.0.0.1:37177_solr) [n:127.0.0.1:37177_solr ] o.a.s.c.c.ZkConfigManager Copying zk node /configs/_default/lang/stopwords_fa.txt to /configs/testPeersyncFailureReplicationSuccess.AUTOCREATED/lang/stopwords_fa.txt
[junit4] 2> 1473275 INFO (OverseerThreadFactory-12821-thread-1-processing-n:127.0.0.1:37177_solr) [n:127.0.0.1:37177_solr ] o.a.s.c.c.ZkConfigManager Copying zk node /configs/_default/lang/contractions_ga.txt to /configs/testPeersyncFailureReplicationSuccess.AUTOCREATED/lang/contractions_ga.txt
[junit4] 2> 1473276 INFO (OverseerThreadFactory-12821-thread-1-processing-n:127.0.0.1:37177_solr) [n:127.0.0.1:37177_solr ] o.a.s.c.c.ZkConfigManager Copying zk node /configs/_default/lang/stopwords_ca.txt to /configs/testPeersyncFailureReplicationSuccess.AUTOCREATED/lang/stopwords_ca.txt
[junit4] 2> 1473277 INFO (OverseerThreadFactory-12821-thread-1-processing-n:127.0.0.1:37177_solr) [n:127.0.0.1:37177_solr ] o.a.s.c.c.ZkConfigManager Copying zk node /configs/_default/lang/stopwords_nl.txt to /configs/testPeersyncFailureReplicationSuccess.AUTOCREATED/lang/stopwords_nl.txt
[junit4] 2> 1473278 INFO (OverseerThreadFactory-12821-thread-1-processing-n:127.0.0.1:37177_solr) [n:127.0.0.1:37177_solr ] o.a.s.c.c.ZkConfigManager Copying zk node /configs/_default/lang/stopwords_bg.txt to /configs/testPeersyncFailureReplicationSuccess.AUTOCREATED/lang/stopwords_bg.txt
[junit4] 2> 1473279 INFO (OverseerThreadFactory-12821-thread-1-processing-n:127.0.0.1:37177_solr) [n:127.0.0.1:37177_solr ] o.a.s.c.c.ZkConfigManager Copying zk node /configs/_default/lang/stopwords_en.txt to /configs/testPeersyncFailureReplicationSuccess.AUTOCREATED/lang/stopwords_en.txt
[junit4] 2> 1473280 INFO (OverseerThreadFactory-12821-thread-1-processing-n:127.0.0.1:37177_solr) [n:127.0.0.1:37177_solr ] o.a.s.c.c.ZkConfigManager Copying zk node /configs/_default/lang/stopwords_lv.txt to /configs/testPeersyncFailureReplicationSuccess.AUTOCREATED/lang/stopwords_lv.txt
[junit4] 2> 1473282 INFO (OverseerThreadFactory-12821-thread-1-processing-n:127.0.0.1:37177_solr) [n:127.0.0.1:37177_solr ] o.a.s.c.c.ZkConfigManager Copying zk node /configs/_default/lang/stopwords_es.txt to /configs/testPeersyncFailureReplicationSuccess.AUTOCREATED/lang/stopwords_es.txt
[junit4] 2> 1473283 INFO (OverseerThreadFactory-12821-thread-1-processing-n:127.0.0.1:37177_solr) [n:127.0.0.1:37177_solr ] o.a.s.c.c.ZkConfigManager Copying zk node /configs/_default/lang/stopwords_th.txt to /configs/testPeersyncFailureReplicationSuccess.AUTOCREATED/lang/stopwords_th.txt
[junit4] 2> 1473285 INFO (OverseerThreadFactory-12821-thread-1-processing-n:127.0.0.1:37177_solr) [n:127.0.0.1:37177_solr ] o.a.s.c.c.ZkConfigManager Copying zk node /configs/_default/lang/stopwords_ro.txt to /configs/testPeersyncFailureReplicationSuccess.AUTOCREATED/lang/stopwords_ro.txt
[junit4] 2> 1473286 INFO (OverseerThreadFactory-12821-thread-1-processing-n:127.0.0.1:37177_solr) [n:127.0.0.1:37177_solr ] o.a.s.c.c.ZkConfigManager Copying zk node /configs/_default/lang/stopwords_fr.txt to /configs/testPeersyncFailureReplicationSuccess.AUTOCREATED/lang/stopwords_fr.txt
[junit4] 2> 1473287 INFO (OverseerThreadFactory-12821-thread-1-processing-n:127.0.0.1:37177_solr) [n:127.0.0.1:37177_solr ] o.a.s.c.c.ZkConfigManager Copying zk node /configs/_default/lang/stopwords_sv.txt to /configs/testPeersyncFailureReplicationSuccess.AUTOCREATED/lang/stopwords_sv.txt
[junit4] 2> 1473288 INFO (OverseerThreadFactory-12821-thread-1-processing-n:127.0.0.1:37177_solr) [n:127.0.0.1:37177_solr ] o.a.s.c.c.ZkConfigManager Copying zk node /configs/_default/lang/stopwords_fi.txt to /configs/testPeersyncFailureReplicationSuccess.AUTOCREATED/lang/stopwords_fi.txt
[junit4] 2> 1473290 INFO (OverseerThreadFactory-12821-thread-1-processing-n:127.0.0.1:37177_solr) [n:127.0.0.1:37177_solr ] o.a.s.c.c.ZkConfigManager Copying zk node /configs/_default/lang/hyphenations_ga.txt to /configs/testPeersyncFailureReplicationSuccess.AUTOCREATED/lang/hyphenations_ga.txt
[junit4] 2> 1473291 INFO (OverseerThreadFactory-12821-thread-1-processing-n:127.0.0.1:37177_solr) [n:127.0.0.1:37177_solr ] o.a.s.c.c.ZkConfigManager Copying zk node /configs/_default/lang/stopwords_gl.txt to /configs/testPeersyncFailureReplicationSuccess.AUTOCREATED/lang/stopwords_gl.txt
[junit4] 2> 1473292 INFO (OverseerThreadFactory-12821-thread-1-processing-n:127.0.0.1:37177_solr) [n:127.0.0.1:37177_solr ] o.a.s.c.c.ZkConfigManager Copying zk node /configs/_default/synonyms.txt to /configs/testPeersyncFailureReplicationSuccess.AUTOCREATED/synonyms.txt
[junit4] 2> 1473293 INFO (OverseerThreadFactory-12821-thread-1-processing-n:127.0.0.1:37177_solr) [n:127.0.0.1:37177_solr ] o.a.s.c.c.ZkConfigManager Copying zk node /configs/_default/stopwords.txt to /configs/testPeersyncFailureReplicationSuccess.AUTOCREATED/stopwords.txt
[junit4] 2> 1473400 INFO (OverseerStateUpdate-72129272169365509-127.0.0.1:37177_solr-n_0000000000) [n:127.0.0.1:37177_solr ] o.a.s.c.o.SliceMutator createReplica() {
[junit4] 2> "core":"testPeersyncFailureReplicationSuccess_shard1_replica_n1",
[junit4] 2> "node_name":"127.0.0.1:37177_solr",
[junit4] 2> "base_url":"https://127.0.0.1:37177/solr",
[junit4] 2> "collection":"testPeersyncFailureReplicationSuccess",
[junit4] 2> "shard":"shard1",
[junit4] 2> "state":"down",
[junit4] 2> "type":"NRT",
[junit4] 2> "operation":"ADDREPLICA",
[junit4] 2> "waitForFinalState":"false"}
[junit4] 2> 1473613 INFO (qtp509044316-20307) [n:127.0.0.1:37177_solr x:testPeersyncFailureReplicationSuccess_shard1_replica_n1 ] o.a.s.h.a.CoreAdminOperation core create command qt=/admin/cores&coreNodeName=core_node2&collection.configName=testPeersyncFailureReplicationSuccess.AUTOCREATED&newCollection=true&name=testPeersyncFailureReplicationSuccess_shard1_replica_n1&action=CREATE&numShards=1&collection=testPeersyncFailureReplicationSuccess&shard=shard1&wt=javabin&version=2&replicaType=NRT
[junit4] 2> 1473614 INFO (qtp509044316-20307) [n:127.0.0.1:37177_solr x:testPeersyncFailureReplicationSuccess_shard1_replica_n1 ] o.a.s.c.TransientSolrCoreCacheDefault Allocating transient core cache for max 2147483647 cores with initial capacity of 1024
[junit4] 2> 1473628 INFO (qtp509044316-20307) [n:127.0.0.1:37177_solr c:testPeersyncFailureReplicationSuccess s:shard1 r:core_node2 x:testPeersyncFailureReplicationSuccess_shard1_replica_n1 ] o.a.s.c.SolrConfig Using Lucene MatchVersion: 8.10.0
[junit4] 2> 1473628 WARN (qtp509044316-20307) [n:127.0.0.1:37177_solr c:testPeersyncFailureReplicationSuccess s:shard1 r:core_node2 x:testPeersyncFailureReplicationSuccess_shard1_replica_n1 ] o.a.s.c.SolrConfig solrconfig.xml: <jmx> is no longer supported, use solr.xml:/metrics/reporter section instead
[junit4] 2> 1473633 INFO (qtp509044316-20307) [n:127.0.0.1:37177_solr c:testPeersyncFailureReplicationSuccess s:shard1 r:core_node2 x:testPeersyncFailureReplicationSuccess_shard1_replica_n1 ] o.a.s.s.IndexSchema Schema name=default-config
[junit4] 2> 1473694 INFO (qtp509044316-20307) [n:127.0.0.1:37177_solr c:testPeersyncFailureReplicationSuccess s:shard1 r:core_node2 x:testPeersyncFailureReplicationSuccess_shard1_replica_n1 ] o.a.s.s.IndexSchema Loaded schema default-config/1.6 with uniqueid field id
[junit4] 2> 1473732 INFO (qtp509044316-20307) [n:127.0.0.1:37177_solr c:testPeersyncFailureReplicationSuccess s:shard1 r:core_node2 x:testPeersyncFailureReplicationSuccess_shard1_replica_n1 ] o.a.s.c.CoreContainer Creating SolrCore 'testPeersyncFailureReplicationSuccess_shard1_replica_n1' using configuration from configset testPeersyncFailureReplicationSuccess.AUTOCREATED, trusted=true
[junit4] 2> 1473732 INFO (qtp509044316-20307) [n:127.0.0.1:37177_solr c:testPeersyncFailureReplicationSuccess s:shard1 r:core_node2 x:testPeersyncFailureReplicationSuccess_shard1_replica_n1 ] o.a.s.c.SolrCore [[testPeersyncFailureReplicationSuccess_shard1_replica_n1] ] Opening new SolrCore at [/home/jenkins/jenkins-slave/workspace/Lucene/Lucene-Solr-Tests-8.x/solr/build/solr-core/test/J0/temp/solr.cloud.TestCloudSearcherWarming_6F8C1F8AD10722DA-001/tempDir-001/node1/testPeersyncFailureReplicationSuccess_shard1_replica_n1], dataDir=[/home/jenkins/jenkins-slave/workspace/Lucene/Lucene-Solr-Tests-8.x/solr/build/solr-core/test/J0/temp/solr.cloud.TestCloudSearcherWarming_6F8C1F8AD10722DA-001/tempDir-001/node1/testPeersyncFailureReplicationSuccess_shard1_replica_n1/data/]
[junit4] 2> 1473786 INFO (qtp509044316-20307) [n:127.0.0.1:37177_solr c:testPeersyncFailureReplicationSuccess s:shard1 r:core_node2 x:testPeersyncFailureReplicationSuccess_shard1_replica_n1 ] o.a.s.u.UpdateHandler Using UpdateLog implementation: org.apache.solr.update.UpdateLog
[junit4] 2> 1473786 INFO (qtp509044316-20307) [n:127.0.0.1:37177_solr c:testPeersyncFailureReplicationSuccess s:shard1 r:core_node2 x:testPeersyncFailureReplicationSuccess_shard1_replica_n1 ] o.a.s.u.UpdateLog Initializing UpdateLog: dataDir= defaultSyncLevel=FLUSH numRecordsToKeep=100 maxNumLogsToKeep=10 numVersionBuckets=65536
[junit4] 2> 1473787 INFO (qtp509044316-20307) [n:127.0.0.1:37177_solr c:testPeersyncFailureReplicationSuccess s:shard1 r:core_node2 x:testPeersyncFailureReplicationSuccess_shard1_replica_n1 ] o.a.s.u.CommitTracker Hard AutoCommit: if uncommitted for 15000ms;
[junit4] 2> 1473787 INFO (qtp509044316-20307) [n:127.0.0.1:37177_solr c:testPeersyncFailureReplicationSuccess s:shard1 r:core_node2 x:testPeersyncFailureReplicationSuccess_shard1_replica_n1 ] o.a.s.u.CommitTracker Soft AutoCommit: disabled
[junit4] 2> 1473790 INFO (qtp509044316-20307) [n:127.0.0.1:37177_solr c:testPeersyncFailureReplicationSuccess s:shard1 r:core_node2 x:testPeersyncFailureReplicationSuccess_shard1_replica_n1 ] o.a.s.r.ManagedResourceStorage Configured ZooKeeperStorageIO with znodeBase: /configs/testPeersyncFailureReplicationSuccess.AUTOCREATED
[junit4] 2> 1473790 INFO (qtp509044316-20307) [n:127.0.0.1:37177_solr c:testPeersyncFailureReplicationSuccess s:shard1 r:core_node2 x:testPeersyncFailureReplicationSuccess_shard1_replica_n1 ] o.a.s.r.ManagedResourceStorage Loaded null at path _rest_managed.json using ZooKeeperStorageIO:path=/configs/testPeersyncFailureReplicationSuccess.AUTOCREATED
[junit4] 2> 1473790 INFO (qtp509044316-20307) [n:127.0.0.1:37177_solr c:testPeersyncFailureReplicationSuccess s:shard1 r:core_node2 x:testPeersyncFailureReplicationSuccess_shard1_replica_n1 ] o.a.s.s.ZkIndexSchemaReader Creating ZooKeeper watch for the managed schema at /configs/testPeersyncFailureReplicationSuccess.AUTOCREATED/managed-schema
[junit4] 2> 1473791 INFO (qtp509044316-20307) [n:127.0.0.1:37177_solr c:testPeersyncFailureReplicationSuccess s:shard1 r:core_node2 x:testPeersyncFailureReplicationSuccess_shard1_replica_n1 ] o.a.s.s.ZkIndexSchemaReader Current schema version 0 is already the latest
[junit4] 2> 1473791 INFO (qtp509044316-20307) [n:127.0.0.1:37177_solr c:testPeersyncFailureReplicationSuccess s:shard1 r:core_node2 x:testPeersyncFailureReplicationSuccess_shard1_replica_n1 ] o.a.s.h.c.SpellCheckComponent Initializing spell checkers
[junit4] 2> 1473791 INFO (qtp509044316-20307) [n:127.0.0.1:37177_solr c:testPeersyncFailureReplicationSuccess s:shard1 r:core_node2 x:testPeersyncFailureReplicationSuccess_shard1_replica_n1 ] o.a.s.s.DirectSolrSpellChecker init: {name=default,field=_text_,classname=solr.DirectSolrSpellChecker,distanceMeasure=internal,accuracy=0.5,maxQueryFrequency=0.01,maxEdits=2,minPrefix=1,maxInspections=5,minQueryLength=4}
[junit4] 2> 1473792 INFO (qtp509044316-20307) [n:127.0.0.1:37177_solr c:testPeersyncFailureReplicationSuccess s:shard1 r:core_node2 x:testPeersyncFailureReplicationSuccess_shard1_replica_n1 ] o.a.s.h.ReplicationHandler Commits will be reserved for 10000 ms
[junit4] 2> 1473792 INFO (qtp509044316-20307) [n:127.0.0.1:37177_solr c:testPeersyncFailureReplicationSuccess s:shard1 r:core_node2 x:testPeersyncFailureReplicationSuccess_shard1_replica_n1 ] o.a.s.u.UpdateLog Could not find max version in index or recent updates, using new clock 1706436173475348480
[junit4] 2> 1473794 INFO (searcherExecutor-12831-thread-1-processing-n:127.0.0.1:37177_solr x:testPeersyncFailureReplicationSuccess_shard1_replica_n1 c:testPeersyncFailureReplicationSuccess s:shard1 r:core_node2) [n:127.0.0.1:37177_solr c:testPeersyncFailureReplicationSuccess s:shard1 r:core_node2 x:testPeersyncFailureReplicationSuccess_shard1_replica_n1 ] o.a.s.c.QuerySenderListener QuerySenderListener done.
[junit4] 2> 1473794 INFO (searcherExecutor-12831-thread-1-processing-n:127.0.0.1:37177_solr x:testPeersyncFailureReplicationSuccess_shard1_replica_n1 c:testPeersyncFailureReplicationSuccess s:shard1 r:core_node2) [n:127.0.0.1:37177_solr c:testPeersyncFailureReplicationSuccess s:shard1 r:core_node2 x:testPeersyncFailureReplicationSuccess_shard1_replica_n1 ] o.a.s.h.c.SpellCheckComponent Loading spell index for spellchecker: default
[junit4] 2> 1473794 INFO (searcherExecutor-12831-thread-1-processing-n:127.0.0.1:37177_solr x:testPeersyncFailureReplicationSuccess_shard1_replica_n1 c:testPeersyncFailureReplicationSuccess s:shard1 r:core_node2) [n:127.0.0.1:37177_solr c:testPeersyncFailureReplicationSuccess s:shard1 r:core_node2 x:testPeersyncFailureReplicationSuccess_shard1_replica_n1 ] o.a.s.c.SolrCore [testPeersyncFailureReplicationSuccess_shard1_replica_n1] Registered new searcher autowarm time: 0 ms
[junit4] 2> 1473799 INFO (qtp509044316-20307) [n:127.0.0.1:37177_solr c:testPeersyncFailureReplicationSuccess s:shard1 r:core_node2 x:testPeersyncFailureReplicationSuccess_shard1_replica_n1 ] o.a.s.c.ZkShardTerms Successful update of terms at /collections/testPeersyncFailureReplicationSuccess/terms/shard1 to Terms{values={core_node2=0}, version=0}
[junit4] 2> 1473799 INFO (qtp509044316-20307) [n:127.0.0.1:37177_solr c:testPeersyncFailureReplicationSuccess s:shard1 r:core_node2 x:testPeersyncFailureReplicationSuccess_shard1_replica_n1 ] o.a.s.c.ShardLeaderElectionContextBase make sure parent is created /collections/testPeersyncFailureReplicationSuccess/leaders/shard1
[junit4] 2> 1473802 INFO (qtp509044316-20307) [n:127.0.0.1:37177_solr c:testPeersyncFailureReplicationSuccess s:shard1 r:core_node2 x:testPeersyncFailureReplicationSuccess_shard1_replica_n1 ] o.a.s.c.ShardLeaderElectionContext Enough replicas found to continue.
[junit4] 2> 1473802 INFO (qtp509044316-20307) [n:127.0.0.1:37177_solr c:testPeersyncFailureReplicationSuccess s:shard1 r:core_node2 x:testPeersyncFailureReplicationSuccess_shard1_replica_n1 ] o.a.s.c.ShardLeaderElectionContext I may be the new leader - try and sync
[junit4] 2> 1473802 INFO (qtp509044316-20307) [n:127.0.0.1:37177_solr c:testPeersyncFailureReplicationSuccess s:shard1 r:core_node2 x:testPeersyncFailureReplicationSuccess_shard1_replica_n1 ] o.a.s.c.SyncStrategy Sync replicas to https://127.0.0.1:37177/solr/testPeersyncFailureReplicationSuccess_shard1_replica_n1/
[junit4] 2> 1473803 INFO (qtp509044316-20307) [n:127.0.0.1:37177_solr c:testPeersyncFailureReplicationSuccess s:shard1 r:core_node2 x:testPeersyncFailureReplicationSuccess_shard1_replica_n1 ] o.a.s.c.SyncStrategy Sync Success - now sync replicas to me
[junit4] 2> 1473803 INFO (qtp509044316-20307) [n:127.0.0.1:37177_solr c:testPeersyncFailureReplicationSuccess s:shard1 r:core_node2 x:testPeersyncFailureReplicationSuccess_shard1_replica_n1 ] o.a.s.c.SyncStrategy https://127.0.0.1:37177/solr/testPeersyncFailureReplicationSuccess_shard1_replica_n1/ has no replicas
[junit4] 2> 1473803 INFO (qtp509044316-20307) [n:127.0.0.1:37177_solr c:testPeersyncFailureReplicationSuccess s:shard1 r:core_node2 x:testPeersyncFailureReplicationSuccess_shard1_replica_n1 ] o.a.s.c.ShardLeaderElectionContextBase Creating leader registration node /collections/testPeersyncFailureReplicationSuccess/leaders/shard1/leader after winning as /collections/testPeersyncFailureReplicationSuccess/leader_elect/shard1/election/72129272169365509-core_node2-n_0000000000
[junit4] 2> 1473806 INFO (qtp509044316-20307) [n:127.0.0.1:37177_solr c:testPeersyncFailureReplicationSuccess s:shard1 r:core_node2 x:testPeersyncFailureReplicationSuccess_shard1_replica_n1 ] o.a.s.c.ShardLeaderElectionContext I am the new leader: https://127.0.0.1:37177/solr/testPeersyncFailureReplicationSuccess_shard1_replica_n1/ shard1
[junit4] 2> 1473908 INFO (zkCallback-12813-thread-1) [ ] o.a.s.c.c.ZkStateReader A cluster state change: [WatchedEvent state:SyncConnected type:NodeDataChanged path:/collections/testPeersyncFailureReplicationSuccess/state.json] for collection [testPeersyncFailureReplicationSuccess] has occurred - updating... (live nodes size: [1])
[junit4] 2> 1473908 INFO (zkCallback-12813-thread-2) [ ] o.a.s.c.c.ZkStateReader A cluster state change: [WatchedEvent state:SyncConnected type:NodeDataChanged path:/collections/testPeersyncFailureReplicationSuccess/state.json] for collection [testPeersyncFailureReplicationSuccess] has occurred - updating... (live nodes size: [1])
[junit4] 2> 1473908 INFO (qtp509044316-20307) [n:127.0.0.1:37177_solr c:testPeersyncFailureReplicationSuccess s:shard1 r:core_node2 x:testPeersyncFailureReplicationSuccess_shard1_replica_n1 ] o.a.s.c.ZkController I am the leader, no recovery necessary
[junit4] 2> 1473912 INFO (qtp509044316-20307) [n:127.0.0.1:37177_solr ] o.a.s.s.HttpSolrCall [admin] webapp=null path=/admin/cores params={qt=/admin/cores&coreNodeName=core_node2&collection.configName=testPeersyncFailureReplicationSuccess.AUTOCREATED&newCollection=true&name=testPeersyncFailureReplicationSuccess_shard1_replica_n1&action=CREATE&numShards=1&collection=testPeersyncFailureReplicationSuccess&shard=shard1&wt=javabin&version=2&replicaType=NRT} status=0 QTime=298
[junit4] 2> 1473914 INFO (qtp509044316-20309) [n:127.0.0.1:37177_solr ] o.a.s.h.a.CollectionsHandler Wait for new collection to be active for at most 45 seconds. Check all shard replicas
[junit4] 2> 1474012 INFO (zkCallback-12813-thread-2) [ ] o.a.s.c.c.ZkStateReader A cluster state change: [WatchedEvent state:SyncConnected type:NodeDataChanged path:/collections/testPeersyncFailureReplicationSuccess/state.json] for collection [testPeersyncFailureReplicationSuccess] has occurred - updating... (live nodes size: [1])
[junit4] 2> 1474012 INFO (zkCallback-12813-thread-1) [ ] o.a.s.c.c.ZkStateReader A cluster state change: [WatchedEvent state:SyncConnected type:NodeDataChanged path:/collections/testPeersyncFailureReplicationSuccess/state.json] for collection [testPeersyncFailureReplicationSuccess] has occurred - updating... (live nodes size: [1])
[junit4] 2> 1474012 INFO (zkCallback-12813-thread-3) [ ] o.a.s.c.c.ZkStateReader A cluster state change: [WatchedEvent state:SyncConnected type:NodeDataChanged path:/collections/testPeersyncFailureReplicationSuccess/state.json] for collection [testPeersyncFailureReplicationSuccess] has occurred - updating... (live nodes size: [1])
[junit4] 2> 1474012 INFO (qtp509044316-20309) [n:127.0.0.1:37177_solr ] o.a.s.s.HttpSolrCall [admin] webapp=null path=/admin/collections params={pullReplicas=0&maxShardsPerNode=2&name=testPeersyncFailureReplicationSuccess&nrtReplicas=1&action=CREATE&numShards=1&tlogReplicas=0&createNodeSet=127.0.0.1:37177_solr&wt=javabin&version=2} status=0 QTime=784
[junit4] 2> 1474013 INFO (TEST-TestCloudSearcherWarming.testPeersyncFailureReplicationSuccess-seed#[6F8C1F8AD10722DA]) [ ] o.a.s.c.SolrCloudTestCase waitForState (testPeersyncFailureReplicationSuccess): The collection should have 1 shard and 1 replica
[junit4] 2> 1474014 INFO (watches-12826-thread-1) [ ] o.a.s.c.SolrCloudTestCase active replica count: 1 expected replica count: 1
[junit4] 2> 1474015 INFO (TEST-TestCloudSearcherWarming.testPeersyncFailureReplicationSuccess-seed#[6F8C1F8AD10722DA]) [ ] o.a.s.c.SolrCloudTestCase active replica count: 1 expected replica count: 1
[junit4] 2> 1474015 INFO (TEST-TestCloudSearcherWarming.testPeersyncFailureReplicationSuccess-seed#[6F8C1F8AD10722DA]) [ ] o.a.s.c.SolrCloudTestCase active replica count: 1 expected replica count: 1
[junit4] 2> 1474016 INFO (TEST-TestCloudSearcherWarming.testPeersyncFailureReplicationSuccess-seed#[6F8C1F8AD10722DA]) [ ] o.a.s.c.SolrCloudTestCase active replica count: 1 expected replica count: 1
[junit4] 2> 1474024 INFO (qtp509044316-20308) [n:127.0.0.1:37177_solr c:testPeersyncFailureReplicationSuccess s:shard1 r:core_node2 x:testPeersyncFailureReplicationSuccess_shard1_replica_n1 ] o.a.s.h.SolrConfigHandler Waiting up to 30 secs for 1 replicas to set the property overlay to be of version 0 for collection testPeersyncFailureReplicationSuccess
[junit4] 2> 1474025 INFO (Thread-2532) [ ] o.a.s.c.SolrCore config update listener called for core testPeersyncFailureReplicationSuccess_shard1_replica_n1
[junit4] 2> 1474026 INFO (solrHandlerExecutor-12836-thread-1-processing-n:127.0.0.1:37177_solr x:testPeersyncFailureReplicationSuccess_shard1_replica_n1 c:testPeersyncFailureReplicationSuccess s:shard1 r:core_node2) [n:127.0.0.1:37177_solr c:testPeersyncFailureReplicationSuccess s:shard1 r:core_node2 x:testPeersyncFailureReplicationSuccess_shard1_replica_n1 ] o.a.s.h.SolrConfigHandler Time elapsed : 0 secs, maxWait 30
[junit4] 2> 1474026 INFO (Thread-2532) [n:127.0.0.1:37177_solr ] o.a.s.c.SolrCore core reload testPeersyncFailureReplicationSuccess_shard1_replica_n1
[junit4] 2> 1474033 INFO (Thread-2532) [n:127.0.0.1:37177_solr ] o.a.s.c.SolrConfig Using Lucene MatchVersion: 8.10.0
[junit4] 2> 1474033 WARN (Thread-2532) [n:127.0.0.1:37177_solr ] o.a.s.c.SolrConfig solrconfig.xml: <jmx> is no longer supported, use solr.xml:/metrics/reporter section instead
[junit4] 2> 1474034 INFO (Thread-2532) [n:127.0.0.1:37177_solr ] o.a.s.s.IndexSchema Schema name=default-config
[junit4] 2> 1474076 INFO (Thread-2532) [n:127.0.0.1:37177_solr ] o.a.s.s.IndexSchema Loaded schema default-config/1.6 with uniqueid field id
[junit4] 2> 1474111 INFO (Thread-2532) [n:127.0.0.1:37177_solr ] o.a.s.c.CoreContainer Reloading SolrCore 'testPeersyncFailureReplicationSuccess_shard1_replica_n1' using configuration from configset testPeersyncFailureReplicationSuccess.AUTOCREATED
[junit4] 2> 1474112 INFO (Thread-2532) [n:127.0.0.1:37177_solr ] o.a.s.c.SolrCore [[testPeersyncFailureReplicationSuccess_shard1_replica_n1] ] Opening new SolrCore at [/home/jenkins/jenkins-slave/workspace/Lucene/Lucene-Solr-Tests-8.x/solr/build/solr-core/test/J0/temp/solr.cloud.TestCloudSearcherWarming_6F8C1F8AD10722DA-001/tempDir-001/node1/testPeersyncFailureReplicationSuccess_shard1_replica_n1], dataDir=[/home/jenkins/jenkins-slave/workspace/Lucene/Lucene-Solr-Tests-8.x/solr/build/solr-core/test/J0/temp/solr.cloud.TestCloudSearcherWarming_6F8C1F8AD10722DA-001/tempDir-001/node1/testPeersyncFailureReplicationSuccess_shard1_replica_n1/data/]
[junit4] 2> 1474133 INFO (qtp509044316-20309) [n:127.0.0.1:37177_solr c:testPeersyncFailureReplicationSuccess s:shard1 r:core_node2 x:testPeersyncFailureReplicationSuccess_shard1_replica_n1 ] o.a.s.h.SolrConfigHandler expecting overlay version 0 but my version is -1
[junit4] 2> 1474133 INFO (qtp509044316-20309) [n:127.0.0.1:37177_solr c:testPeersyncFailureReplicationSuccess s:shard1 r:core_node2 x:testPeersyncFailureReplicationSuccess_shard1_replica_n1 ] o.a.s.c.S.Request [testPeersyncFailureReplicationSuccess_shard1_replica_n1] webapp=/solr path=/config/znodeVersion params={overlay=0&wt=javabin&version=2} status=0 QTime=0
[junit4] 2> 1474133 INFO (SolrConfigHandler-refreshconf) [ ] o.a.s.h.SolrConfigHandler Another reload is in progress . Not doing anything
[junit4] 2> 1474134 INFO (solrHandlerExecutor-12836-thread-1-processing-n:127.0.0.1:37177_solr x:testPeersyncFailureReplicationSuccess_shard1_replica_n1 c:testPeersyncFailureReplicationSuccess s:shard1 r:core_node2) [n:127.0.0.1:37177_solr c:testPeersyncFailureReplicationSuccess s:shard1 r:core_node2 x:testPeersyncFailureReplicationSuccess_shard1_replica_n1 ] o.a.s.h.SolrConfigHandler Could not get expectedVersion 0 from https://127.0.0.1:37177/solr/testPeersyncFailureReplicationSuccess_shard1_replica_n1/ for prop overlay after 1 attempts
[junit4] 2> 1474134 INFO (solrHandlerExecutor-12836-thread-1-processing-n:127.0.0.1:37177_solr x:testPeersyncFailureReplicationSuccess_shard1_replica_n1 c:testPeersyncFailureReplicationSuccess s:shard1 r:core_node2) [n:127.0.0.1:37177_solr c:testPeersyncFailureReplicationSuccess s:shard1 r:core_node2 x:testPeersyncFailureReplicationSuccess_shard1_replica_n1 ] o.a.s.h.SolrConfigHandler Time elapsed : 0 secs, maxWait 30
[junit4] 2> 1474153 INFO (Thread-2532) [n:127.0.0.1:37177_solr ] o.a.s.u.CommitTracker Hard AutoCommit: if uncommitted for 15000ms;
[junit4] 2> 1474153 INFO (Thread-2532) [n:127.0.0.1:37177_solr ] o.a.s.u.CommitTracker Soft AutoCommit: disabled
[junit4] 2> 1474154 INFO (Thread-2532) [n:127.0.0.1:37177_solr ] o.a.s.r.ManagedResourceStorage Configured ZooKeeperStorageIO with znodeBase: /configs/testPeersyncFailureReplicationSuccess.AUTOCREATED
[junit4] 2> 1474155 INFO (Thread-2532) [n:127.0.0.1:37177_solr ] o.a.s.r.ManagedResourceStorage Loaded null at path _rest_managed.json using ZooKeeperStorageIO:path=/configs/testPeersyncFailureReplicationSuccess.AUTOCREATED
[junit4] 2> 1474155 INFO (Thread-2532) [n:127.0.0.1:37177_solr ] o.a.s.s.ZkIndexSchemaReader Creating ZooKeeper watch for the managed schema at /configs/testPeersyncFailureReplicationSuccess.AUTOCREATED/managed-schema
[junit4] 2> 1474155 INFO (Thread-2532) [n:127.0.0.1:37177_solr ] o.a.s.s.ZkIndexSchemaReader Current schema version 0 is already the latest
[junit4] 2> 1474155 INFO (Thread-2532) [n:127.0.0.1:37177_solr ] o.a.s.h.c.SpellCheckComponent Initializing spell checkers
[junit4] 2> 1474155 INFO (Thread-2532) [n:127.0.0.1:37177_solr ] o.a.s.s.DirectSolrSpellChecker init: {name=default,field=_text_,classname=solr.DirectSolrSpellChecker,distanceMeasure=internal,accuracy=0.5,maxQueryFrequency=0.01,maxEdits=2,minPrefix=1,maxInspections=5,minQueryLength=4}
[junit4] 2> 1474156 INFO (Thread-2532) [n:127.0.0.1:37177_solr ] o.a.s.h.ReplicationHandler Commits will be reserved for 10000 ms
[junit4] 2> 1474156 INFO (Thread-2532) [n:127.0.0.1:37177_solr ] o.a.s.u.UpdateLog Could not find max version in index or recent updates, using new clock 1706436173857030144
[junit4] 2> 1474158 INFO (searcherExecutor-12838-thread-1-processing-n:127.0.0.1:37177_solr) [n:127.0.0.1:37177_solr ] o.a.s.c.QuerySenderListener QuerySenderListener done.
[junit4] 2> 1474158 INFO (searcherExecutor-12838-thread-1-processing-n:127.0.0.1:37177_solr) [n:127.0.0.1:37177_solr ] o.a.s.h.c.SpellCheckComponent Loading spell index for spellchecker: default
[junit4] 2> 1474158 INFO (searcherExecutor-12838-thread-1-processing-n:127.0.0.1:37177_solr) [n:127.0.0.1:37177_solr ] o.a.s.c.SolrCore [testPeersyncFailureReplicationSuccess_shard1_replica_n1] Registered new searcher autowarm time: 0 ms
[junit4] 2> 1474160 INFO (Thread-2532) [n:127.0.0.1:37177_solr ] o.a.s.u.DefaultSolrCoreState New IndexWriter is ready to be used.
[junit4] 2> 1474161 INFO (searcherExecutor-12838-thread-1-processing-n:127.0.0.1:37177_solr) [n:127.0.0.1:37177_solr ] o.a.s.c.QuerySenderListener QuerySenderListener done.
[junit4] 2> 1474161 INFO (searcherExecutor-12838-thread-1-processing-n:127.0.0.1:37177_solr) [n:127.0.0.1:37177_solr ] o.a.s.c.SolrCore [testPeersyncFailureReplicationSuccess_shard1_replica_n1] Registered new searcher autowarm time: 0 ms
[junit4] 2> 1474235 INFO (qtp509044316-20305) [n:127.0.0.1:37177_solr c:testPeersyncFailureReplicationSuccess s:shard1 r:core_node2 x:testPeersyncFailureReplicationSuccess_shard1_replica_n1 ] o.a.s.h.SolrConfigHandler I already have the expected version 0 of config
[junit4] 2> 1474235 INFO (qtp509044316-20305) [n:127.0.0.1:37177_solr c:testPeersyncFailureReplicationSuccess s:shard1 r:core_node2 x:testPeersyncFailureReplicationSuccess_shard1_replica_n1 ] o.a.s.h.SolrConfigHandler isStale false , resourceloader org.apache.solr.cloud.ZkSolrResourceLoader
[junit4] 2> 1474235 INFO (qtp509044316-20305) [n:127.0.0.1:37177_solr c:testPeersyncFailureReplicationSuccess s:shard1 r:core_node2 x:testPeersyncFailureReplicationSuccess_shard1_replica_n1 ] o.a.s.c.S.Request [testPeersyncFailureReplicationSuccess_shard1_replica_n1] webapp=/solr path=/config/znodeVersion params={overlay=0&wt=javabin&version=2} status=0 QTime=0
[junit4] 2> 1474237 INFO (qtp509044316-20308) [n:127.0.0.1:37177_solr c:testPeersyncFailureReplicationSuccess s:shard1 r:core_node2 x:testPeersyncFailureReplicationSuccess_shard1_replica_n1 ] o.a.s.h.SolrConfigHandler Took 212.0ms to set the property overlay to be of version 0 for collection testPeersyncFailureReplicationSuccess
[junit4] 2> 1474237 INFO (qtp509044316-20308) [n:127.0.0.1:37177_solr c:testPeersyncFailureReplicationSuccess s:shard1 r:core_node2 x:testPeersyncFailureReplicationSuccess_shard1_replica_n1 ] o.a.s.c.S.Request [testPeersyncFailureReplicationSuccess_shard1_replica_n1] webapp=/solr path=/config params={wt=javabin&version=2} status=0 QTime=217
[junit4] 2> 1474237 INFO (qtp509044316-20308) [n:127.0.0.1:37177_solr ] o.a.s.c.SolrCore [testPeersyncFailureReplicationSuccess_shard1_replica_n1] CLOSING SolrCore org.apache.solr.core.SolrCore@1ee1bb90
[junit4] 2> 1474237 INFO (qtp509044316-20308) [n:127.0.0.1:37177_solr ] o.a.s.m.SolrMetricManager Closing metric reporters for registry=solr.core.testPeersyncFailureReplicationSuccess.shard1.replica_n1 tag=SolrCore@1ee1bb90
[junit4] 2> 1474237 INFO (qtp509044316-20308) [n:127.0.0.1:37177_solr ] o.a.s.m.SolrMetricManager Closing metric reporters for registry=solr.collection.testPeersyncFailureReplicationSuccess.shard1.leader tag=SolrCore@1ee1bb90
[junit4] 2> 1474242 INFO (qtp509044316-20305) [n:127.0.0.1:37177_solr c:testPeersyncFailureReplicationSuccess s:shard1 r:core_node2 x:testPeersyncFailureReplicationSuccess_shard1_replica_n1 ] o.a.s.c.ZkShardTerms Successful update of terms at /collections/testPeersyncFailureReplicationSuccess/terms/shard1 to Terms{values={core_node2=1}, version=1}
[junit4] 2> 1474242 INFO (qtp509044316-20305) [n:127.0.0.1:37177_solr c:testPeersyncFailureReplicationSuccess s:shard1 r:core_node2 x:testPeersyncFailureReplicationSuccess_shard1_replica_n1 ] o.a.s.u.p.LogUpdateProcessorFactory [testPeersyncFailureReplicationSuccess_shard1_replica_n1] webapp=/solr path=/update params={wt=javabin&version=2}{add=[1 (1706436173946159104)]} 0 3
[junit4] 2> 1474359 INFO (searcherExecutor-12838-thread-1-processing-n:127.0.0.1:37177_solr x:testPeersyncFailureReplicationSuccess_shard1_replica_n1 c:testPeersyncFailureReplicationSuccess s:shard1 r:core_node2) [n:127.0.0.1:37177_solr c:testPeersyncFailureReplicationSuccess s:shard1 r:core_node2 x:testPeersyncFailureReplicationSuccess_shard1_replica_n1 ] o.a.s.c.QuerySenderListener QuerySenderListener done.
[junit4] 2> 1474360 INFO (searcherExecutor-12838-thread-1-processing-n:127.0.0.1:37177_solr x:testPeersyncFailureReplicationSuccess_shard1_replica_n1 c:testPeersyncFailureReplicationSuccess s:shard1 r:core_node2) [n:127.0.0.1:37177_solr c:testPeersyncFailureReplicationSuccess s:shard1 r:core_node2 x:testPeersyncFailureReplicationSuccess_shard1_replica_n1 ] o.a.s.c.SolrCore [testPeersyncFailureReplicationSuccess_shard1_replica_n1] Registered new searcher autowarm time: 0 ms
[junit4] 2> 1474360 INFO (qtp509044316-20307) [n:127.0.0.1:37177_solr c:testPeersyncFailureReplicationSuccess s:shard1 r:core_node2 x:testPeersyncFailureReplicationSuccess_shard1_replica_n1 ] o.a.s.u.p.LogUpdateProcessorFactory [testPeersyncFailureReplicationSuccess_shard1_replica_n1] webapp=/solr path=/update params={_stateVer_=testPeersyncFailureReplicationSuccess:4&waitSearcher=true&commit=true&softCommit=false&wt=javabin&version=2}{commit=} 0 116
[junit4] 2> 1474361 INFO (qtp509044316-20306) [n:127.0.0.1:37177_solr c:testPeersyncFailureReplicationSuccess s:shard1 r:core_node2 x:testPeersyncFailureReplicationSuccess_shard1_replica_n1 ] o.a.s.c.S.Request [testPeersyncFailureReplicationSuccess_shard1_replica_n1] webapp=/solr path=/select params={q=*:*&_stateVer_=testPeersyncFailureReplicationSuccess:4&wt=javabin&version=2} hits=1 status=0 QTime=0
[junit4] 2> 1474371 INFO (TEST-TestCloudSearcherWarming.testPeersyncFailureReplicationSuccess-seed#[6F8C1F8AD10722DA]) [ ] o.a.s.c.s.e.JettySolrRunner Start Jetty (configured port=0, binding port=0)
[junit4] 2> 1474371 INFO (TEST-TestCloudSearcherWarming.testPeersyncFailureReplicationSuccess-seed#[6F8C1F8AD10722DA]) [ ] o.a.s.c.s.e.JettySolrRunner Trying to start Jetty on port 0 try number 2 ...
[junit4] 2> 1474371 INFO (TEST-TestCloudSearcherWarming.testPeersyncFailureReplicationSuccess-seed#[6F8C1F8AD10722DA]) [ ] o.e.j.s.Server jetty-9.4.41.v20210516; built: 2021-05-16T23:56:28.993Z; git: 98607f93c7833e7dc59489b13f3cb0a114fb9f4c; jvm 1.8.0_291-b10
[junit4] 2> 1474372 INFO (TEST-TestCloudSearcherWarming.testPeersyncFailureReplicationSuccess-seed#[6F8C1F8AD10722DA]) [ ] o.e.j.s.session DefaultSessionIdManager workerName=node0
[junit4] 2> 1474372 INFO (TEST-TestCloudSearcherWarming.testPeersyncFailureReplicationSuccess-seed#[6F8C1F8AD10722DA]) [ ] o.e.j.s.session No SessionScavenger set, using defaults
[junit4] 2> 1474372 INFO (TEST-TestCloudSearcherWarming.testPeersyncFailureReplicationSuccess-seed#[6F8C1F8AD10722DA]) [ ] o.e.j.s.session node0 Scavenging every 660000ms
[junit4] 2> 1474373 INFO (TEST-TestCloudSearcherWarming.testPeersyncFailureReplicationSuccess-seed#[6F8C1F8AD10722DA]) [ ] o.e.j.s.h.ContextHandler Started o.e.j.s.ServletContextHandler@50e65c4b{/solr,null,AVAILABLE}
[junit4] 2> 1474374 INFO (TEST-TestCloudSearcherWarming.testPeersyncFailureReplicationSuccess-seed#[6F8C1F8AD10722DA]) [ ] o.e.j.s.AbstractConnector Started ServerConnector@50e1ec4e{SSL, (ssl, http/1.1)}{127.0.0.1:33169}
[junit4] 2> 1474374 INFO (TEST-TestCloudSearcherWarming.testPeersyncFailureReplicationSuccess-seed#[6F8C1F8AD10722DA]) [ ] o.e.j.s.Server Started @1474413ms
[junit4] 2> 1474374 INFO (TEST-TestCloudSearcherWarming.testPeersyncFailureReplicationSuccess-seed#[6F8C1F8AD10722DA]) [ ] o.a.s.c.s.e.JettySolrRunner Jetty properties: {hostContext=/solr, zkHost=127.0.0.1:41643/solr, hostPort=33169}
[junit4] 2> 1474374 ERROR (TEST-TestCloudSearcherWarming.testPeersyncFailureReplicationSuccess-seed#[6F8C1F8AD10722DA]) [ ] o.a.s.u.StartupLoggingUtils Missing Java Option solr.log.dir. Logging may be missing or incomplete.
[junit4] 2> 1474374 INFO (TEST-TestCloudSearcherWarming.testPeersyncFailureReplicationSuccess-seed#[6F8C1F8AD10722DA]) [ ] o.a.s.s.SolrDispatchFilter Using logger factory org.apache.logging.slf4j.Log4jLoggerFactory
[junit4] 2> 1474374 INFO (TEST-TestCloudSearcherWarming.testPeersyncFailureReplicationSuccess-seed#[6F8C1F8AD10722DA]) [ ] o.a.s.s.SolrDispatchFilter ___ _ Welcome to Apache Solr? version 8.10.0
[junit4] 2> 1474374 INFO (TEST-TestCloudSearcherWarming.testPeersyncFailureReplicationSuccess-seed#[6F8C1F8AD10722DA]) [ ] o.a.s.s.SolrDispatchFilter / __| ___| |_ _ Starting in cloud mode on port null
[junit4] 2> 1474374 INFO (TEST-TestCloudSearcherWarming.testPeersyncFailureReplicationSuccess-seed#[6F8C1F8AD10722DA]) [ ] o.a.s.s.SolrDispatchFilter \__ \/ _ \ | '_| Install dir: /home/jenkins/jenkins-slave/workspace/Lucene/Lucene-Solr-Tests-8.x/solr
[junit4] 2> 1474374 INFO (TEST-TestCloudSearcherWarming.testPeersyncFailureReplicationSuccess-seed#[6F8C1F8AD10722DA]) [ ] o.a.s.s.SolrDispatchFilter |___/\___/_|_| Start time: 2021-07-27T11:12:31.812Z
[junit4] 2> 1474375 INFO (TEST-TestCloudSearcherWarming.testPeersyncFailureReplicationSuccess-seed#[6F8C1F8AD10722DA]) [ ] o.a.s.c.c.ConnectionManager Waiting for client to connect to ZooKeeper
[junit4] 2> 1474375 INFO (zkConnectionManagerCallback-12845-thread-1) [ ] o.a.s.c.c.ConnectionManager zkClient has connected
[junit4] 2> 1474375 INFO (TEST-TestCloudSearcherWarming.testPeersyncFailureReplicationSuccess-seed#[6F8C1F8AD10722DA]) [ ] o.a.s.c.c.ConnectionManager Client is connected to ZooKeeper
[junit4] 2> 1474376 INFO (TEST-TestCloudSearcherWarming.testPeersyncFailureReplicationSuccess-seed#[6F8C1F8AD10722DA]) [ ] o.a.s.s.SolrDispatchFilter solr.xml found in ZooKeeper. Loading...
[junit4] 2> 1474379 INFO (TEST-TestCloudSearcherWarming.testPeersyncFailureReplicationSuccess-seed#[6F8C1F8AD10722DA]) [ ] o.a.s.c.SolrXmlConfig Metrics collection is disabled.
[junit4] 2> 1474866 INFO (TEST-TestCloudSearcherWarming.testPeersyncFailureReplicationSuccess-seed#[6F8C1F8AD10722DA]) [ ] o.a.s.h.c.HttpShardHandlerFactory Host whitelist initialized: WhitelistHostChecker [whitelistHosts=null, whitelistHostCheckingEnabled=true]
[junit4] 2> 1474867 WARN (TEST-TestCloudSearcherWarming.testPeersyncFailureReplicationSuccess-seed#[6F8C1F8AD10722DA]) [ ] o.a.s.c.s.i.Http2SolrClient Create Http2SolrClient with HTTP/1.1 transport since Java 8 or lower versions does not support SSL + HTTP/2
[junit4] 2> 1474867 WARN (TEST-TestCloudSearcherWarming.testPeersyncFailureReplicationSuccess-seed#[6F8C1F8AD10722DA]) [ ] o.e.j.u.s.S.config Trusting all certificates configured for Client@74855d4a[provider=null,keyStore=null,trustStore=null]
[junit4] 2> 1474867 WARN (TEST-TestCloudSearcherWarming.testPeersyncFailureReplicationSuccess-seed#[6F8C1F8AD10722DA]) [ ] o.e.j.u.s.S.config No Client EndPointIdentificationAlgorithm configured for Client@74855d4a[provider=null,keyStore=null,trustStore=null]
[junit4] 2> 1474870 WARN (TEST-TestCloudSearcherWarming.testPeersyncFailureReplicationSuccess-seed#[6F8C1F8AD10722DA]) [ ] o.a.s.c.s.i.Http2SolrClient Create Http2SolrClient with HTTP/1.1 transport since Java 8 or lower versions does not support SSL + HTTP/2
[junit4] 2> 1474871 WARN (TEST-TestCloudSearcherWarming.testPeersyncFailureReplicationSuccess-seed#[6F8C1F8AD10722DA]) [ ] o.e.j.u.s.S.config Trusting all certificates configured for Client@54375d5[provider=null,keyStore=null,trustStore=null]
[junit4] 2> 1474871 WARN (TEST-TestCloudSearcherWarming.testPeersyncFailureReplicationSuccess-seed#[6F8C1F8AD10722DA]) [ ] o.e.j.u.s.S.config No Client EndPointIdentificationAlgorithm configured for Client@54375d5[provider=null,keyStore=null,trustStore=null]
[junit4] 2> 1474872 INFO (TEST-TestCloudSearcherWarming.testPeersyncFailureReplicationSuccess-seed#[6F8C1F8AD10722DA]) [ ] o.a.s.c.ZkContainer Zookeeper client=127.0.0.1:41643/solr
[junit4] 2> 1474872 INFO (TEST-TestCloudSearcherWarming.testPeersyncFailureReplicationSuccess-seed#[6F8C1F8AD10722DA]) [ ] o.a.s.c.c.ConnectionManager Waiting for client to connect to ZooKeeper
[junit4] 2> 1474873 INFO (zkConnectionManagerCallback-12856-thread-1) [ ] o.a.s.c.c.ConnectionManager zkClient has connected
[junit4] 2> 1474873 INFO (TEST-TestCloudSearcherWarming.testPeersyncFailureReplicationSuccess-seed#[6F8C1F8AD10722DA]) [ ] o.a.s.c.c.ConnectionManager Client is connected to ZooKeeper
[junit4] 2> 1474874 WARN (TEST-TestCloudSearcherWarming.testPeersyncFailureReplicationSuccess-seed#[6F8C1F8AD10722DA]-SendThread(127.0.0.1:41643)) [ ] o.a.z.ClientCnxn An exception was thrown while closing send thread for session 0x1004130dd900008.
[junit4] 2> => EndOfStreamException: Unable to read additional data from server sessionid 0x1004130dd900008, likely server has closed socket
[junit4] 2> at org.apache.zookeeper.ClientCnxnSocketNIO.doIO(ClientCnxnSocketNIO.java:77)
[junit4] 2> org.apache.zookeeper.ClientCnxn$EndOfStreamException: Unable to read additional data from server sessionid 0x1004130dd900008, likely server has closed socket
[junit4] 2> at org.apache.zookeeper.ClientCnxnSocketNIO.doIO(ClientCnxnSocketNIO.java:77) ~[zookeeper-3.6.2.jar:3.6.2]
[junit4] 2> at org.apache.zookeeper.ClientCnxnSocketNIO.doTransport(ClientCnxnSocketNIO.java:350) ~[zookeeper-3.6.2.jar:3.6.2]
[junit4] 2> at org.apache.zookeeper.ClientCnxn$SendThread.run(ClientCnxn.java:1275) [zookeeper-3.6.2.jar:3.6.2]
[junit4] 2> 1474976 INFO (TEST-TestCloudSearcherWarming.testPeersyncFailureReplicationSuccess-seed#[6F8C1F8AD10722DA]) [n:127.0.0.1:33169_solr ] o.a.s.c.c.ConnectionManager Waiting for client to connect to ZooKeeper
[junit4] 2> 1474977 INFO (zkConnectionManagerCallback-12858-thread-1) [ ] o.a.s.c.c.ConnectionManager zkClient has connected
[junit4] 2> 1474977 INFO (TEST-TestCloudSearcherWarming.testPeersyncFailureReplicationSuccess-seed#[6F8C1F8AD10722DA]) [n:127.0.0.1:33169_solr ] o.a.s.c.c.ConnectionManager Client is connected to ZooKeeper
[junit4] 2> 1474981 WARN (TEST-TestCloudSearcherWarming.testPeersyncFailureReplicationSuccess-seed#[6F8C1F8AD10722DA]) [n:127.0.0.1:33169_solr ] o.a.s.c.ZkController Contents of zookeeper /security.json are world-readable; consider setting up ACLs as described in https://solr.apache.org/guide/zookeeper-access-control.html
[junit4] 2> 1474982 INFO (TEST-TestCloudSearcherWarming.testPeersyncFailureReplicationSuccess-seed#[6F8C1F8AD10722DA]) [n:127.0.0.1:33169_solr ] o.a.s.c.c.ZkStateReader Updated live nodes from ZooKeeper... (0) -> (1)
[junit4] 2> 1474985 INFO (TEST-TestCloudSearcherWarming.testPeersyncFailureReplicationSuccess-seed#[6F8C1F8AD10722DA]) [n:127.0.0.1:33169_solr ] o.a.s.c.ZkController Publish node=127.0.0.1:33169_solr as DOWN
[junit4] 2> 1474986 INFO (TEST-TestCloudSearcherWarming.testPeersyncFailureReplicationSuccess-seed#[6F8C1F8AD10722DA]) [n:127.0.0.1:33169_solr ] o.a.s.c.TransientSolrCoreCacheDefault Allocating transient core cache for max 2147483647 cores with initial capacity of 1024
[junit4] 2> 1474986 INFO (TEST-TestCloudSearcherWarming.testPeersyncFailureReplicationSuccess-seed#[6F8C1F8AD10722DA]) [n:127.0.0.1:33169_solr ] o.a.s.c.ZkController Register node as live in ZooKeeper:/live_nodes/127.0.0.1:33169_solr
[junit4] 2> 1474987 INFO (zkCallback-12813-thread-4) [ ] o.a.s.c.c.ZkStateReader Updated live nodes from ZooKeeper... (1) -> (2)
[junit4] 2> 1474987 INFO (zkCallback-12828-thread-1) [ ] o.a.s.c.c.ZkStateReader Updated live nodes from ZooKeeper... (1) -> (2)
[junit4] 2> 1474987 INFO (zkCallback-12857-thread-1) [ ] o.a.s.c.c.ZkStateReader Updated live nodes from ZooKeeper... (1) -> (2)
[junit4] 2> 1474988 INFO (TEST-TestCloudSearcherWarming.testPeersyncFailureReplicationSuccess-seed#[6F8C1F8AD10722DA]) [n:127.0.0.1:33169_solr ] o.a.s.p.PackageLoader /packages.json updated to version -1
[junit4] 2> 1474989 WARN (TEST-TestCloudSearcherWarming.testPeersyncFailureReplicationSuccess-seed#[6F8C1F8AD10722DA]) [n:127.0.0.1:33169_solr ] o.a.s.c.CoreContainer Not all security plugins configured! authentication=disabled authorization=disabled. Solr is only as secure as you make it. Consider configuring authentication/authorization before exposing Solr to users internal or external. See https://s.apache.org/solrsecurity for more info
[junit4] 2> 1475003 INFO (TEST-TestCloudSearcherWarming.testPeersyncFailureReplicationSuccess-seed#[6F8C1F8AD10722DA]) [n:127.0.0.1:33169_solr ] o.a.s.c.CorePropertiesLocator Found 0 core definitions underneath /home/jenkins/jenkins-slave/workspace/Lucene/Lucene-Solr-Tests-8.x/solr/build/solr-core/test/J0/temp/solr.cloud.TestCloudSearcherWarming_6F8C1F8AD10722DA-001/tempDir-001/node2
[junit4] 2> 1475011 INFO (TEST-TestCloudSearcherWarming.testPeersyncFailureReplicationSuccess-seed#[6F8C1F8AD10722DA]) [ ] o.a.s.c.MiniSolrCloudCluster waitForAllNodes: numServers=2
[junit4] 2> 1475038 INFO (OverseerThreadFactory-12821-thread-2-processing-n:127.0.0.1:37177_solr) [n:127.0.0.1:37177_solr c:testPeersyncFailureReplicationSuccess s:shard1 ] o.a.s.c.a.c.AddReplicaCmd Node Identified 127.0.0.1:33169_solr for creating new replica of shard shard1 for collection testPeersyncFailureReplicationSuccess
[junit4] 2> 1475039 INFO (OverseerCollectionConfigSetProcessor-72129272169365509-127.0.0.1:37177_solr-n_0000000000) [n:127.0.0.1:37177_solr ] o.a.s.c.OverseerTaskQueue Response ZK path: /overseer/collection-queue-work/qnr-0000000000 doesn't exist. Requestor may have disconnected from ZooKeeper
[junit4] 2> 1475039 INFO (OverseerThreadFactory-12821-thread-2-processing-n:127.0.0.1:37177_solr) [n:127.0.0.1:37177_solr c:testPeersyncFailureReplicationSuccess s:shard1 ] o.a.s.c.a.c.AddReplicaCmd Returning CreateReplica command.
[junit4] 2> 1475041 INFO (OverseerStateUpdate-72129272169365509-127.0.0.1:37177_solr-n_0000000000) [n:127.0.0.1:37177_solr ] o.a.s.c.o.SliceMutator createReplica() {
[junit4] 2> "core":"testPeersyncFailureReplicationSuccess_shard1_replica_n3",
[junit4] 2> "node_name":"127.0.0.1:33169_solr",
[junit4] 2> "base_url":"https://127.0.0.1:33169/solr",
[junit4] 2> "collection":"testPeersyncFailureReplicationSuccess",
[junit4] 2> "shard":"shard1",
[junit4] 2> "state":"down",
[junit4] 2> "type":"NRT",
[junit4] 2> "operation":"addreplica"}
[junit4] 2> 1475143 INFO (zkCallback-12828-thread-1) [ ] o.a.s.c.c.ZkStateReader A cluster state change: [WatchedEvent state:SyncConnected type:NodeDataChanged path:/collections/testPeersyncFailureReplicationSuccess/state.json] for collection [testPeersyncFailureReplicationSuccess] has occurred - updating... (live nodes size: [2])
[junit4] 2> 1475143 INFO (zkCallback-12813-thread-4) [ ] o.a.s.c.c.ZkStateReader A cluster state change: [WatchedEvent state:SyncConnected type:NodeDataChanged path:/collections/testPeersyncFailureReplicationSuccess/state.json] for collection [testPeersyncFailureReplicationSuccess] has occurred - updating... (live nodes size: [2])
[junit4] 2> 1475143 INFO (zkCallback-12813-thread-3) [ ] o.a.s.c.c.ZkStateReader A cluster state change: [WatchedEvent state:SyncConnected type:NodeDataChanged path:/collections/testPeersyncFailureReplicationSuccess/state.json] for collection [testPeersyncFailureReplicationSuccess] has occurred - updating... (live nodes size: [2])
[junit4] 2> 1475143 INFO (zkCallback-12813-thread-1) [ ] o.a.s.c.c.ZkStateReader A cluster state change: [WatchedEvent state:SyncConnected type:NodeDataChanged path:/collections/testPeersyncFailureReplicationSuccess/state.json] for collection [testPeersyncFailureReplicationSuccess] has occurred - updating... (live nodes size: [2])
[junit4] 2> 1475143 INFO (zkCallback-12828-thread-2) [ ] o.a.s.c.c.ZkStateReader A cluster state change: [WatchedEvent state:SyncConnected type:NodeDataChanged path:/collections/testPeersyncFailureReplicationSuccess/state.json] for collection [testPeersyncFailureReplicationSuccess] has occurred - updating... (live nodes size: [2])
[junit4] 2> 1475269 INFO (qtp658191519-20367) [n:127.0.0.1:33169_solr x:testPeersyncFailureReplicationSuccess_shard1_replica_n3 ] o.a.s.h.a.CoreAdminOperation core create command qt=/admin/cores&coreNodeName=core_node4&collection.configName=testPeersyncFailureReplicationSuccess.AUTOCREATED&name=testPeersyncFailureReplicationSuccess_shard1_replica_n3&action=CREATE&collection=testPeersyncFailureReplicationSuccess&shard=shard1&wt=javabin&version=2&replicaType=NRT
[junit4] 2> 1475281 INFO (qtp658191519-20367) [n:127.0.0.1:33169_solr c:testPeersyncFailureReplicationSuccess s:shard1 r:core_node4 x:testPeersyncFailureReplicationSuccess_shard1_replica_n3 ] o.a.s.c.SolrConfig Using Lucene MatchVersion: 8.10.0
[junit4] 2> 1475281 WARN (qtp658191519-20367) [n:127.0.0.1:33169_solr c:testPeersyncFailureReplicationSuccess s:shard1 r:core_node4 x:testPeersyncFailureReplicationSuccess_shard1_replica_n3 ] o.a.s.c.SolrConfig solrconfig.xml: <jmx> is no longer supported, use solr.xml:/metrics/reporter section instead
[junit4] 2> 1475285 INFO (qtp658191519-20367) [n:127.0.0.1:33169_solr c:testPeersyncFailureReplicationSuccess s:shard1 r:core_node4 x:testPeersyncFailureReplicationSuccess_shard1_replica_n3 ] o.a.s.s.IndexSchema Schema name=default-config
[junit4] 2> 1475322 INFO (qtp658191519-20367) [n:127.0.0.1:33169_solr c:testPeersyncFailureReplicationSuccess s:shard1 r:core_node4 x:testPeersyncFailureReplicationSuccess_shard1_replica_n3 ] o.a.s.s.IndexSchema Loaded schema default-config/1.6 with uniqueid field id
[junit4] 2> 1475352 INFO (qtp658191519-20367) [n:127.0.0.1:33169_solr c:testPeersyncFailureReplicationSuccess s:shard1 r:core_node4 x:testPeersyncFailureReplicationSuccess_shard1_replica_n3 ] o.a.s.c.CoreContainer Creating SolrCore 'testPeersyncFailureReplicationSuccess_shard1_replica_n3' using configuration from configset testPeersyncFailureReplicationSuccess.AUTOCREATED, trusted=true
[junit4] 2> 1475352 INFO (qtp658191519-20367) [n:127.0.0.1:33169_solr c:testPeersyncFailureReplicationSuccess s:shard1 r:core_node4 x:testPeersyncFailureReplicationSuccess_shard1_replica_n3 ] o.a.s.c.SolrCore [[testPeersyncFailureReplicationSuccess_shard1_replica_n3] ] Opening new SolrCore at [/home/jenkins/jenkins-slave/workspace/Lucene/Lucene-Solr-Tests-8.x/solr/build/solr-core/test/J0/temp/solr.cloud.TestCloudSearcherWarming_6F8C1F8AD10722DA-001/tempDir-001/node2/testPeersyncFailureReplicationSuccess_shard1_replica_n3], dataDir=[/home/jenkins/jenkins-slave/workspace/Lucene/Lucene-Solr-Tests-8.x/solr/build/solr-core/test/J0/temp/solr.cloud.TestCloudSearcherWarming_6F8C1F8AD10722DA-001/tempDir-001/node2/testPeersyncFailureReplicationSuccess_shard1_replica_n3/data/]
[junit4] 2> 1475375 INFO (zkCallback-12813-thread-1) [ ] o.a.s.c.c.ZkStateReader A cluster state change: [WatchedEvent state:SyncConnected type:NodeDataChanged path:/collections/testPeersyncFailureReplicationSuccess/state.json] for collection [testPeersyncFailureReplicationSuccess] has occurred - updating... (live nodes size: [2])
[junit4] 2> 1475375 INFO (zkCallback-12828-thread-1) [ ] o.a.s.c.c.ZkStateReader A cluster state change: [WatchedEvent state:SyncConnected type:NodeDataChanged path:/collections/testPeersyncFailureReplicationSuccess/state.json] for collection [testPeersyncFailureReplicationSuccess] has occurred - updating... (live nodes size: [2])
[junit4] 2> 1475375 INFO (zkCallback-12828-thread-2) [ ] o.a.s.c.c.ZkStateReader A cluster state change: [WatchedEvent state:SyncConnected type:NodeDataChanged path:/collections/testPeersyncFailureReplicationSuccess/state.json] for collection [testPeersyncFailureReplicationSuccess] has occurred - updating... (live nodes size: [2])
[junit4] 2> 1475375 INFO (zkCallback-12813-thread-4) [ ] o.a.s.c.c.ZkStateReader A cluster state change: [WatchedEvent state:SyncConnected type:NodeDataChanged path:/collections/testPeersyncFailureReplicationSuccess/state.json] for collection [testPeersyncFailureReplicationSuccess] has occurred - updating... (live nodes size: [2])
[junit4] 2> 1475375 INFO (zkCallback-12813-thread-3) [ ] o.a.s.c.c.ZkStateReader A cluster state change: [WatchedEvent state:SyncConnected type:NodeDataChanged path:/collections/testPeersyncFailureReplicationSuccess/state.json] for collection [testPeersyncFailureReplicationSuccess] has occurred - updating... (live nodes size: [2])
[junit4] 2> 1475410 INFO (qtp658191519-20367) [n:127.0.0.1:33169_solr c:testPeersyncFailureReplicationSuccess s:shard1 r:core_node4 x:testPeersyncFailureReplicationSuccess_shard1_replica_n3 ] o.a.s.u.UpdateHandler Using UpdateLog implementation: org.apache.solr.update.UpdateLog
[junit4] 2> 1475410 INFO (qtp658191519-20367) [n:127.0.0.1:33169_solr c:testPeersyncFailureReplicationSuccess s:shard1 r:core_node4 x:testPeersyncFailureReplicationSuccess_shard1_replica_n3 ] o.a.s.u.UpdateLog Initializing UpdateLog: dataDir= defaultSyncLevel=FLUSH numRecordsToKeep=100 maxNumLogsToKeep=10 numVersionBuckets=65536
[junit4] 2> 1475410 INFO (qtp658191519-20367) [n:127.0.0.1:33169_solr c:testPeersyncFailureReplicationSuccess s:shard1 r:core_node4 x:testPeersyncFailureReplicationSuccess_shard1_replica_n3 ] o.a.s.u.CommitTracker Hard AutoCommit: if uncommitted for 15000ms;
[junit4] 2> 1475410 INFO (qtp658191519-20367) [n:127.0.0.1:33169_solr c:testPeersyncFailureReplicationSuccess s:shard1 r:core_node4 x:testPeersyncFailureReplicationSuccess_shard1_replica_n3 ] o.a.s.u.CommitTracker Soft AutoCommit: disabled
[junit4] 2> 1475413 INFO (qtp658191519-20367) [n:127.0.0.1:33169_solr c:testPeersyncFailureReplicationSuccess s:shard1 r:core_node4 x:testPeersyncFailureReplicationSuccess_shard1_replica_n3 ] o.a.s.r.ManagedResourceStorage Configured ZooKeeperStorageIO with znodeBase: /configs/testPeersyncFailureReplicationSuccess.AUTOCREATED
[junit4] 2> 1475413 INFO (qtp658191519-20367) [n:127.0.0.1:33169_solr c:testPeersyncFailureReplicationSuccess s:shard1 r:core_node4 x:testPeersyncFailureReplicationSuccess_shard1_replica_n3 ] o.a.s.r.ManagedResourceStorage Loaded null at path _rest_managed.json using ZooKeeperStorageIO:path=/configs/testPeersyncFailureReplicationSuccess.AUTOCREATED
[junit4] 2> 1475413 INFO (qtp658191519-20367) [n:127.0.0.1:33169_solr c:testPeersyncFailureReplicationSuccess s:shard1 r:core_node4 x:testPeersyncFailureReplicationSuccess_shard1_replica_n3 ] o.a.s.s.ZkIndexSchemaReader Creating ZooKeeper watch for the managed schema at /configs/testPeersyncFailureReplicationSuccess.AUTOCREATED/managed-schema
[junit4] 2> 1475414 INFO (qtp658191519-20367) [n:127.0.0.1:33169_solr c:testPeersyncFailureReplicationSuccess s:shard1 r:core_node4 x:testPeersyncFailureReplicationSuccess_shard1_replica_n3 ] o.a.s.s.ZkIndexSchemaReader Current schema version 0 is already the latest
[junit4] 2> 1475414 INFO (qtp658191519-20367) [n:127.0.0.1:33169_solr c:testPeersyncFailureReplicationSuccess s:shard1 r:core_node4 x:testPeersyncFailureReplicationSuccess_shard1_replica_n3 ] o.a.s.h.c.SpellCheckComponent Initializing spell checkers
[junit4] 2> 1475414 INFO (qtp658191519-20367) [n:127.0.0.1:33169_solr c:testPeersyncFailureReplicationSuccess s:shard1 r:core_node4 x:testPeersyncFailureReplicationSuccess_shard1_replica_n3 ] o.a.s.s.DirectSolrSpellChecker init: {name=default,field=_text_,classname=solr.DirectSolrSpellChecker,distanceMeasure=internal,accuracy=0.5,maxQueryFrequency=0.01,maxEdits=2,minPrefix=1,maxInspections=5,minQueryLength=4}
[junit4] 2> 1475415 INFO (qtp658191519-20367) [n:127.0.0.1:33169_solr c:testPeersyncFailureReplicationSuccess s:shard1 r:core_node4 x:testPeersyncFailureReplicationSuccess_shard1_replica_n3 ] o.a.s.h.ReplicationHandler Commits will be reserved for 10000 ms
[junit4] 2> 1475415 INFO (qtp658191519-20367) [n:127.0.0.1:33169_solr c:testPeersyncFailureReplicationSuccess s:shard1 r:core_node4 x:testPeersyncFailureReplicationSuccess_shard1_replica_n3 ] o.a.s.u.UpdateLog Could not find max version in index or recent updates, using new clock 1706436175177187328
[junit4] 2> 1475417 INFO (searcherExecutor-12866-thread-1-processing-n:127.0.0.1:33169_solr x:testPeersyncFailureReplicationSuccess_shard1_replica_n3 c:testPeersyncFailureReplicationSuccess s:shard1 r:core_node4) [n:127.0.0.1:33169_solr c:testPeersyncFailureReplicationSuccess s:shard1 r:core_node4 x:testPeersyncFailureReplicationSuccess_shard1_replica_n3 ] o.a.s.c.QuerySenderListener QuerySenderListener done.
[junit4] 2> 1475417 INFO (searcherExecutor-12866-thread-1-processing-n:127.0.0.1:33169_solr x:testPeersyncFailureReplicationSuccess_shard1_replica_n3 c:testPeersyncFailureReplicationSuccess s:shard1 r:core_node4) [n:127.0.0.1:33169_solr c:testPeersyncFailureReplicationSuccess s:shard1 r:core_node4 x:testPeersyncFailureReplicationSuccess_shard1_replica_n3 ] o.a.s.c.TestCloudSearcherWarming Sleeping for 5000 on newSearcher: Searcher@2b4eead7[testPeersyncFailureReplicationSuccess_shard1_replica_n3] main{ExitableDirectoryReader(UninvertingDirectoryReader())}, currentSearcher: null belonging to (newest) core: testPeersyncFailureReplicationSuccess_shard1_replica_n3, id: org.apache.solr.core.SolrCore@23a4090
[junit4] 2> 1475421 INFO (qtp658191519-20367) [n:127.0.0.1:33169_solr c:testPeersyncFailureReplicationSuccess s:shard1 r:core_node4 x:testPeersyncFailureReplicationSuccess_shard1_replica_n3 ] o.a.s.c.ZkShardTerms Successful update of terms at /collections/testPeersyncFailureReplicationSuccess/terms/shard1 to Terms{values={core_node2=1, core_node4=0}, version=2}
[junit4] 2> 1475421 INFO (qtp658191519-20367) [n:127.0.0.1:33169_solr c:testPeersyncFailureReplicationSuccess s:shard1 r:core_node4 x:testPeersyncFailureReplicationSuccess_shard1_replica_n3 ] o.a.s.c.ShardLeaderElectionContextBase make sure parent is created /collections/testPeersyncFailureReplicationSuccess/leaders/shard1
[junit4] 2> 1475425 INFO (qtp658191519-20367) [n:127.0.0.1:33169_solr c:testPeersyncFailureReplicationSuccess s:shard1 r:core_node4 x:testPeersyncFailureReplicationSuccess_shard1_replica_n3 ] o.a.s.c.ZkController Core needs to recover:testPeersyncFailureReplicationSuccess_shard1_replica_n3
[junit4] 2> 1475426 INFO (updateExecutor-12852-thread-1-processing-n:127.0.0.1:33169_solr x:testPeersyncFailureReplicationSuccess_shard1_replica_n3 c:testPeersyncFailureReplicationSuccess s:shard1 r:core_node4) [n:127.0.0.1:33169_solr c:testPeersyncFailureReplicationSuccess s:shard1 r:core_node4 x:testPeersyncFailureReplicationSuccess_shard1_replica_n3 ] o.a.s.u.DefaultSolrCoreState Running recovery
[junit4] 2> 1475426 INFO (recoveryExecutor-12854-thread-1-processing-n:127.0.0.1:33169_solr x:testPeersyncFailureReplicationSuccess_shard1_replica_n3 c:testPeersyncFailureReplicationSuccess s:shard1 r:core_node4) [n:127.0.0.1:33169_solr c:testPeersyncFailureReplicationSuccess s:shard1 r:core_node4 x:testPeersyncFailureReplicationSuccess_shard1_replica_n3 ] o.a.s.c.RecoveryStrategy Starting recovery process. recoveringAfterStartup=true
[junit4] 2> 1475426 INFO (recoveryExecutor-12854-thread-1-processing-n:127.0.0.1:33169_solr x:testPeersyncFailureReplicationSuccess_shard1_replica_n3 c:testPeersyncFailureReplicationSuccess s:shard1 r:core_node4) [n:127.0.0.1:33169_solr c:testPeersyncFailureReplicationSuccess s:shard1 r:core_node4 x:testPeersyncFailureReplicationSuccess_shard1_replica_n3 ] o.a.s.c.RecoveryStrategy startupVersions is
[...truncated too long message...]
981-thread-1) [ ] o.a.s.c.CoreContainer Shutting down CoreContainer instance=451936707
[junit4] 2> 1494153 INFO (jetty-closer-12981-thread-1) [ ] o.a.s.c.ZkController Remove node as live in ZooKeeper:/live_nodes/127.0.0.1:39431_solr
[junit4] 2> 1494153 INFO (jetty-closer-12981-thread-1) [ ] o.a.s.c.ZkController Publish this node as DOWN...
[junit4] 2> 1494153 INFO (jetty-closer-12981-thread-1) [ ] o.a.s.c.ZkController Publish node=127.0.0.1:39431_solr as DOWN
[junit4] 2> 1494155 INFO (jetty-closer-12981-thread-1) [ ] o.a.s.m.SolrMetricManager Closing metric reporters for registry=solr.node tag=null
[junit4] 2> 1494155 INFO (jetty-closer-12981-thread-1) [ ] o.a.s.m.SolrMetricManager Closing metric reporters for registry=solr.jvm tag=null
[junit4] 2> 1494155 INFO (jetty-closer-12981-thread-1) [ ] o.a.s.m.SolrMetricManager Closing metric reporters for registry=solr.jetty tag=null
[junit4] 2> 1494155 INFO (jetty-closer-12981-thread-1) [ ] o.a.s.m.SolrMetricManager Closing metric reporters for registry=solr.cluster tag=null
[junit4] 2> 1494156 INFO (closeThreadPool-12986-thread-2) [ ] o.a.s.c.Overseer Overseer (id=72129273287409673-127.0.0.1:39431_solr-n_0000000001) closing
[junit4] 2> 1494156 INFO (OverseerStateUpdate-72129273287409673-127.0.0.1:39431_solr-n_0000000001) [n:127.0.0.1:39431_solr ] o.a.s.c.Overseer Overseer Loop exiting : 127.0.0.1:39431_solr
[junit4] 2> 1494162 INFO (OverseerAutoScalingTriggerThread-72129273287409673-127.0.0.1:39431_solr-n_0000000001) [ ] o.a.s.c.a.OverseerTriggerThread OverseerTriggerThread woken up but we are closed, exiting.
[junit4] 2> 1494164 INFO (closeThreadPool-12986-thread-1) [ ] o.a.s.c.Overseer Overseer (id=72129273287409673-127.0.0.1:39431_solr-n_0000000001) closing
[junit4] 2> 1494263 INFO (jetty-closer-12981-thread-1) [ ] o.a.s.c.Overseer Overseer (id=72129273287409673-127.0.0.1:39431_solr-n_0000000001) closing
[junit4] 2> 1494264 INFO (jetty-closer-12981-thread-1) [ ] o.e.j.s.AbstractConnector Stopped ServerConnector@42885b2a{SSL, (ssl, http/1.1)}{127.0.0.1:39431}
[junit4] 2> 1494265 INFO (jetty-closer-12981-thread-1) [ ] o.e.j.s.h.ContextHandler Stopped o.e.j.s.ServletContextHandler@407b8dbe{/solr,null,STOPPED}
[junit4] 2> 1494265 INFO (jetty-closer-12981-thread-1) [ ] o.e.j.s.session node0 Stopped scavenging
[junit4] 2> 1494265 INFO (TEST-TestCloudSearcherWarming.testRepFactor1LeaderStartup-seed#[6F8C1F8AD10722DA]) [ ] o.a.s.c.ZkTestServer Shutting down ZkTestServer.
[junit4] 2> 1494272 WARN (TEST-TestCloudSearcherWarming.testRepFactor1LeaderStartup-seed#[6F8C1F8AD10722DA]-SendThread(127.0.0.1:40341)) [ ] o.a.z.ClientCnxn An exception was thrown while closing send thread for session 0x100413120340000.
[junit4] 2> => EndOfStreamException: Unable to read additional data from server sessionid 0x100413120340000, likely server has closed socket
[junit4] 2> at org.apache.zookeeper.ClientCnxnSocketNIO.doIO(ClientCnxnSocketNIO.java:77)
[junit4] 2> org.apache.zookeeper.ClientCnxn$EndOfStreamException: Unable to read additional data from server sessionid 0x100413120340000, likely server has closed socket
[junit4] 2> at org.apache.zookeeper.ClientCnxnSocketNIO.doIO(ClientCnxnSocketNIO.java:77) ~[zookeeper-3.6.2.jar:3.6.2]
[junit4] 2> at org.apache.zookeeper.ClientCnxnSocketNIO.doTransport(ClientCnxnSocketNIO.java:350) ~[zookeeper-3.6.2.jar:3.6.2]
[junit4] 2> at org.apache.zookeeper.ClientCnxn$SendThread.run(ClientCnxn.java:1275) [zookeeper-3.6.2.jar:3.6.2]
[junit4] 2> 1494475 WARN (ZkTestServer Run Thread) [ ] o.a.s.c.ZkTestServer Watch limit violations:
[junit4] 2> Maximum concurrent create/delete watches above limit:
[junit4] 2>
[junit4] 2> 5 /solr/collections/testRepFactor1LeaderStartup/terms/shard1
[junit4] 2> 4 /solr/aliases.json
[junit4] 2> 4 /solr/collections/testRepFactor1LeaderStartup/state.json
[junit4] 2> 3 /solr/configs/testRepFactor1LeaderStartup.AUTOCREATED/managed-schema
[junit4] 2> 3 /solr/configs/testRepFactor1LeaderStartup.AUTOCREATED
[junit4] 2> 2 /solr/packages.json
[junit4] 2> 2 /solr/security.json
[junit4] 2>
[junit4] 2> Maximum concurrent data watches above limit:
[junit4] 2>
[junit4] 2> 21 /solr/collections/testRepFactor1LeaderStartup/state.json
[junit4] 2> 4 /solr/clusterstate.json
[junit4] 2> 4 /solr/clusterprops.json
[junit4] 2> 3 /solr/aliases.json
[junit4] 2> 2 /solr/autoscaling.json
[junit4] 2>
[junit4] 2> Maximum concurrent children watches above limit:
[junit4] 2>
[junit4] 2> 20 /solr/overseer/queue
[junit4] 2> 13 /solr/overseer/collection-queue-work
[junit4] 2> 11 /solr/collections/testRepFactor1LeaderStartup/state.json
[junit4] 2> 9 /solr/collections
[junit4] 2> 8 /solr/live_nodes
[junit4] 2> 2 /solr/autoscaling/events/.scheduled_maintenance
[junit4] 2> 2 /solr/autoscaling/events/.auto_add_replicas
[junit4] 2> 2 /solr/overseer/queue-work
[junit4] 2>
[junit4] 2> 1494478 INFO (TEST-TestCloudSearcherWarming.testRepFactor1LeaderStartup-seed#[6F8C1F8AD10722DA]) [ ] o.a.s.c.ZkTestServer waitForServerDown: 127.0.0.1:40341
[junit4] 2> 1494478 INFO (TEST-TestCloudSearcherWarming.testRepFactor1LeaderStartup-seed#[6F8C1F8AD10722DA]) [ ] o.a.s.c.ZkTestServer parse host and port list: 127.0.0.1:40341
[junit4] 2> 1494478 INFO (TEST-TestCloudSearcherWarming.testRepFactor1LeaderStartup-seed#[6F8C1F8AD10722DA]) [ ] o.a.s.c.ZkTestServer connecting to 127.0.0.1 40341
[junit4] 2> 1494479 INFO (TEST-TestCloudSearcherWarming.testRepFactor1LeaderStartup-seed#[6F8C1F8AD10722DA]) [ ] o.a.s.SolrTestCaseJ4 ###Ending testRepFactor1LeaderStartup
[junit4] 2> NOTE: leaving temporary files on disk at: /home/jenkins/jenkins-slave/workspace/Lucene/Lucene-Solr-Tests-8.x/solr/build/solr-core/test/J0/temp/solr.cloud.TestCloudSearcherWarming_6F8C1F8AD10722DA-001
[junit4] 2> Jul 27, 2021 11:12:52 AM com.carrotsearch.randomizedtesting.ThreadLeakControl checkThreadLeaks
[junit4] 2> WARNING: Will linger awaiting termination of 1 leaked thread(s).
[junit4] 2> NOTE: test params are: codec=CheapBastard, sim=Asserting(RandomSimilarity(queryNorm=true): {}), locale=ru-RU, timezone=Etc/Zulu
[junit4] 2> NOTE: Linux 4.15.0-147-generic amd64/Oracle Corporation 1.8.0_291 (64-bit)/cpus=4,threads=1,free=164070200,total=483393536
[junit4] 2> NOTE: All tests run in this JVM: [TestSimLargeCluster, TestPullReplica, ClusterStateMockUtilTest, TestMaxScoreQueryParser, MetricsHistoryIntegrationTest, TestRandomCollapseQParserPlugin, TestNoOpRegenerator, LukeRequestHandlerTest, RecoveryZkTest, PrimitiveFieldTypeTest, TestDistribDocBasedVersion, TestFieldCacheSortRandom, TestXIncludeConfig, TestCustomSort, TestAuthorizationFramework, RouteFieldTest, AnalyticsMergeStrategyTest, HighlighterConfigTest, TestCodecSupport, V2ApiIntegrationTest, TestPostingsSolrHighlighter, TestOrdValues, TestSearchPerf, TestTrieFacet, ConjunctionSolrSpellCheckerTest, UUIDUpdateProcessorFallbackTest, TestPerFieldSimilarityWithDefaultOverride, JWTVerificationkeyResolverTest, PathHierarchyTokenizerFactoryTest, SchemaVersionSpecificBehaviorTest, BufferStoreTest, ZkControllerTest, CollectionReloadTest, TestFoldingMultitermQuery, TestCollationField, DistributedFacetSimpleRefinementLongTailTest, TestHighlightDedupGrouping, AggValueSourceTest, DimensionalRoutedAliasUpdateProcessorTest, DocValuesTest, TestApiFramework, PropertiesRequestHandlerTest, BigEndianAscendingWordDeserializerTest, TestNumericTerms32, HdfsUnloadDistributedZkTest, ConcurrentCreateCollectionTest, TestSQLHandler, TestCloudPivotFacet, TemplateUpdateProcessorTest, BaseCdcrDistributedZkTest, OverriddenZkACLAndCredentialsProvidersTest, TestLockTree, PhrasesIdentificationComponentTest, TestPartialUpdateDeduplication, DistributedVersionInfoTest, NoCacheHeaderTest, HdfsChaosMonkeySafeLeaderTest, LeaderElectionContextKeyTest, TestJettySolrRunner, SpellCheckCollatorTest, AliasIntegrationTest, TestWaitForStateWithJettyShutdowns, TestTextField, DeleteNodeTest, BlockJoinFacetDistribTest, DistanceUnitsTest, AnalysisErrorHandlingTest, PeerSyncWithIndexFingerprintCachingTest, UninvertDocValuesMergePolicyTest, TestBinaryResponseWriter, TestSSLRandomization, OverseerSolrResponseTest, UpdateLogTest, TestRandomFlRTGCloud, TriggerSetPropertiesIntegrationTest, TestLegacyTerms, ReplaceNodeTest, RuleEngineTest, SoftAutoCommitTest, TestSuggestSpellingConverter, TestMacroExpander, TestJsonFacets, TestConfigSetImmutable, SolrSlf4jReporterTest, AuthToolTest, TriLevelCompositeIdRoutingTest, TestZkAclsWithHadoopAuth, TestSimScenario, TestSolrDeletionPolicy1, MultiThreadedOCPTest, TestLuceneMatchVersion, AuditLoggerIntegrationTest, OverseerTest, TestBlendedInfixSuggestions, BasicAuthStandaloneTest, QueryEqualityTest, TestIndexingPerformance, TestRawResponseWriter, DistributedFacetExistsSmallTest, TestStandardQParsers, TestCloudJSONFacetSKG, SolrTestCaseJ4Test, BasicZkTest, TestRecovery, TestInitParams, ThreadDumpHandlerTest, ZkCollectionPropsCachingTest, DistributedFacetPivotSmallTest, TestSolrFieldCacheBean, TestScoreJoinQPScore, TestGraphMLResponseWriter, AdminHandlersProxyTest, TestDynamicLoadingUrl, MetricsDisabledCloudTest, DistributedQueryComponentOptimizationTest, SliceStateTest, TestEmbeddedSolrServerSchemaAPI, ChaosMonkeySafeLeaderWithPullReplicasTest, ConcurrentCreateRoutedAliasTest, ConnectionManagerTest, CreateCollectionCleanupTest, CreateRoutedAliasTest, DeleteLastCustomShardedReplicaTest, DistribCursorPagingTest, FullSolrCloudDistribCmdsTest, HttpPartitionTest, TestCloudDeleteByQuery, TestCloudSearcherWarming]
[junit4] Completed [537/940 (1!)] on J0 in 23.77s, 2 tests, 1 error <<< FAILURES!
[...truncated 53968 lines...]