You are viewing a plain text version of this content. The canonical link for it is here.
Posted to dev@juneau.apache.org by Apache Jenkins Server <je...@builds.apache.org> on 2017/10/22 20:12:34 UTC
Build failed in Jenkins: Juneau-Java-1.8 #568
See <https://builds.apache.org/job/Juneau-Java-1.8/568/display/redirect?page=changes>
Changes:
[jamesbognar] [maven-release-plugin] prepare release juneau-7.0.0-RC1
------------------------------------------
Started by an SCM change
[EnvInject] - Loading node environment variables.
Building remotely on ubuntu-6 (ubuntu trusty) in workspace <https://builds.apache.org/job/Juneau-Java-1.8/ws/>
> git rev-parse --is-inside-work-tree # timeout=10
Fetching changes from the remote Git repository
> git config remote.origin.url https://git-wip-us.apache.org/repos/asf/juneau.git # timeout=10
Fetching upstream changes from https://git-wip-us.apache.org/repos/asf/juneau.git
> git --version # timeout=10
> git fetch --tags --progress https://git-wip-us.apache.org/repos/asf/juneau.git +refs/heads/*:refs/remotes/origin/*
> git rev-parse refs/remotes/origin/master^{commit} # timeout=10
> git rev-parse refs/remotes/origin/origin/master^{commit} # timeout=10
Checking out Revision 8b4740edccd65e7f5e09b3d01498fb89b0c8d479 (refs/remotes/origin/master)
Commit message: "[maven-release-plugin] prepare release juneau-7.0.0-RC1"
> git config core.sparsecheckout # timeout=10
> git checkout -f 8b4740edccd65e7f5e09b3d01498fb89b0c8d479
> git rev-list de67768d444716c5c2259ebdeaa5969ec7e04c3e # timeout=10
[Juneau-Java-1.8] $ /home/jenkins/tools/maven/apache-maven-3.2.5/bin/mvn clean install deploy
[INFO] Scanning for projects...
[INFO] ------------------------------------------------------------------------
[INFO] Reactor Build Order:
[INFO]
[INFO] Apache Juneau
[INFO] Apache Juneau - Core APIs
[INFO] Apache Juneau Marshall
[INFO] Apache Juneau Marshal RDF
[INFO] Apache Juneau Data Transfer Objects
[INFO] Apache Juneau Core
[INFO] Apache Juneau Config File API
[INFO] Apache Juneau Core Tests
[INFO] Apache Juneau - REST APIs
[INFO] Apache Juneau REST Servlet API
[INFO] Apache Juneau REST JAX/RS API
[INFO] Apache Juneau REST Client API
[INFO] Apache Juneau - Microservice APIs
[INFO] Apache Juneau Microservice Server
[INFO] Apache Juneau Microservice Template
[INFO] Apache Juneau - Examples
[INFO] Apache Juneau REST Examples
[INFO] Apache Juneau Microservice Tests
[INFO] Apache Juneau Core Examples
[INFO] Apache Juneau Javadocs
[INFO] Apache Juneau - Release Engineering
[INFO] Apache Juneau UberJar
[INFO] Apache Juneau Distribution
[INFO]
[INFO] ------------------------------------------------------------------------
[INFO] Building Apache Juneau 7.0.0
[INFO] ------------------------------------------------------------------------
[INFO]
[INFO] --- maven-clean-plugin:3.0.0:clean (default-clean) @ juneau ---
[INFO] Deleting <https://builds.apache.org/job/Juneau-Java-1.8/ws/target>
[INFO]
[INFO] --- maven-enforcer-plugin:1.4.1:enforce (enforce-maven) @ juneau ---
[INFO]
[INFO] --- maven-remote-resources-plugin:1.5:process (process-resource-bundles) @ juneau ---
[INFO]
[INFO] --- maven-site-plugin:3.5.1:attach-descriptor (attach-descriptor) @ juneau ---
[INFO]
[INFO] --- apache-rat-plugin:0.11:check (default) @ juneau ---
[INFO] 57 implicit excludes (use -debug for more details).
[INFO] Exclude: **/DEPENDENCIES
[INFO] Exclude: **/target/**
[INFO] Exclude: **/.settings/**
[INFO] Exclude: **/.project
[INFO] Exclude: **/.classpath
[INFO] Exclude: **/*.launch
[INFO] Exclude: **/jetty.out.xml
[INFO] Exclude: **/dependency-reduced-pom.xml
[INFO] 13 resources included (use -debug for more details)
[INFO] Rat check: Summary of files. Unapproved: 0 unknown: 0 generated: 0 approved: 10 licence.
[INFO]
[INFO] --- maven-install-plugin:2.5.2:install (default-install) @ juneau ---
[INFO] Installing <https://builds.apache.org/job/Juneau-Java-1.8/ws/pom.xml> to /home/jenkins/.m2/repository/org/apache/juneau/juneau/7.0.0/juneau-7.0.0.pom
[INFO]
[INFO] --- maven-enforcer-plugin:1.4.1:enforce (enforce-maven) @ juneau ---
[INFO]
[INFO] --- maven-remote-resources-plugin:1.5:process (process-resource-bundles) @ juneau ---
[INFO]
[INFO] --- maven-site-plugin:3.5.1:attach-descriptor (attach-descriptor) @ juneau ---
[INFO]
[INFO] --- apache-rat-plugin:0.11:check (default) @ juneau ---
[INFO] 57 implicit excludes (use -debug for more details).
[INFO] Exclude: **/DEPENDENCIES
[INFO] Exclude: **/target/**
[INFO] Exclude: **/.settings/**
[INFO] Exclude: **/.project
[INFO] Exclude: **/.classpath
[INFO] Exclude: **/*.launch
[INFO] Exclude: **/jetty.out.xml
[INFO] Exclude: **/dependency-reduced-pom.xml
[INFO] 13 resources included (use -debug for more details)
[INFO] Rat check: Summary of files. Unapproved: 0 unknown: 0 generated: 0 approved: 10 licence.
[INFO]
[INFO] --- maven-install-plugin:2.5.2:install (default-install) @ juneau ---
[INFO] Installing <https://builds.apache.org/job/Juneau-Java-1.8/ws/pom.xml> to /home/jenkins/.m2/repository/org/apache/juneau/juneau/7.0.0/juneau-7.0.0.pom
[INFO]
[INFO] --- maven-deploy-plugin:2.8.2:deploy (default-deploy) @ juneau ---
Uploading: https://repository.apache.org/service/local/staging/deploy/maven2/org/apache/juneau/juneau/7.0.0/juneau-7.0.0.pom
2/12 KB 4/12 KB 6/12 KB 8/12 KB 10/12 KB 12/12 KB [INFO] ------------------------------------------------------------------------
[INFO] Reactor Summary:
[INFO]
[INFO] Apache Juneau ...................................... FAILURE [ 3.494 s]
[INFO] Apache Juneau - Core APIs .......................... SKIPPED
[INFO] Apache Juneau Marshall ............................. SKIPPED
[INFO] Apache Juneau Marshal RDF .......................... SKIPPED
[INFO] Apache Juneau Data Transfer Objects ................ SKIPPED
[INFO] Apache Juneau Core ................................. SKIPPED
[INFO] Apache Juneau Config File API ...................... SKIPPED
[INFO] Apache Juneau Core Tests ........................... SKIPPED
[INFO] Apache Juneau - REST APIs .......................... SKIPPED
[INFO] Apache Juneau REST Servlet API ..................... SKIPPED
[INFO] Apache Juneau REST JAX/RS API ...................... SKIPPED
[INFO] Apache Juneau REST Client API ...................... SKIPPED
[INFO] Apache Juneau - Microservice APIs .................. SKIPPED
[INFO] Apache Juneau Microservice Server .................. SKIPPED
[INFO] Apache Juneau Microservice Template ................ SKIPPED
[INFO] Apache Juneau - Examples ........................... SKIPPED
[INFO] Apache Juneau REST Examples ........................ SKIPPED
[INFO] Apache Juneau Microservice Tests ................... SKIPPED
[INFO] Apache Juneau Core Examples ........................ SKIPPED
[INFO] Apache Juneau Javadocs ............................. SKIPPED
[INFO] Apache Juneau - Release Engineering ................ SKIPPED
[INFO] Apache Juneau UberJar .............................. SKIPPED
[INFO] Apache Juneau Distribution ......................... SKIPPED
[INFO] ------------------------------------------------------------------------
[INFO] BUILD FAILURE
[INFO] ------------------------------------------------------------------------
[INFO] Total time: 4.465 s
[INFO] Finished at: 2017-10-22T20:12:30+00:00
[INFO] Final Memory: 32M/728M
[INFO] ------------------------------------------------------------------------
[ERROR] Failed to execute goal org.apache.maven.plugins:maven-deploy-plugin:2.8.2:deploy (default-deploy) on project juneau: Failed to deploy artifacts: Could not transfer artifact org.apache.juneau:juneau:pom:7.0.0 from/to apache.releases.https (https://repository.apache.org/service/local/staging/deploy/maven2): Failed to transfer file: https://repository.apache.org/service/local/staging/deploy/maven2/org/apache/juneau/juneau/7.0.0/juneau-7.0.0.pom. Return code is: 401, ReasonPhrase: Unauthorized. -> [Help 1]
[ERROR]
[ERROR] To see the full stack trace of the errors, re-run Maven with the -e switch.
[ERROR] Re-run Maven using the -X switch to enable full debug logging.
[ERROR]
[ERROR] For more information about the errors and possible solutions, please read the following articles:
[ERROR] [Help 1] http://cwiki.apache.org/confluence/display/MAVEN/MojoExecutionException
Build step 'Invoke top-level Maven targets' marked build as failure
Jenkins build is back to normal : Juneau-Java-1.8 #569
Posted by Apache Jenkins Server <je...@builds.apache.org>.
See <https://builds.apache.org/job/Juneau-Java-1.8/569/display/redirect?page=changes>