You are viewing a plain text version of this content. The canonical link for it is here.
Posted to builds@solr.apache.org by Apache Jenkins Server <je...@builds.apache.org> on 2026/08/09 17:38:53 UTC

[JENKINS] Solr » Solr-Test-main - Build # 14486 - Unstable!

Build: https://ci-builds.apache.org/job/Solr/job/Solr-Test-main/14486/

1 tests failed.
FAILED:  org.apache.solr.cloud.RecoveryAfterSoftCommitTest.test

Error Message:
org.apache.solr.client.solrj.SolrServerException: java.nio.channels.ClosedChannelException

Stack Trace:
org.apache.solr.client.solrj.SolrServerException: java.nio.channels.ClosedChannelException
	at __randomizedtesting.SeedInfo.seed([86D8DD490D724EE5:E8CE293A38E231D]:0)
	at org.apache.solr.client.solrj.impl.LBSolrClient.doRequest(LBSolrClient.java:680)
	at org.apache.solr.client.solrj.impl.LBSolrClient.request(LBSolrClient.java:582)
	at org.apache.solr.client.solrj.impl.CloudSolrClient.sendRequest(CloudSolrClient.java:1088)
	at org.apache.solr.client.solrj.impl.CloudSolrClient.requestWithRetryOnStaleState(CloudSolrClient.java:723)
	at org.apache.solr.client.solrj.impl.CloudSolrClient.request(CloudSolrClient.java:645)
	at org.apache.solr.client.solrj.SolrRequest.process(SolrRequest.java:314)
	at org.apache.solr.client.solrj.SolrClient.add(SolrClient.java:167)
	at org.apache.solr.client.solrj.SolrClient.add(SolrClient.java:132)
	at org.apache.solr.client.solrj.SolrClient.add(SolrClient.java:148)
	at org.apache.solr.cloud.RecoveryAfterSoftCommitTest.test(RecoveryAfterSoftCommitTest.java:106)
	at java.base/jdk.internal.reflect.DirectMethodHandleAccessor.invoke(DirectMethodHandleAccessor.java:103)
	at java.base/java.lang.reflect.Method.invoke(Method.java:580)
	at com.carrotsearch.randomizedtesting.RandomizedRunner.invoke(RandomizedRunner.java:1780)
	at com.carrotsearch.randomizedtesting.RandomizedRunner$8.evaluate(RandomizedRunner.java:959)
	at com.carrotsearch.randomizedtesting.RandomizedRunner$9.evaluate(RandomizedRunner.java:995)
	at com.carrotsearch.randomizedtesting.RandomizedRunner$10.evaluate(RandomizedRunner.java:1009)
	at org.apache.solr.BaseDistributedSearchTestCase$ShardsRepeatRule$ShardsFixedStatement.callStatement(BaseDistributedSearchTestCase.java:1088)
	at org.apache.solr.BaseDistributedSearchTestCase$ShardsRepeatRule$ShardsStatement.evaluate(BaseDistributedSearchTestCase.java:1059)
	at com.carrotsearch.randomizedtesting.rules.SystemPropertiesRestoreRule$1.evaluate(SystemPropertiesRestoreRule.java:80)
	at org.junit.rules.RunRules.evaluate(RunRules.java:20)
	at org.apache.lucene.tests.util.TestRuleSetupTeardownChained$1.evaluate(TestRuleSetupTeardownChained.java:48)
	at org.apache.lucene.tests.util.AbstractBeforeAfterRule$1.evaluate(AbstractBeforeAfterRule.java:43)
	at org.apache.lucene.tests.util.TestRuleThreadAndTestName$1.evaluate(TestRuleThreadAndTestName.java:45)
	at org.apache.lucene.tests.util.TestRuleIgnoreAfterMaxFailures$1.evaluate(TestRuleIgnoreAfterMaxFailures.java:60)
	at org.apache.lucene.tests.util.TestRuleMarkFailure$1.evaluate(TestRuleMarkFailure.java:44)
	at org.junit.rules.RunRules.evaluate(RunRules.java:20)
	at com.carrotsearch.randomizedtesting.rules.StatementAdapter.evaluate(StatementAdapter.java:36)
	at com.carrotsearch.randomizedtesting.ThreadLeakControl$StatementRunner.run(ThreadLeakControl.java:390)
	at com.carrotsearch.randomizedtesting.ThreadLeakControl.forkTimeoutingTask(ThreadLeakControl.java:843)
	at com.carrotsearch.randomizedtesting.ThreadLeakControl$3.evaluate(ThreadLeakControl.java:490)
	at com.carrotsearch.randomizedtesting.RandomizedRunner.runSingleTest(RandomizedRunner.java:968)
	at com.carrotsearch.randomizedtesting.RandomizedRunner$5.evaluate(RandomizedRunner.java:853)
	at com.carrotsearch.randomizedtesting.RandomizedRunner$6.evaluate(RandomizedRunner.java:904)
	at com.carrotsearch.randomizedtesting.RandomizedRunner$7.evaluate(RandomizedRunner.java:915)
	at com.carrotsearch.randomizedtesting.rules.StatementAdapter.evaluate(StatementAdapter.java:36)
	at com.carrotsearch.randomizedtesting.rules.StatementAdapter.evaluate(StatementAdapter.java:36)
	at org.apache.lucene.tests.util.AbstractBeforeAfterRule$1.evaluate(AbstractBeforeAfterRule.java:43)
	at com.carrotsearch.randomizedtesting.rules.SystemPropertiesRestoreRule$1.evaluate(SystemPropertiesRestoreRule.java:80)
	at org.junit.rules.RunRules.evaluate(RunRules.java:20)
	at org.apache.lucene.tests.util.AbstractBeforeAfterRule$1.evaluate(AbstractBeforeAfterRule.java:43)
	at com.carrotsearch.randomizedtesting.rules.StatementAdapter.evaluate(StatementAdapter.java:36)
	at org.apache.lucene.tests.util.TestRuleStoreClassName$1.evaluate(TestRuleStoreClassName.java:38)
	at com.carrotsearch.randomizedtesting.rules.NoShadowingOrOverridesOnMethodsRule$1.evaluate(NoShadowingOrOverridesOnMethodsRule.java:40)
	at com.carrotsearch.randomizedtesting.rules.NoShadowingOrOverridesOnMethodsRule$1.evaluate(NoShadowingOrOverridesOnMethodsRule.java:40)
	at com.carrotsearch.randomizedtesting.rules.StatementAdapter.evaluate(StatementAdapter.java:36)
	at com.carrotsearch.randomizedtesting.rules.StatementAdapter.evaluate(StatementAdapter.java:36)
	at org.apache.lucene.tests.util.TestRuleAssertionsRequired$1.evaluate(TestRuleAssertionsRequired.java:53)
	at org.apache.lucene.tests.util.AbstractBeforeAfterRule$1.evaluate(AbstractBeforeAfterRule.java:43)
	at org.apache.lucene.tests.util.TestRuleMarkFailure$1.evaluate(TestRuleMarkFailure.java:44)
	at org.apache.lucene.tests.util.TestRuleIgnoreAfterMaxFailures$1.evaluate(TestRuleIgnoreAfterMaxFailures.java:60)
	at org.apache.lucene.tests.util.TestRuleIgnoreTestSuites$1.evaluate(TestRuleIgnoreTestSuites.java:47)
	at org.junit.rules.RunRules.evaluate(RunRules.java:20)
	at com.carrotsearch.randomizedtesting.rules.StatementAdapter.evaluate(StatementAdapter.java:36)
	at com.carrotsearch.randomizedtesting.ThreadLeakControl$StatementRunner.run(ThreadLeakControl.java:390)
	at com.carrotsearch.randomizedtesting.ThreadLeakControl.lambda$forkTimeoutingTask$0(ThreadLeakControl.java:850)
	at java.base/java.lang.Thread.run(Thread.java:1583)
Caused by: java.nio.channels.ClosedChannelException
	at org.eclipse.jetty.http2.HTTP2Session$StreamsState.onShutdown(HTTP2Session.java:2173)
	at org.eclipse.jetty.http2.HTTP2Session.onShutdown(HTTP2Session.java:1206)
	at org.eclipse.jetty.http2.HTTP2Connection$HTTP2Producer.produce(HTTP2Connection.java:441)
	at org.eclipse.jetty.util.thread.strategy.AdaptiveExecutionStrategy.produceTask(AdaptiveExecutionStrategy.java:509)
	at org.eclipse.jetty.util.thread.strategy.AdaptiveExecutionStrategy.tryProduce(AdaptiveExecutionStrategy.java:251)
	at org.eclipse.jetty.util.thread.strategy.AdaptiveExecutionStrategy.produce(AdaptiveExecutionStrategy.java:196)
	at org.eclipse.jetty.http2.HTTP2Connection.produce(HTTP2Connection.java:237)
	at org.eclipse.jetty.http2.HTTP2Connection.onFillable(HTTP2Connection.java:165)
	at org.eclipse.jetty.http2.HTTP2Connection$FillableCallback.succeeded(HTTP2Connection.java:592)
	at org.eclipse.jetty.io.FillInterest.fillable(FillInterest.java:105)
	at org.eclipse.jetty.io.SelectableChannelEndPoint$1.run(SelectableChannelEndPoint.java:54)
	at org.eclipse.jetty.util.thread.Invocable.invokeNonBlocking(Invocable.java:225)
	at org.eclipse.jetty.util.thread.strategy.AdaptiveExecutionStrategy.picRunTask(AdaptiveExecutionStrategy.java:473)
	at org.eclipse.jetty.util.thread.strategy.AdaptiveExecutionStrategy.consumeTask(AdaptiveExecutionStrategy.java:399)
	at org.eclipse.jetty.util.thread.strategy.AdaptiveExecutionStrategy.tryProduce(AdaptiveExecutionStrategy.java:255)
	at org.eclipse.jetty.util.thread.strategy.AdaptiveExecutionStrategy.produce(AdaptiveExecutionStrategy.java:196)
	at org.apache.solr.common.util.ExecutorUtil$MDCAwareThreadPoolExecutor.lambda$execute$0(ExecutorUtil.java:390)
	at java.base/java.util.concurrent.ThreadPoolExecutor.runWorker(ThreadPoolExecutor.java:1144)
	at java.base/java.util.concurrent.ThreadPoolExecutor$Worker.run(ThreadPoolExecutor.java:642)
	... 1 more




Build Log:
[...truncated 11 lines...]
ERROR: Workspace has a .git repository, but it appears to be corrupt.
hudson.plugins.git.GitException: Command "git rev-parse --resolve-git-dir /home/jenkins/jenkins-agent/workspace/Solr/Solr-Test-main/.git" returned status code 128:
stdout: 
stderr: fatal: not a gitdir '/home/jenkins/jenkins-agent/workspace/Solr/Solr-Test-main/.git'

	at PluginClassLoader for git-client//org.jenkinsci.plugins.gitclient.CliGitAPIImpl.launchCommandIn(CliGitAPIImpl.java:2848)
	at PluginClassLoader for git-client//org.jenkinsci.plugins.gitclient.CliGitAPIImpl.launchCommandIn(CliGitAPIImpl.java:2768)
	at PluginClassLoader for git-client//org.jenkinsci.plugins.gitclient.CliGitAPIImpl.launchCommandIn(CliGitAPIImpl.java:2763)
	at PluginClassLoader for git-client//org.jenkinsci.plugins.gitclient.CliGitAPIImpl.launchCommand(CliGitAPIImpl.java:2052)
	at PluginClassLoader for git-client//org.jenkinsci.plugins.gitclient.CliGitAPIImpl.launchCommand(CliGitAPIImpl.java:2064)
	at PluginClassLoader for git-client//org.jenkinsci.plugins.gitclient.CliGitAPIImpl.hasGitRepo(CliGitAPIImpl.java:404)
	at PluginClassLoader for git-client//hudson.plugins.git.GitAPI.hasGitRepo(GitAPI.java:281)
	at jdk.internal.reflect.GeneratedMethodAccessor30.invoke(Unknown Source)
	at java.base/jdk.internal.reflect.DelegatingMethodAccessorImpl.invoke(DelegatingMethodAccessorImpl.java:43)
	at java.base/java.lang.reflect.Method.invoke(Method.java:569)
	at hudson.remoting.RemoteInvocationHandler$RPCRequest.perform(RemoteInvocationHandler.java:986)
	at hudson.remoting.RemoteInvocationHandler$RPCRequest.call(RemoteInvocationHandler.java:961)
	at hudson.remoting.RemoteInvocationHandler$RPCRequest.call(RemoteInvocationHandler.java:907)
	at hudson.remoting.UserRequest.perform(UserRequest.java:225)
	at hudson.remoting.UserRequest.perform(UserRequest.java:50)
	at hudson.remoting.Request$2.run(Request.java:391)
	at hudson.remoting.InterceptingExecutorService.lambda$wrap$0(InterceptingExecutorService.java:81)
	at java.base/java.util.concurrent.FutureTask.run(FutureTask.java:264)
	at java.base/java.util.concurrent.ThreadPoolExecutor.runWorker(ThreadPoolExecutor.java:1136)
	at java.base/java.util.concurrent.ThreadPoolExecutor$Worker.run(ThreadPoolExecutor.java:635)
	at java.base/java.lang.Thread.run(Thread.java:840)
Cloning the remote Git repository
Cloning repository https://gitbox.apache.org/repos/asf/solr.git
 > git init /home/jenkins/jenkins-agent/workspace/Solr/Solr-Test-main # timeout=10
Fetching upstream changes from https://gitbox.apache.org/repos/asf/solr.git
 > git --version # timeout=10
 > git --version # 'git version 2.43.0'
 > git fetch --tags --force --progress -- https://gitbox.apache.org/repos/asf/solr.git +refs/heads/*:refs/remotes/origin/* # timeout=10
 > git config remote.origin.url https://gitbox.apache.org/repos/asf/solr.git # timeout=10
 > git config --add remote.origin.fetch +refs/heads/*:refs/remotes/origin/* # timeout=10
Avoid second fetch
 > git rev-parse refs/remotes/origin/main^{commit} # timeout=10
Checking out Revision d5ee8873eb1342ccac9a59dc34eaab9afe88d4a8 (refs/remotes/origin/main)
 > git config core.sparsecheckout # timeout=10
 > git checkout -f d5ee8873eb1342ccac9a59dc34eaab9afe88d4a8 # timeout=10
 > git branch -a -v --no-abbrev # timeout=10
 > git checkout -b main d5ee8873eb1342ccac9a59dc34eaab9afe88d4a8 # timeout=10
Commit message: "SOLR-18332: More qt-removal from tests, rd 2 (#4713)"
 > git rev-list --no-walk d5ee8873eb1342ccac9a59dc34eaab9afe88d4a8 # timeout=10
No emails were triggered.
provisioning config files...
copy managed file [gradle.properties] to file:/home/jenkins/jenkins-agent/workspace/Solr/Solr-Test-main/gradle.properties
[Gradle] - Launching build.
[Solr-Test-main] $ /home/jenkins/jenkins-agent/workspace/Solr/Solr-Test-main/gradlew -Dtests.haltonfailure=false -Dtests.badapples=false --continue test
Downloading gradle-wrapper.jar from https://raw.githubusercontent.com/gradle/gradle/v8.10.2/gradle/wrapper/gradle-wrapper.jar
To honour the JVM settings for this build a single-use Daemon process will be forked. For more on this, please refer to https://docs.gradle.org/9.6.0/userguide/gradle_daemon.html#sec:disabling_the_daemon in the Gradle documentation.
Daemon will be stopped at the end of the build 

> Task :build-infra:compileJava
Note: /home/jenkins/jenkins-agent/workspace/Solr/Solr-Test-main/build-tools/build-infra/src/main/java/org/apache/lucene/gradle/Checksum.java uses or overrides a deprecated API.
Note: Recompile with -Xlint:deprecation for details.

> Task :build-infra:pluginDescriptors
> Task :build-infra:processResources
> Task :build-infra:classes
> Task :build-infra:jar
> Task :gitStatus
> Task :checkJdkInternalsExportedToGradle

> Task :solr:api:compileJava
Note: Some input files use or override a deprecated API.
Note: Recompile with -Xlint:deprecation for details.

> Task :solr:api:processResources NO-SOURCE
> Task :solr:api:classes
> Task :solr:api:jar

> Task :randomizationInfo
Running tests with randomization seed: tests.seed=86D8DD490D724EE5

> Task :solr:api:resolve
SLF4J(W): No SLF4J providers were found.
SLF4J(W): Defaulting to no-operation (NOP) logger implementation
SLF4J(W): See https://www.slf4j.org/codes.html#noProviders for further details.

> Task :solr:api:processTestResources
> Task :solr:core:processResources
> Task :solr:solrj:processResources
> Task :solr:solrj-jetty:processResources NO-SOURCE
> Task :solr:solrj-streaming:processResources
> Task :solr:solrj-zookeeper:processResources NO-SOURCE
> Task :solr:test-framework:processResources
> Task :solr:benchmark:processResources
> Task :solr:benchmark:processTestResources
> Task :solr:core:processTestResources
> Task :solr:modules:analysis-extras:processResources NO-SOURCE
> Task :solr:cross-dc-manager:processResources NO-SOURCE
> Task :solr:cross-dc-manager:processTestResources
> Task :solr:modules:cross-dc:processResources NO-SOURCE
> Task :solr:modules:opentelemetry:processResources NO-SOURCE
> Task :solr:server:compileJava SKIPPED
> Task :solr:server:processResources NO-SOURCE
> Task :solr:server:classes UP-TO-DATE
> Task :solr:server:compileTestJava NO-SOURCE
> Task :solr:server:processTestResources NO-SOURCE
> Task :solr:server:testClasses UP-TO-DATE
> Task :solr:server:test NO-SOURCE
> Task :solr:server:wipeTaskTemp
> Task :solr:solr-ref-guide:compileJava NO-SOURCE
> Task :solr:solr-ref-guide:processResources NO-SOURCE
> Task :solr:solr-ref-guide:classes UP-TO-DATE
> Task :solr:solr-ref-guide:copySolrjTestResources
> Task :solr:solr-ref-guide:processTestResources NO-SOURCE
> Task :solr:modules:sql:processResources
> Task :solr:solrj:processTestResources
> Task :solr:solrj-jetty:processTestResources
> Task :solr:solrj-streaming:processTestResources
> Task :solr:solrj-zookeeper:processTestResources
> Task :solr:test-framework:processTestResources
> Task :solr:webapp:processResources NO-SOURCE
> Task :solr:webapp:processTestResources NO-SOURCE
> Task :solr:modules:analysis-extras:processTestResources
> Task :solr:modules:clustering:processResources NO-SOURCE
> Task :solr:modules:clustering:processTestResources
> Task :solr:modules:cross-dc:processTestResources
> Task :solr:modules:cuvs:processResources NO-SOURCE
> Task :solr:modules:cuvs:processTestResources
> Task :solr:modules:extraction:processResources
> Task :solr:modules:extraction:processTestResources
> Task :solr:modules:gcs-repository:processResources NO-SOURCE
> Task :solr:modules:gcs-repository:processTestResources
> Task :solr:modules:jwt-auth:processResources NO-SOURCE
> Task :solr:modules:jwt-auth:processTestResources
> Task :solr:modules:langid:processResources NO-SOURCE
> Task :solr:modules:langid:processTestResources
> Task :solr:modules:language-models:processResources NO-SOURCE
> Task :solr:modules:language-models:processTestResources
> Task :solr:modules:ltr:processResources NO-SOURCE
> Task :solr:modules:ltr:processTestResources
> Task :solr:modules:opentelemetry:processTestResources
> Task :solr:modules:s3-repository:processResources NO-SOURCE
> Task :solr:modules:s3-repository:processTestResources
> Task :solr:modules:scripting:processResources NO-SOURCE
> Task :solr:modules:scripting:processTestResources
> Task :solr:modules:sql:copySolrCoreTestResources
> Task :solr:modules:sql:processTestResources

> Task :solr:solrj:openApiGenerate
Cleaned up output directory /home/jenkins/jenkins-agent/workspace/Solr/Solr-Test-main/solr/solrj/build/generated before code generation.
[openApiGenerate] Worker isolation: classloader (fast startup, but generator classes accumulate in Gradle daemon Metaspace - consider workerIsolation = "process" if you hit metaspace pressure)
No application/json content media type found in response. Response examples can currently only be generated for application/json media type.
############################################################################################
# Thanks for using OpenAPI Generator.                                                      #
# We appreciate your support! Please consider donation to help us maintain this project.   #
# https://opencollective.com/openapi_generator/donate                                      #
############################################################################################
Successfully generated code to /home/jenkins/jenkins-agent/workspace/Solr/Solr-Test-main/solr/solrj/build/generated

> Task :solr:solrj:generatedSpotlessHelper
> Task :solr:solrj:generatedSpotless

> Task :solr:solrj:compileJava
Note: Some input files use or override a deprecated API.
Note: Recompile with -Xlint:deprecation for details.

> Task :solr:solrj-jetty:compileJava
Note: /home/jenkins/jenkins-agent/workspace/Solr/Solr-Test-main/solr/solrj-jetty/src/java/org/apache/solr/client/solrj/jetty/HttpJettySolrClient.java uses or overrides a deprecated API.
Note: Recompile with -Xlint:deprecation for details.

> Task :solr:solrj-streaming:compileJava
Note: Some input files use or override a deprecated API.
Note: Recompile with -Xlint:deprecation for details.

> Task :solr:solrj-zookeeper:compileJava
Note: Some input files use or override a deprecated API.
Note: Recompile with -Xlint:deprecation for details.

> Task :solr:core:compileJava
Note: Some input files use or override a deprecated API.
Note: Recompile with -Xlint:deprecation for details.

> Task :solr:test-framework:compileJava
Note: Some input files use or override a deprecated API.
Note: Recompile with -Xlint:deprecation for details.

> Task :solr:api:compileTestJava
> Task :solr:api:testClasses
> Task :solr:core:classes
> Task :solr:core:jar
> Task :solr:solrj:classes
> Task :solr:solrj:jar
> Task :solr:solrj-jetty:classes
> Task :solr:solrj-jetty:jar
> Task :solr:solrj-streaming:classes
> Task :solr:solrj-streaming:jar
> Task :solr:solrj-zookeeper:classes
> Task :solr:solrj-zookeeper:jar
> Task :solr:test-framework:classes
> Task :solr:test-framework:jar

> Task :solr:api:test
WARNING: Using incubator modules: jdk.incubator.vector
WARNING: Using incubator modules: jdk.incubator.vector
WARNING: A command line option has enabled the Security Manager
WARNING: The Security Manager is deprecated and will be removed in a future release
WARNING: A command line option has enabled the Security Manager
WARNING: The Security Manager is deprecated and will be removed in a future release
java.security.policy: error adding Permission, java.net.URLPermission:
	java.util.ServiceConfigurationError: Locale provider adapter "CLDR"cannot be instantiated.
java.security.policy: error adding Permission, java.net.URLPermission:
	java.util.ServiceConfigurationError: Locale provider adapter "CLDR"cannot be instantiated.
java.security.policy: error adding Permission, java.net.URLPermission:
	java.util.ServiceConfigurationError: Locale provider adapter "CLDR"cannot be instantiated.
java.security.policy: error adding Permission, java.net.URLPermission:
	java.util.ServiceConfigurationError: Locale provider adapter "CLDR"cannot be instantiated.
java.security.policy: error adding Permission, java.net.URLPermission:
	java.util.ServiceConfigurationError: Locale provider adapter "CLDR"cannot be instantiated.
java.security.policy: error adding Permission, java.net.URLPermission:
	java.util.ServiceConfigurationError: Locale provider adapter "CLDR"cannot be instantiated.
java.security.policy: error adding Permission, java.net.URLPermission:
	java.util.ServiceConfigurationError: Locale provider adapter "CLDR"cannot be instantiated.
java.security.policy: error adding Permission, java.net.URLPermission:
	java.util.ServiceConfigurationError: Locale provider adapter "CLDR"cannot be instantiated.
java.security.policy: error adding Permission, java.net.URLPermission:
	java.util.ServiceConfigurationError: Locale provider adapter "CLDR"cannot be instantiated.
java.security.policy: error adding Permission, java.net.URLPermission:
	java.util.ServiceConfigurationError: Locale provider adapter "CLDR"cannot be instantiated.
:solr:api:test (SUCCESS): 19 test(s)

> Task :solr:api:wipeTaskTemp

> Task :solr:benchmark:compileJava
Note: /home/jenkins/jenkins-agent/workspace/Solr/Solr-Test-main/solr/benchmark/src/java/org/apache/solr/bench/lifecycle/SolrStartup.java uses or overrides a deprecated API.
Note: Recompile with -Xlint:deprecation for details.

> Task :solr:benchmark:classes
> Task :solr:benchmark:compileTestJava
> Task :solr:benchmark:testClasses

> Task :solr:benchmark:test
WARNING: Using incubator modules: jdk.incubator.vector
WARNING: Using incubator modules: jdk.incubator.vector
WARNING: Using incubator modules: jdk.incubator.vector
WARNING: A command line option has enabled the Security Manager
WARNING: The Security Manager is deprecated and will be removed in a future release
WARNING: A command line option has enabled the Security Manager
WARNING: The Security Manager is deprecated and will be removed in a future release
WARNING: A command line option has enabled the Security Manager
WARNING: The Security Manager is deprecated and will be removed in a future release
java.security.policy: error adding Permission, java.net.URLPermission:
	java.util.ServiceConfigurationError: Locale provider adapter "CLDR"cannot be instantiated.
java.security.policy: error adding Permission, java.net.URLPermission:
	java.util.ServiceConfigurationError: Locale provider adapter "CLDR"cannot be instantiated.
java.security.policy: error adding Permission, java.net.URLPermission:
java.security.policy: error adding Permission, java.net.URLPermission:
	java.util.ServiceConfigurationError: Locale provider adapter "CLDR"cannot be instantiated.
	java.util.ServiceConfigurationError: Locale provider adapter "CLDR"cannot be instantiated.
java.security.policy: error adding Permission, java.net.URLPermission:
	java.util.ServiceConfigurationError: Locale provider adapter "CLDR"cannot be instantiated.
java.security.policy: error adding Permission, java.net.URLPermission:
	java.util.ServiceConfigurationError: Locale provider adapter "CLDR"cannot be instantiated.
java.security.policy: error adding Permission, java.net.URLPermission:
	java.util.ServiceConfigurationError: Locale provider adapter "CLDR"cannot be instantiated.
java.security.policy: error adding Permission, java.net.URLPermission:
	java.util.ServiceConfigurationError: Locale provider adapter "CLDR"cannot be instantiated.
java.security.policy: error adding Permission, java.net.URLPermission:
	java.util.ServiceConfigurationError: Locale provider adapter "CLDR"cannot be instantiated.
java.security.policy: error adding Permission, java.net.URLPermission:
	java.util.ServiceConfigurationError: Locale provider adapter "CLDR"cannot be instantiated.
java.security.policy: error adding Permission, java.net.URLPermission:
	java.util.ServiceConfigurationError: Locale provider adapter "CLDR"cannot be instantiated.
java.security.policy: error adding Permission, java.net.URLPermission:
	java.util.ServiceConfigurationError: Locale provider adapter "CLDR"cannot be instantiated.
java.security.policy: error adding Permission, java.net.URLPermission:
	java.util.ServiceConfigurationError: Locale provider adapter "CLDR"cannot be instantiated.
java.security.policy: error adding Permission, java.net.URLPermission:
	java.util.ServiceConfigurationError: Locale provider adapter "CLDR"cannot be instantiated.
java.security.policy: error adding Permission, java.net.URLPermission:
	java.util.ServiceConfigurationError: Locale provider adapter "CLDR"cannot be instantiated.
:solr:benchmark:test (SUCCESS): 10 test(s)

> Task :solr:benchmark:wipeTaskTemp
> Task :solr:core:compileTestJava
Note: Some input files use or override a deprecated API.
Note: Recompile with -Xlint:deprecation for details.

> Task :solr:core:testClasses

> Task :solr:modules:analysis-extras:compileJava
Note: /home/jenkins/jenkins-agent/workspace/Solr/Solr-Test-main/solr/modules/analysis-extras/src/java/org/apache/solr/schema/ICUCollationField.java uses or overrides a deprecated API.
Note: Recompile with -Xlint:deprecation for details.

> Task :solr:modules:analysis-extras:classes
> Task :solr:modules:analysis-extras:jar

> Task :solr:core:test
WARNING: Using incubator modules: jdk.incubator.vector
WARNING: Using incubator modules: jdk.incubator.vector
WARNING: Using incubator modules: jdk.incubator.vector
WARNING: Using incubator modules: jdk.incubator.vector
WARNING: A command line option has enabled the Security Manager
WARNING: The Security Manager is deprecated and will be removed in a future release
WARNING: A command line option has enabled the Security Manager
WARNING: The Security Manager is deprecated and will be removed in a future release
WARNING: A command line option has enabled the Security Manager
WARNING: The Security Manager is deprecated and will be removed in a future release
WARNING: A command line option has enabled the Security Manager
WARNING: The Security Manager is deprecated and will be removed in a future release
java.security.policy: error adding Permission, java.net.URLPermission:
	java.util.ServiceConfigurationError: Locale provider adapter "CLDR"cannot be instantiated.
java.security.policy: error adding Permission, java.net.URLPermission:
	java.util.ServiceConfigurationError: Locale provider adapter "CLDR"cannot be instantiated.
java.security.policy: error adding Permission, java.net.URLPermission:
	java.util.ServiceConfigurationError: Locale provider adapter "CLDR"cannot be instantiated.
java.security.policy: error adding Permission, java.net.URLPermission:
	java.util.ServiceConfigurationError: Locale provider adapter "CLDR"cannot be instantiated.
java.security.policy: error adding Permission, java.net.URLPermission:
	java.util.ServiceConfigurationError: Locale provider adapter "CLDR"cannot be instantiated.
java.security.policy: error adding Permission, java.net.URLPermission:
	java.util.ServiceConfigurationError: Locale provider adapter "CLDR"cannot be instantiated.
java.security.policy: error adding Permission, java.net.URLPermission:
	java.util.ServiceConfigurationError: Locale provider adapter "CLDR"cannot be instantiated.
java.security.policy: error adding Permission, java.net.URLPermission:
	java.util.ServiceConfigurationError: Locale provider adapter "CLDR"cannot be instantiated.
java.security.policy: error adding Permission, java.net.URLPermission:
	java.util.ServiceConfigurationError: Locale provider adapter "CLDR"cannot be instantiated.
java.security.policy: error adding Permission, java.net.URLPermission:
	java.util.ServiceConfigurationError: Locale provider adapter "CLDR"cannot be instantiated.
java.security.policy: error adding Permission, java.net.URLPermission:
	java.util.ServiceConfigurationError: Locale provider adapter "CLDR"cannot be instantiated.
java.security.policy: error adding Permission, java.net.URLPermission:
	java.util.ServiceConfigurationError: Locale provider adapter "CLDR"cannot be instantiated.
java.security.policy: error adding Permission, java.net.URLPermission:
	java.util.ServiceConfigurationError: Locale provider adapter "CLDR"cannot be instantiated.
java.security.policy: error adding Permission, java.net.URLPermission:
	java.util.ServiceConfigurationError: Locale provider adapter "CLDR"cannot be instantiated.
java.security.policy: error adding Permission, java.net.URLPermission:
	java.util.ServiceConfigurationError: Locale provider adapter "CLDR"cannot be instantiated.
java.security.policy: error adding Permission, java.net.URLPermission:
	java.util.ServiceConfigurationError: Locale provider adapter "CLDR"cannot be instantiated.
java.security.policy: error adding Permission, java.net.URLPermission:
	java.util.ServiceConfigurationError: Locale provider adapter "CLDR"cannot be instantiated.
java.security.policy: error adding Permission, java.net.URLPermission:
	java.util.ServiceConfigurationError: Locale provider adapter "CLDR"cannot be instantiated.
java.security.policy: error adding Permission, java.net.URLPermission:
	java.util.ServiceConfigurationError: Locale provider adapter "CLDR"cannot be instantiated.
java.security.policy: error adding Permission, java.net.URLPermission:
	java.util.ServiceConfigurationError: Locale provider adapter "CLDR"cannot be instantiated.
WARNING: Test org.apache.solr.TestRandomFaceting wrote 21,597,841 bytes of output.

RecoveryAfterSoftCommitTest > test FAILED
    org.apache.solr.client.solrj.SolrServerException: java.nio.channels.ClosedChannelException
        at __randomizedtesting.SeedInfo.seed([86D8DD490D724EE5:E8CE293A38E231D]:0)
        at app//org.apache.solr.client.solrj.impl.LBSolrClient.doRequest(LBSolrClient.java:680)
        at app//org.apache.solr.client.solrj.impl.LBSolrClient.request(LBSolrClient.java:582)
        at app//org.apache.solr.client.solrj.impl.CloudSolrClient.sendRequest(CloudSolrClient.java:1088)
        at app//org.apache.solr.client.solrj.impl.CloudSolrClient.requestWithRetryOnStaleState(CloudSolrClient.java:723)
        at app//org.apache.solr.client.solrj.impl.CloudSolrClient.request(CloudSolrClient.java:645)
        at app//org.apache.solr.client.solrj.SolrRequest.process(SolrRequest.java:314)
        at app//org.apache.solr.client.solrj.SolrClient.add(SolrClient.java:167)
        at app//org.apache.solr.client.solrj.SolrClient.add(SolrClient.java:132)
        at app//org.apache.solr.client.solrj.SolrClient.add(SolrClient.java:148)
        at app//org.apache.solr.cloud.RecoveryAfterSoftCommitTest.test(RecoveryAfterSoftCommitTest.java:106)
        at java.base@21.0.4/jdk.internal.reflect.DirectMethodHandleAccessor.invoke(DirectMethodHandleAccessor.java:103)
        at java.base@21.0.4/java.lang.reflect.Method.invoke(Method.java:580)
        at app//com.carrotsearch.randomizedtesting.RandomizedRunner.invoke(RandomizedRunner.java:1780)
        at app//com.carrotsearch.randomizedtesting.RandomizedRunner$8.evaluate(RandomizedRunner.java:959)
        at app//com.carrotsearch.randomizedtesting.RandomizedRunner$9.evaluate(RandomizedRunner.java:995)
        at app//com.carrotsearch.randomizedtesting.RandomizedRunner$10.evaluate(RandomizedRunner.java:1009)
        at app//org.apache.solr.BaseDistributedSearchTestCase$ShardsRepeatRule$ShardsFixedStatement.callStatement(BaseDistributedSearchTestCase.java:1088)
        at app//org.apache.solr.BaseDistributedSearchTestCase$ShardsRepeatRule$ShardsStatement.evaluate(BaseDistributedSearchTestCase.java:1059)
        at app//com.carrotsearch.randomizedtesting.rules.SystemPropertiesRestoreRule$1.evaluate(SystemPropertiesRestoreRule.java:80)
        at app//org.junit.rules.RunRules.evaluate(RunRules.java:20)
        at app//org.apache.lucene.tests.util.TestRuleSetupTeardownChained$1.evaluate(TestRuleSetupTeardownChained.java:48)
        at app//org.apache.lucene.tests.util.AbstractBeforeAfterRule$1.evaluate(AbstractBeforeAfterRule.java:43)
        at app//org.apache.lucene.tests.util.TestRuleThreadAndTestName$1.evaluate(TestRuleThreadAndTestName.java:45)
        at app//org.apache.lucene.tests.util.TestRuleIgnoreAfterMaxFailures$1.evaluate(TestRuleIgnoreAfterMaxFailures.java:60)
        at app//org.apache.lucene.tests.util.TestRuleMarkFailure$1.evaluate(TestRuleMarkFailure.java:44)
        at app//org.junit.rules.RunRules.evaluate(RunRules.java:20)
        at app//com.carrotsearch.randomizedtesting.rules.StatementAdapter.evaluate(StatementAdapter.java:36)
        at app//com.carrotsearch.randomizedtesting.ThreadLeakControl$StatementRunner.run(ThreadLeakControl.java:390)
        at app//com.carrotsearch.randomizedtesting.ThreadLeakControl.forkTimeoutingTask(ThreadLeakControl.java:843)
        at app//com.carrotsearch.randomizedtesting.ThreadLeakControl$3.evaluate(ThreadLeakControl.java:490)
        at app//com.carrotsearch.randomizedtesting.RandomizedRunner.runSingleTest(RandomizedRunner.java:968)
        at app//com.carrotsearch.randomizedtesting.RandomizedRunner$5.evaluate(RandomizedRunner.java:853)
        at app//com.carrotsearch.randomizedtesting.RandomizedRunner$6.evaluate(RandomizedRunner.java:904)
        at app//com.carrotsearch.randomizedtesting.RandomizedRunner$7.evaluate(RandomizedRunner.java:915)
        at app//com.carrotsearch.randomizedtesting.rules.StatementAdapter.evaluate(StatementAdapter.java:36)
        at app//com.carrotsearch.randomizedtesting.rules.StatementAdapter.evaluate(StatementAdapter.java:36)
        at app//org.apache.lucene.tests.util.AbstractBeforeAfterRule$1.evaluate(AbstractBeforeAfterRule.java:43)
        at app//com.carrotsearch.randomizedtesting.rules.SystemPropertiesRestoreRule$1.evaluate(SystemPropertiesRestoreRule.java:80)
        at app//org.junit.rules.RunRules.evaluate(RunRules.java:20)
        at app//org.apache.lucene.tests.util.AbstractBeforeAfterRule$1.evaluate(AbstractBeforeAfterRule.java:43)
        at app//com.carrotsearch.randomizedtesting.rules.StatementAdapter.evaluate(StatementAdapter.java:36)
        at app//org.apache.lucene.tests.util.TestRuleStoreClassName$1.evaluate(TestRuleStoreClassName.java:38)
        at app//com.carrotsearch.randomizedtesting.rules.NoShadowingOrOverridesOnMethodsRule$1.evaluate(NoShadowingOrOverridesOnMethodsRule.java:40)
        at app//com.carrotsearch.randomizedtesting.rules.NoShadowingOrOverridesOnMethodsRule$1.evaluate(NoShadowingOrOverridesOnMethodsRule.java:40)
        at app//com.carrotsearch.randomizedtesting.rules.StatementAdapter.evaluate(StatementAdapter.java:36)
        at app//com.carrotsearch.randomizedtesting.rules.StatementAdapter.evaluate(StatementAdapter.java:36)
        at app//org.apache.lucene.tests.util.TestRuleAssertionsRequired$1.evaluate(TestRuleAssertionsRequired.java:53)
        at app//org.apache.lucene.tests.util.AbstractBeforeAfterRule$1.evaluate(AbstractBeforeAfterRule.java:43)
        at app//org.apache.lucene.tests.util.TestRuleMarkFailure$1.evaluate(TestRuleMarkFailure.java:44)
        at app//org.apache.lucene.tests.util.TestRuleIgnoreAfterMaxFailures$1.evaluate(TestRuleIgnoreAfterMaxFailures.java:60)
        at app//org.apache.lucene.tests.util.TestRuleIgnoreTestSuites$1.evaluate(TestRuleIgnoreTestSuites.java:47)
        at app//org.junit.rules.RunRules.evaluate(RunRules.java:20)
        at app//com.carrotsearch.randomizedtesting.rules.StatementAdapter.evaluate(StatementAdapter.java:36)
        at app//com.carrotsearch.randomizedtesting.ThreadLeakControl$StatementRunner.run(ThreadLeakControl.java:390)
        at app//com.carrotsearch.randomizedtesting.ThreadLeakControl.lambda$forkTimeoutingTask$0(ThreadLeakControl.java:850)
        at java.base@21.0.4/java.lang.Thread.run(Thread.java:1583)

        Caused by:
        java.nio.channels.ClosedChannelException
            at org.eclipse.jetty.http2.HTTP2Session$StreamsState.onShutdown(HTTP2Session.java:2173)
            at org.eclipse.jetty.http2.HTTP2Session.onShutdown(HTTP2Session.java:1206)
            at org.eclipse.jetty.http2.HTTP2Connection$HTTP2Producer.produce(HTTP2Connection.java:441)
            at org.eclipse.jetty.util.thread.strategy.AdaptiveExecutionStrategy.produceTask(AdaptiveExecutionStrategy.java:509)
            at org.eclipse.jetty.util.thread.strategy.AdaptiveExecutionStrategy.tryProduce(AdaptiveExecutionStrategy.java:251)
            at org.eclipse.jetty.util.thread.strategy.AdaptiveExecutionStrategy.produce(AdaptiveExecutionStrategy.java:196)
            at org.eclipse.jetty.http2.HTTP2Connection.produce(HTTP2Connection.java:237)
            at org.eclipse.jetty.http2.HTTP2Connection.onFillable(HTTP2Connection.java:165)
            at org.eclipse.jetty.http2.HTTP2Connection$FillableCallback.succeeded(HTTP2Connection.java:592)
            at org.eclipse.jetty.io.FillInterest.fillable(FillInterest.java:105)
            at org.eclipse.jetty.io.SelectableChannelEndPoint$1.run(SelectableChannelEndPoint.java:54)
            at org.eclipse.jetty.util.thread.Invocable.invokeNonBlocking(Invocable.java:225)
            at org.eclipse.jetty.util.thread.strategy.AdaptiveExecutionStrategy.picRunTask(AdaptiveExecutionStrategy.java:473)
            at org.eclipse.jetty.util.thread.strategy.AdaptiveExecutionStrategy.consumeTask(AdaptiveExecutionStrategy.java:399)
            at org.eclipse.jetty.util.thread.strategy.AdaptiveExecutionStrategy.tryProduce(AdaptiveExecutionStrategy.java:255)
            at org.eclipse.jetty.util.thread.strategy.AdaptiveExecutionStrategy.produce(AdaptiveExecutionStrategy.java:196)
            at org.apache.solr.common.util.ExecutorUtil$MDCAwareThreadPoolExecutor.lambda$execute$0(ExecutorUtil.java:390)
            at java.base/java.util.concurrent.ThreadPoolExecutor.runWorker(ThreadPoolExecutor.java:1144)
            at java.base/java.util.concurrent.ThreadPoolExecutor$Worker.run(ThreadPoolExecutor.java:642)
            ... 1 more

org.apache.solr.cloud.RecoveryAfterSoftCommitTest > test suite's output saved to /home/jenkins/jenkins-agent/workspace/Solr/Solr-Test-main/solr/core/build/test-results/test/outputs/OUTPUT-org.apache.solr.cloud.RecoveryAfterSoftCommitTest.txt, copied below:
  2> 185369 INFO  (SUITE-RecoveryAfterSoftCommitTest-seed#[86D8DD490D724EE5]-worker) [] o.a.s.SolrTestCase Setting 'solr.configset.default.confdir' system property to test-framework derived value of '/home/jenkins/jenkins-agent/workspace/Solr/Solr-Test-main/solr/server/solr/configsets/_default/conf'
  2> 185370 INFO  (SUITE-RecoveryAfterSoftCommitTest-seed#[86D8DD490D724EE5]-worker) [] o.a.s.u.ErrorLogMuter Closing ErrorLogMuter-regex-66 after muting 0 log messages
  2> 185370 INFO  (SUITE-RecoveryAfterSoftCommitTest-seed#[86D8DD490D724EE5]-worker) [] o.a.s.u.ErrorLogMuter Creating ErrorLogMuter-regex-67 for ERROR logs matching regex: ignore_exception
  2> 185371 INFO  (SUITE-RecoveryAfterSoftCommitTest-seed#[86D8DD490D724EE5]-worker) [] o.a.s.SolrTestCaseJ4 Created dataDir: /home/jenkins/jenkins-agent/workspace/Solr/Solr-Test-main/solr/core/build/tmp/tests-tmp/org.apache.solr.cloud.RecoveryAfterSoftCommitTest_86D8DD490D724EE5-001/data-dir-27-001
  2> 185371 INFO  (SUITE-RecoveryAfterSoftCommitTest-seed#[86D8DD490D724EE5]-worker) [] o.a.s.SolrTestCaseJ4 Using PointFields (NUMERIC_POINTS_SYSPROP=true) w/NUMERIC_DOCVALUES_SYSPROP=false
  2> 185372 WARN  (SUITE-RecoveryAfterSoftCommitTest-seed#[86D8DD490D724EE5]-worker) [] o.e.j.u.r.ResourceFactory Leaked /home/jenkins/jenkins-agent/workspace/Solr/Solr-Test-main/solr/test-framework/build/libs/solr-test-framework-11.0.0-SNAPSHOT.jar for jar:file:///home/jenkins/jenkins-agent/workspace/Solr/Solr-Test-main/solr/test-framework/build/libs/solr-test-framework-11.0.0-SNAPSHOT.jar!/SSLTestConfig.hostname-and-ip-missmatch.keystore
  2> 185372 INFO  (SUITE-RecoveryAfterSoftCommitTest-seed#[86D8DD490D724EE5]-worker) [] o.a.s.SolrTestCaseJ4 Randomized ssl (false) and clientAuth (false) via: @org.apache.solr.SolrTestCaseJ4.SuppressSSL(bugUrl="None")
  2> 185372 INFO  (SUITE-RecoveryAfterSoftCommitTest-seed#[86D8DD490D724EE5]-worker) [] o.a.s.SolrTestCaseJ4 SecureRandom sanity checks: test.solr.allowed.securerandom=null & java.security.egd=file:/dev/./urandom
  2> 185378 INFO  (TEST-RecoveryAfterSoftCommitTest.test-seed#[86D8DD490D724EE5]) [] o.a.s.u.ErrorLogMuter Closing ErrorLogMuter-regex-67 after muting 0 log messages
  2> 185378 INFO  (TEST-RecoveryAfterSoftCommitTest.test-seed#[86D8DD490D724EE5]) [] o.a.s.u.ErrorLogMuter Creating ErrorLogMuter-regex-68 for ERROR logs matching regex: ignore_exception
  2> 185378 INFO  (TEST-RecoveryAfterSoftCommitTest.test-seed#[86D8DD490D724EE5]) [] o.a.s.c.ZkTestServer STARTING ZK TEST SERVER
  2> 185379 INFO  (ZkTestServer Run Thread) [] o.a.s.c.ZkTestServer client port: /127.0.0.1:0
  2> 185379 INFO  (ZkTestServer Run Thread) [] o.a.s.c.ZkTestServer Starting server
  2> 185381 WARN  (ZkTestServer Run Thread) [] o.a.z.s.ServerCnxnFactory maxCnxns is not configured, using default value 0.
  2> 185479 INFO  (TEST-RecoveryAfterSoftCommitTest.test-seed#[86D8DD490D724EE5]) [] o.a.s.c.ZkTestServer start zk server on port: 42847
  2> 185480 WARN  (TEST-RecoveryAfterSoftCommitTest.test-seed#[86D8DD490D724EE5]) [] o.a.s.c.c.SolrZkClient Using default ZkCredentialsInjector. ZkCredentialsInjector is not secure, it creates an empty list of credentials which leads to 'OPEN_ACL_UNSAFE' ACLs to Zookeeper nodes
  2> 185480 WARN  (TEST-RecoveryAfterSoftCommitTest.test-seed#[86D8DD490D724EE5]) [] o.a.s.c.c.SolrZkClient Using default ZkACLProvider. DefaultZkACLProvider is not secure, it creates 'OPEN_ACL_UNSAFE' ACLs to Zookeeper nodes
  2> 185480 INFO  (TEST-RecoveryAfterSoftCommitTest.test-seed#[86D8DD490D724EE5]) [] o.a.c.f.i.CuratorFrameworkImpl Starting
  2> 185482 INFO  (TEST-RecoveryAfterSoftCommitTest.test-seed#[86D8DD490D724EE5]) [] o.a.c.f.i.CuratorFrameworkImpl Default schema
  2> 185483 INFO  (TEST-RecoveryAfterSoftCommitTest.test-seed#[86D8DD490D724EE5]-EventThread) [] o.a.c.f.s.ConnectionStateManager State change: CONNECTED
  2> 185484 INFO  (TEST-RecoveryAfterSoftCommitTest.test-seed#[86D8DD490D724EE5]-EventThread) [] o.a.c.f.i.EnsembleTracker New config event received: {}
  2> 185484 INFO  (TEST-RecoveryAfterSoftCommitTest.test-seed#[86D8DD490D724EE5]-EventThread) [] o.a.c.f.i.EnsembleTracker New config event received: {}
  2> 185485 WARN  (TEST-RecoveryAfterSoftCommitTest.test-seed#[86D8DD490D724EE5]) [] o.a.s.c.c.SolrZkClient Using default ZkCredentialsInjector. ZkCredentialsInjector is not secure, it creates an empty list of credentials which leads to 'OPEN_ACL_UNSAFE' ACLs to Zookeeper nodes
  2> 185485 WARN  (TEST-RecoveryAfterSoftCommitTest.test-seed#[86D8DD490D724EE5]) [] o.a.s.c.c.SolrZkClient Using default ZkACLProvider. DefaultZkACLProvider is not secure, it creates 'OPEN_ACL_UNSAFE' ACLs to Zookeeper nodes
  2> 185485 INFO  (TEST-RecoveryAfterSoftCommitTest.test-seed#[86D8DD490D724EE5]) [] o.a.c.f.i.CuratorFrameworkImpl Starting
  2> 185486 INFO  (TEST-RecoveryAfterSoftCommitTest.test-seed#[86D8DD490D724EE5]) [] o.a.c.f.i.CuratorFrameworkImpl Default schema
  2> 185487 INFO  (TEST-RecoveryAfterSoftCommitTest.test-seed#[86D8DD490D724EE5]-EventThread) [] o.a.c.f.s.ConnectionStateManager State change: CONNECTED
  2> 185487 INFO  (TEST-RecoveryAfterSoftCommitTest.test-seed#[86D8DD490D724EE5]-EventThread) [] o.a.c.f.i.EnsembleTracker New config event received: {}
  2> 185487 INFO  (TEST-RecoveryAfterSoftCommitTest.test-seed#[86D8DD490D724EE5]-EventThread) [] o.a.c.f.i.EnsembleTracker New config event received: {}
  2> 185488 INFO  (TEST-RecoveryAfterSoftCommitTest.test-seed#[86D8DD490D724EE5]) [] o.a.s.c.ZkTestServer put /home/jenkins/jenkins-agent/workspace/Solr/Solr-Test-main/solr/core/build/resources/test/solr/collection1/conf/solrconfig-tlog.xml to /configs/conf1/solrconfig.xml
  2> 185489 INFO  (TEST-RecoveryAfterSoftCommitTest.test-seed#[86D8DD490D724EE5]) [] o.a.s.c.ZkTestServer put /home/jenkins/jenkins-agent/workspace/Solr/Solr-Test-main/solr/core/build/resources/test/solr/collection1/conf/schema.xml to /configs/conf1/schema.xml
  2> 185490 INFO  (TEST-RecoveryAfterSoftCommitTest.test-seed#[86D8DD490D724EE5]) [] o.a.s.c.ZkTestServer put /home/jenkins/jenkins-agent/workspace/Solr/Solr-Test-main/solr/core/build/resources/test/solr/collection1/conf/solrconfig.snippet.randomindexconfig.xml to /configs/conf1/solrconfig.snippet.randomindexconfig.xml
  2> 185491 INFO  (TEST-RecoveryAfterSoftCommitTest.test-seed#[86D8DD490D724EE5]) [] o.a.s.c.ZkTestServer put /home/jenkins/jenkins-agent/workspace/Solr/Solr-Test-main/solr/core/build/resources/test/solr/collection1/conf/stopwords.txt to /configs/conf1/stopwords.txt
  2> 185492 INFO  (TEST-RecoveryAfterSoftCommitTest.test-seed#[86D8DD490D724EE5]) [] o.a.s.c.ZkTestServer put /home/jenkins/jenkins-agent/workspace/Solr/Solr-Test-main/solr/core/build/resources/test/solr/collection1/conf/protwords.txt to /configs/conf1/protwords.txt
  2> 185492 INFO  (TEST-RecoveryAfterSoftCommitTest.test-seed#[86D8DD490D724EE5]) [] o.a.s.c.ZkTestServer put /home/jenkins/jenkins-agent/workspace/Solr/Solr-Test-main/solr/core/build/resources/test/solr/collection1/conf/currency.xml to /configs/conf1/currency.xml
  2> 185493 INFO  (TEST-RecoveryAfterSoftCommitTest.test-seed#[86D8DD490D724EE5]) [] o.a.s.c.ZkTestServer put /home/jenkins/jenkins-agent/workspace/Solr/Solr-Test-main/solr/core/build/resources/test/solr/collection1/conf/enumsConfig.xml to /configs/conf1/enumsConfig.xml
  2> 185494 INFO  (TEST-RecoveryAfterSoftCommitTest.test-seed#[86D8DD490D724EE5]) [] o.a.s.c.ZkTestServer put /home/jenkins/jenkins-agent/workspace/Solr/Solr-Test-main/solr/core/build/resources/test/solr/collection1/conf/open-exchange-rates.json to /configs/conf1/open-exchange-rates.json
  2> 185495 INFO  (TEST-RecoveryAfterSoftCommitTest.test-seed#[86D8DD490D724EE5]) [] o.a.s.c.ZkTestServer put /home/jenkins/jenkins-agent/workspace/Solr/Solr-Test-main/solr/core/build/resources/test/solr/collection1/conf/mapping-ISOLatin1Accent.txt to /configs/conf1/mapping-ISOLatin1Accent.txt
  2> 185495 INFO  (TEST-RecoveryAfterSoftCommitTest.test-seed#[86D8DD490D724EE5]) [] o.a.s.c.ZkTestServer put /home/jenkins/jenkins-agent/workspace/Solr/Solr-Test-main/solr/core/build/resources/test/solr/collection1/conf/old_synonyms.txt to /configs/conf1/old_synonyms.txt
  2> 185496 INFO  (TEST-RecoveryAfterSoftCommitTest.test-seed#[86D8DD490D724EE5]) [] o.a.s.c.ZkTestServer put /home/jenkins/jenkins-agent/workspace/Solr/Solr-Test-main/solr/core/build/resources/test/solr/collection1/conf/synonyms.txt to /configs/conf1/synonyms.txt
  2> 185497 INFO  (TEST-RecoveryAfterSoftCommitTest.test-seed#[86D8DD490D724EE5]) [] o.a.s.c.AbstractFullDistribZkTestBase Will use NRT replicas unless explicitly asked otherwise
  2> 185645 INFO  (TEST-RecoveryAfterSoftCommitTest.test-seed#[86D8DD490D724EE5]) [] o.a.s.e.JettySolrRunner Start Jetty (configured port=0, binding port=0)
  2> 185645 INFO  (TEST-RecoveryAfterSoftCommitTest.test-seed#[86D8DD490D724EE5]) [] o.a.s.e.JettySolrRunner Trying to start Jetty on port 0 try number 2 ...
  2> 185645 INFO  (TEST-RecoveryAfterSoftCommitTest.test-seed#[86D8DD490D724EE5]) [] o.e.j.s.Server jetty-12.1.10; built: 2026-05-31T04:45:52.925Z; git: 986024525891c2c20ff08c58ba300dc3b9847586; jvm 21.0.4+7-LTS
  2> 185646 INFO  (TEST-RecoveryAfterSoftCommitTest.test-seed#[86D8DD490D724EE5]) [] o.e.j.s.DefaultSessionIdManager Session workerName=node0
  2> 185647 WARN  (TEST-RecoveryAfterSoftCommitTest.test-seed#[86D8DD490D724EE5]) [] o.e.j.e.s.ServletContextHandler BaseResource file:///home/jenkins/jenkins-agent/workspace/Solr/Solr-Test-main/solr/core/build/tmp/tests-cwd/./ is aliased to file:///home/jenkins/jenkins-agent/workspace/Solr/Solr-Test-main/solr/core/build/tmp/tests-cwd/ in oeje10s.ServletContextHandler@14ab5839{/solr,/solr,b=file:///home/jenkins/jenkins-agent/workspace/Solr/Solr-Test-main/solr/core/build/tmp/tests-cwd/./,a=STOPPED,h=oeje10s.ServletHandler@676d0ae4{STOPPED}}. May not be supported in future releases.
  2> 185647 INFO  (TEST-RecoveryAfterSoftCommitTest.test-seed#[86D8DD490D724EE5]) [] o.e.j.s.h.ContextHandler /solr Base Resource is an alias: file:///home/jenkins/jenkins-agent/workspace/Solr/Solr-Test-main/solr/core/build/tmp/tests-cwd/./ -> file:///home/jenkins/jenkins-agent/workspace/Solr/Solr-Test-main/solr/core/build/tmp/tests-cwd/
  2> 185647 INFO  (TEST-RecoveryAfterSoftCommitTest.test-seed#[86D8DD490D724EE5]) [] o.e.j.s.h.ContextHandler Started oeje10s.ServletContextHandler@14ab5839{/solr,/solr,b=file:///home/jenkins/jenkins-agent/workspace/Solr/Solr-Test-main/solr/core/build/tmp/tests-cwd/,a=AVAILABLE,h=oeje10s.ServletHandler@676d0ae4{STARTED}}
  2> 185648 INFO  (TEST-RecoveryAfterSoftCommitTest.test-seed#[86D8DD490D724EE5]) [] o.a.s.e.JettySolrRunner Jetty properties: {solr.data.dir=/home/jenkins/jenkins-agent/workspace/Solr/Solr-Test-main/solr/core/build/tmp/tests-tmp/org.apache.solr.cloud.RecoveryAfterSoftCommitTest_86D8DD490D724EE5-001/tempDir-001/control/data, hostPort=37107, coreRootDirectory=/home/jenkins/jenkins-agent/workspace/Solr/Solr-Test-main/solr/core/build/tmp/tests-tmp/org.apache.solr.cloud.RecoveryAfterSoftCommitTest_86D8DD490D724EE5-001/control-001/cores}
  2> 185648 ERROR (TEST-RecoveryAfterSoftCommitTest.test-seed#[86D8DD490D724EE5]) [] o.a.s.u.StartupLoggingUtils Missing Java Option solr.logs.dir. Logging may be missing or incomplete.
  2> 185648 INFO  (TEST-RecoveryAfterSoftCommitTest.test-seed#[86D8DD490D724EE5]) [] o.a.s.s.CoreContainerProvider Using logger factory org.apache.logging.slf4j.Log4jLoggerFactory
  2> 185648 INFO  (TEST-RecoveryAfterSoftCommitTest.test-seed#[86D8DD490D724EE5]) [] o.a.s.s.CoreContainerProvider  ___      _       Welcome to Apache Solr™ version 11.0.0
  2> 185648 INFO  (TEST-RecoveryAfterSoftCommitTest.test-seed#[86D8DD490D724EE5]) [] o.a.s.s.CoreContainerProvider / __| ___| |_ _   Starting in cloud mode on port null
  2> 185648 INFO  (TEST-RecoveryAfterSoftCommitTest.test-seed#[86D8DD490D724EE5]) [] o.a.s.s.CoreContainerProvider \__ \/ _ \ | '_|  Install dir: /home/jenkins/jenkins-agent/workspace/Solr/Solr-Test-main/solr
  2> 185648 INFO  (TEST-RecoveryAfterSoftCommitTest.test-seed#[86D8DD490D724EE5]) [] o.a.s.s.CoreContainerProvider |___/\___/_|_|    Start time: 2026-08-09T17:06:33.166276712Z
  2> 185648 INFO  (TEST-RecoveryAfterSoftCommitTest.test-seed#[86D8DD490D724EE5]) [] o.a.s.s.CoreContainerProvider Solr Home: /home/jenkins/jenkins-agent/workspace/Solr/Solr-Test-main/solr/core/build/tmp/tests-tmp/org.apache.solr.cloud.RecoveryAfterSoftCommitTest_86D8DD490D724EE5-001/control-001 (source: servlet config: solr.solr.home)
  2> 185648 WARN  (TEST-RecoveryAfterSoftCommitTest.test-seed#[86D8DD490D724EE5]) [] o.a.s.c.c.SolrZkClient Using default ZkCredentialsInjector. ZkCredentialsInjector is not secure, it creates an empty list of credentials which leads to 'OPEN_ACL_UNSAFE' ACLs to Zookeeper nodes
  2> 185648 WARN  (TEST-RecoveryAfterSoftCommitTest.test-seed#[86D8DD490D724EE5]) [] o.a.s.c.c.SolrZkClient Using default ZkACLProvider. DefaultZkACLProvider is not secure, it creates 'OPEN_ACL_UNSAFE' ACLs to Zookeeper nodes
  2> 185648 INFO  (TEST-RecoveryAfterSoftCommitTest.test-seed#[86D8DD490D724EE5]) [] o.a.c.f.i.CuratorFrameworkImpl Starting
  2> 185650 INFO  (TEST-RecoveryAfterSoftCommitTest.test-seed#[86D8DD490D724EE5]) [] o.a.c.f.i.CuratorFrameworkImpl Default schema
  2> 185651 INFO  (TEST-RecoveryAfterSoftCommitTest.test-seed#[86D8DD490D724EE5]-EventThread) [] o.a.c.f.s.ConnectionStateManager State change: CONNECTED
  2> 185651 INFO  (TEST-RecoveryAfterSoftCommitTest.test-seed#[86D8DD490D724EE5]-EventThread) [] o.a.c.f.i.EnsembleTracker New config event received: {}
  2> 185651 INFO  (TEST-RecoveryAfterSoftCommitTest.test-seed#[86D8DD490D724EE5]-EventThread) [] o.a.c.f.i.EnsembleTracker New config event received: {}
  2> 185652 INFO  (Curator-Framework-0) [] o.a.c.f.i.CuratorFrameworkImpl backgroundOperationsLoop exiting
  2> 185753 INFO  (TEST-RecoveryAfterSoftCommitTest.test-seed#[86D8DD490D724EE5]) [] o.a.s.c.SolrXmlConfig Loading solr.xml from /home/jenkins/jenkins-agent/workspace/Solr/Solr-Test-main/solr/core/build/tmp/tests-tmp/org.apache.solr.cloud.RecoveryAfterSoftCommitTest_86D8DD490D724EE5-001/control-001/solr.xml
  2> 186687 INFO  (TEST-RecoveryAfterSoftCommitTest.test-seed#[86D8DD490D724EE5]) [] o.a.s.c.OpenTelemetryConfigurator OpenTelemetry tracer enabled with simple propagation only.
  2> 186687 INFO  (TEST-RecoveryAfterSoftCommitTest.test-seed#[86D8DD490D724EE5]) [] o.a.s.m.OtelRuntimeJvmMetrics JVM metrics are disabled
  2> 186697 INFO  (TEST-RecoveryAfterSoftCommitTest.test-seed#[86D8DD490D724EE5]) [] o.a.s.c.ZkContainer Zookeeper client=127.0.0.1:42847/solr
  2> 186697 WARN  (TEST-RecoveryAfterSoftCommitTest.test-seed#[86D8DD490D724EE5]) [] o.a.s.c.c.SolrZkClient Using default ZkCredentialsInjector. ZkCredentialsInjector is not secure, it creates an empty list of credentials which leads to 'OPEN_ACL_UNSAFE' ACLs to Zookeeper nodes
  2> 186697 WARN  (TEST-RecoveryAfterSoftCommitTest.test-seed#[86D8DD490D724EE5]) [] o.a.s.c.c.SolrZkClient Using default ZkACLProvider. DefaultZkACLProvider is not secure, it creates 'OPEN_ACL_UNSAFE' ACLs to Zookeeper nodes
  2> 186697 INFO  (TEST-RecoveryAfterSoftCommitTest.test-seed#[86D8DD490D724EE5]) [] o.a.c.f.i.CuratorFrameworkImpl Starting
  2> 186699 INFO  (TEST-RecoveryAfterSoftCommitTest.test-seed#[86D8DD490D724EE5]) [] o.a.c.f.i.CuratorFrameworkImpl Default schema
  2> 186700 INFO  (TEST-RecoveryAfterSoftCommitTest.test-seed#[86D8DD490D724EE5]-EventThread) [] o.a.c.f.s.ConnectionStateManager State change: CONNECTED
  2> 186700 INFO  (TEST-RecoveryAfterSoftCommitTest.test-seed#[86D8DD490D724EE5]-EventThread) [] o.a.c.f.i.EnsembleTracker New config event received: {}
  2> 186700 INFO  (TEST-RecoveryAfterSoftCommitTest.test-seed#[86D8DD490D724EE5]-EventThread) [] o.a.c.f.i.EnsembleTracker New config event received: {}
  2> 186700 INFO  (Curator-Framework-0) [] o.a.c.f.i.CuratorFrameworkImpl backgroundOperationsLoop exiting
  2> 186802 INFO  (TEST-RecoveryAfterSoftCommitTest.test-seed#[86D8DD490D724EE5]) [n:127.0.0.1:37107_solr] o.a.c.f.i.CuratorFrameworkImpl Starting
  2> 186803 INFO  (TEST-RecoveryAfterSoftCommitTest.test-seed#[86D8DD490D724EE5]) [n:127.0.0.1:37107_solr] o.a.c.f.i.CuratorFrameworkImpl Default schema
  2> 186804 INFO  (TEST-RecoveryAfterSoftCommitTest.test-seed#[86D8DD490D724EE5]-EventThread) [] o.a.c.f.s.ConnectionStateManager State change: CONNECTED
  2> 186805 INFO  (TEST-RecoveryAfterSoftCommitTest.test-seed#[86D8DD490D724EE5]-EventThread) [] o.a.c.f.i.EnsembleTracker New config event received: {}
  2> 186805 INFO  (TEST-RecoveryAfterSoftCommitTest.test-seed#[86D8DD490D724EE5]-EventThread) [] o.a.c.f.i.EnsembleTracker New config event received: {}
  2> 186821 WARN  (TEST-RecoveryAfterSoftCommitTest.test-seed#[86D8DD490D724EE5]) [n:127.0.0.1:37107_solr] o.a.s.c.ZkController Contents of zookeeper /security.json are world-readable; consider setting up ACLs as described in https://solr.apache.org/guide/solr/latest/deployment-guide/zookeeper-access-control.html
  2> 186823 INFO  (TEST-RecoveryAfterSoftCommitTest.test-seed#[86D8DD490D724EE5]) [n:127.0.0.1:37107_solr] o.a.s.c.ZkController The Overseer is enabled.  It will process all cluster commands & state updates.
  2> 186826 INFO  (TEST-RecoveryAfterSoftCommitTest.test-seed#[86D8DD490D724EE5]) [n:127.0.0.1:37107_solr] o.a.s.c.OverseerElectionContext I am going to be the leader 127.0.0.1:37107_solr
  2> 186827 INFO  (TEST-RecoveryAfterSoftCommitTest.test-seed#[86D8DD490D724EE5]) [n:127.0.0.1:37107_solr] o.a.s.c.Overseer Overseer (id=72082672765632516-127.0.0.1:37107_solr-n_0000000000) starting
  2> 186830 INFO  (TEST-RecoveryAfterSoftCommitTest.test-seed#[86D8DD490D724EE5]) [n:127.0.0.1:37107_solr] o.a.s.c.ZkController Register node as live in ZooKeeper: /live_nodes/127.0.0.1:37107_solr
  2> 186830 INFO  (OverseerStateUpdate-72082672765632516-127.0.0.1:37107_solr-n_0000000000) [n:127.0.0.1:37107_solr] o.a.s.c.Overseer Starting to work on the main queue : 127.0.0.1:37107_solr
  2> 186831 INFO  (OverseerStateUpdate-72082672765632516-127.0.0.1:37107_solr-n_0000000000) [n:127.0.0.1:37107_solr] o.a.s.c.c.ZkStateReader Updated live nodes from ZooKeeper... (0) -> (1)
  2> 186833 WARN  (TEST-RecoveryAfterSoftCommitTest.test-seed#[86D8DD490D724EE5]) [n:127.0.0.1:37107_solr] o.a.s.c.CoreContainer Not all security plugins configured!  authentication=disabled authorization=disabled.  Solr is only as secure as you make it. Consider configuring authentication/authorization before exposing Solr to users internal or external.  See https://s.apache.org/solrsecurity for more info
  2> 186897 INFO  (TEST-RecoveryAfterSoftCommitTest.test-seed#[86D8DD490D724EE5]) [n:127.0.0.1:37107_solr] o.a.s.c.CorePropertiesLocator Found 0 core definitions underneath /home/jenkins/jenkins-agent/workspace/Solr/Solr-Test-main/solr/core/build/tmp/tests-tmp/org.apache.solr.cloud.RecoveryAfterSoftCommitTest_86D8DD490D724EE5-001/control-001/cores
  2> 186950 INFO  (TEST-RecoveryAfterSoftCommitTest.test-seed#[86D8DD490D724EE5]) [n:127.0.0.1:37107_solr] o.e.j.e.s.ServletContextHandler Started oeje10s.ServletContextHandler@14ab5839{/solr,/solr,b=file:///home/jenkins/jenkins-agent/workspace/Solr/Solr-Test-main/solr/core/build/tmp/tests-cwd/,a=AVAILABLE,h=oeje10s.ServletHandler@676d0ae4{STARTED}}
  2> 186950 INFO  (TEST-RecoveryAfterSoftCommitTest.test-seed#[86D8DD490D724EE5]) [n:127.0.0.1:37107_solr] o.e.j.s.AbstractConnector Started oejs.ServerConnector@68cc5609{HTTP/1.1, (http/1.1, h2c)}{127.0.0.1:36809}
  2> 186950 INFO  (TEST-RecoveryAfterSoftCommitTest.test-seed#[86D8DD490D724EE5]) [n:127.0.0.1:37107_solr] o.e.j.s.Server Started oejs.Server@6df2817{STARTING}[12.1.10,sto=0] @1305ms
  2> 186953 WARN  (TEST-RecoveryAfterSoftCommitTest.test-seed#[86D8DD490D724EE5]) [] o.a.s.c.c.SolrZkClient Using default ZkCredentialsInjector. ZkCredentialsInjector is not secure, it creates an empty list of credentials which leads to 'OPEN_ACL_UNSAFE' ACLs to Zookeeper nodes
  2> 186953 WARN  (TEST-RecoveryAfterSoftCommitTest.test-seed#[86D8DD490D724EE5]) [] o.a.s.c.c.SolrZkClient Using default ZkACLProvider. DefaultZkACLProvider is not secure, it creates 'OPEN_ACL_UNSAFE' ACLs to Zookeeper nodes
  2> 186953 INFO  (TEST-RecoveryAfterSoftCommitTest.test-seed#[86D8DD490D724EE5]) [] o.a.c.f.i.CuratorFrameworkImpl Starting
  2> 186954 INFO  (TEST-RecoveryAfterSoftCommitTest.test-seed#[86D8DD490D724EE5]) [] o.a.c.f.i.CuratorFrameworkImpl Default schema
  2> 186955 INFO  (TEST-RecoveryAfterSoftCommitTest.test-seed#[86D8DD490D724EE5]-EventThread) [] o.a.c.f.s.ConnectionStateManager State change: CONNECTED
  2> 186956 INFO  (TEST-RecoveryAfterSoftCommitTest.test-seed#[86D8DD490D724EE5]-EventThread) [] o.a.c.f.i.EnsembleTracker New config event received: {}
  2> 186956 INFO  (TEST-RecoveryAfterSoftCommitTest.test-seed#[86D8DD490D724EE5]-EventThread) [] o.a.c.f.i.EnsembleTracker New config event received: {}
  2> 186957 INFO  (TEST-RecoveryAfterSoftCommitTest.test-seed#[86D8DD490D724EE5]) [] o.a.s.c.c.ZkStateReader Updated live nodes from ZooKeeper... (0) -> (1)
  2> 186957 INFO  (TEST-RecoveryAfterSoftCommitTest.test-seed#[86D8DD490D724EE5]) [] o.a.s.c.s.i.ZkClientClusterStateProvider Cluster at 127.0.0.1:42847/solr ready
  2> 186958 INFO  (SocketProxy-Acceptor-37107) [] o.a.s.u.SocketProxy accepted Socket[addr=/127.0.0.1,port=48232,localport=37107], receiveBufferSize: 65536
  2> 186960 INFO  (SocketProxy-Acceptor-37107) [] o.a.s.u.SocketProxy proxy connection Socket[addr=/127.0.0.1,port=36809,localport=32944], receiveBufferSize=65536
  2> 186965 INFO  (OverseerThreadFactory-2577-thread-1) [ c:control_collection t:null-5896] o.a.s.c.a.c.CreateCollectionCmd Create collection control_collection
  2> 186965 INFO  (OverseerThreadFactory-2577-thread-1) [ c:control_collection t:null-5896] o.a.s.c.a.c.CreateCollectionCmd solr.cloud.prs.enabled : false and collection prs : null, isPRS : false
  2> 186967 INFO  (OverseerThreadFactory-2577-thread-1) [ c:control_collection t:null-5896] o.a.s.c.c.ZkStateReader /collections/control_collection/state.json is deleted, stop watching children
  2> 186968 INFO  (zkCallback-2571-thread-1) [] o.a.s.c.c.ZkStateReader A cluster state change: [WatchedEvent state:SyncConnected type:NodeCreated path:/collections/control_collection/state.json zxid: -1] for collection [control_collection] has occurred - updating... (live nodes size: [1])
  2> 186973 INFO  (OverseerStateUpdate-72082672765632516-127.0.0.1:37107_solr-n_0000000000) [n:127.0.0.1:37107_solr] o.a.s.c.o.SliceMutator createReplica() {
  2>   "core":"control_collection_shard1_replica_n1",
  2>   "node_name":"127.0.0.1:37107_solr",
  2>   "base_url":"http://127.0.0.1:37107/solr",
  2>   "collection":"control_collection",
  2>   "shard":"shard1",
  2>   "state":"down",
  2>   "type":"NRT",
  2>   "operation":"ADDREPLICA",
  2>   "waitForFinalState":"false"} 
  2> 187076 INFO  (zkCallback-2571-thread-1) [] o.a.s.c.c.ZkStateReader A cluster state change: [WatchedEvent state:SyncConnected type:NodeDataChanged path:/collections/control_collection/state.json zxid: -1] for collection [control_collection] has occurred - updating... (live nodes size: [1])
  2> 187077 INFO  (SocketProxy-Acceptor-37107) [] o.a.s.u.SocketProxy accepted Socket[addr=/127.0.0.1,port=48240,localport=37107], receiveBufferSize: 65536
  2> 187078 INFO  (SocketProxy-Acceptor-37107) [] o.a.s.u.SocketProxy proxy connection Socket[addr=/127.0.0.1,port=36809,localport=32948], receiveBufferSize=65536
  2> 187079 INFO  (qtp88179238-5345-null-5896) [n:127.0.0.1:37107_solr x:control_collection_shard1_replica_n1 t:null-5896] o.a.s.h.a.a.CreateCore core create command "org.apache.solr.client.api.model.CreateCoreParams@369262c7"
  2> 187110 INFO  (qtp88179238-5345-null-5896) [n:127.0.0.1:37107_solr c:control_collection s:shard1 r:core_node2 x:control_collection_shard1_replica_n1 t:null-5896] o.a.s.s.IndexSchema Loaded schema test/1.0 with uniqueid field id
  2> 187124 INFO  (qtp88179238-5345-null-5896) [n:127.0.0.1:37107_solr c:control_collection s:shard1 r:core_node2 x:control_collection_shard1_replica_n1 t:null-5896] o.a.s.c.CoreContainer Creating SolrCore 'control_collection_shard1_replica_n1' using configuration from configset conf1
  2> 187124 INFO  (qtp88179238-5345-null-5896) [n:127.0.0.1:37107_solr c:control_collection s:shard1 r:core_node2 x:control_collection_shard1_replica_n1 t:null-5896] o.a.s.c.SolrCore Opening new SolrCore at [/home/jenkins/jenkins-agent/workspace/Solr/Solr-Test-main/solr/core/build/tmp/tests-tmp/org.apache.solr.cloud.RecoveryAfterSoftCommitTest_86D8DD490D724EE5-001/control-001/cores/control_collection_shard1_replica_n1], dataDir=[/home/jenkins/jenkins-agent/workspace/Solr/Solr-Test-main/solr/core/build/tmp/tests-tmp/org.apache.solr.cloud.RecoveryAfterSoftCommitTest_86D8DD490D724EE5-001/control-001/cores/control_collection_shard1_replica_n1/data/]
  2> 187125 INFO  (qtp88179238-5345-null-5896) [n:127.0.0.1:37107_solr c:control_collection s:shard1 r:core_node2 x:control_collection_shard1_replica_n1 t:null-5896] o.a.s.u.RandomMergePolicy RandomMergePolicy wrapping class org.apache.lucene.index.TieredMergePolicy: [TieredMergePolicy: maxMergeAtOnce=38, maxMergedSegmentMB=26.04744815826416, floorSegmentMB=0.8369169235229492, forceMergeDeletesPctAllowed=4.109249142246081, segmentsPerTier=44.0, maxCFSSegmentSizeMB=8.796093022208E12, noCFSRatio=0.0, deletesPctAllowed=23.96511618022082, targetSearchConcurrency=2
  2> 187126 WARN  (qtp88179238-5345-null-5896) [n:127.0.0.1:37107_solr c:control_collection s:shard1 r:core_node2 x:control_collection_shard1_replica_n1 t:null-5896] o.a.s.c.RequestHandlers INVALID paramSet a in requestHandler {type = requestHandler,name = /dump,class = DumpRequestHandler,attributes = {initParams=a, name=/dump, class=DumpRequestHandler},args = {defaults={a=A, b=B}}}
  2> 187156 INFO  (qtp88179238-5345-null-5896) [n:127.0.0.1:37107_solr c:control_collection s:shard1 r:core_node2 x:control_collection_shard1_replica_n1 t:null-5896] o.a.s.u.UpdateLog Initializing UpdateLog: dataDir= defaultSyncLevel=FLUSH numRecordsToKeep=2 maxNumLogsToKeep=10
  2> 187156 INFO  (qtp88179238-5345-null-5896) [n:127.0.0.1:37107_solr c:control_collection s:shard1 r:core_node2 x:control_collection_shard1_replica_n1 t:null-5896] o.a.s.u.CommitTracker Hard AutoCommit: disabled
  2> 187156 INFO  (qtp88179238-5345-null-5896) [n:127.0.0.1:37107_solr c:control_collection s:shard1 r:core_node2 x:control_collection_shard1_replica_n1 t:null-5896] o.a.s.u.CommitTracker Soft AutoCommit: disabled
  2> 187157 INFO  (qtp88179238-5345-null-5896) [n:127.0.0.1:37107_solr c:control_collection s:shard1 r:core_node2 x:control_collection_shard1_replica_n1 t:null-5896] o.a.s.u.RandomMergePolicy RandomMergePolicy wrapping class org.apache.lucene.index.TieredMergePolicy: [TieredMergePolicy: maxMergeAtOnce=24, maxMergedSegmentMB=10.766284942626953, floorSegmentMB=2.164525032043457, forceMergeDeletesPctAllowed=19.21805284196148, segmentsPerTier=15.0, maxCFSSegmentSizeMB=8.796093022208E12, noCFSRatio=0.6799377563323666, deletesPctAllowed=29.8866935562262, targetSearchConcurrency=8
  2> 187159 INFO  (qtp88179238-5345-null-5896) [n:127.0.0.1:37107_solr c:control_collection s:shard1 r:core_node2 x:control_collection_shard1_replica_n1 t:null-5896] o.a.s.r.ManagedResourceStorage Configured ZooKeeperStorageIO with znodeBase: /configs/conf1
  2> 187160 INFO  (qtp88179238-5345-null-5896) [n:127.0.0.1:37107_solr c:control_collection s:shard1 r:core_node2 x:control_collection_shard1_replica_n1 t:null-5896] o.a.s.r.ManagedResourceStorage Loaded null at path _rest_managed.json using ZooKeeperStorageIO:path=/configs/conf1
  2> 187160 INFO  (qtp88179238-5345-null-5896) [n:127.0.0.1:37107_solr c:control_collection s:shard1 r:core_node2 x:control_collection_shard1_replica_n1 t:null-5896] o.a.s.h.ReplicationHandler Commits will be reserved for 10000 ms
  2> 187161 INFO  (searcherExecutor-2588-thread-1-processing-127.0.0.1:37107_solr control_collection_shard1_replica_n1 null-5896 control_collection shard1 core_node2) [n:127.0.0.1:37107_solr c:control_collection s:shard1 r:core_node2 x:control_collection_shard1_replica_n1 t:null-5896] o.a.s.c.SolrCore Registered new searcher autowarm time: 0 ms
  2> 187164 INFO  (qtp88179238-5345-null-5896) [n:127.0.0.1:37107_solr c:control_collection s:shard1 r:core_node2 x:control_collection_shard1_replica_n1 t:null-5896] o.a.s.c.ZkShardTerms Successful update of terms at /collections/control_collection/terms/shard1 to Terms{values={core_node2=0}, version=0} for registerTerm
  2> 187164 INFO  (qtp88179238-5345-null-5896) [n:127.0.0.1:37107_solr c:control_collection s:shard1 r:core_node2 x:control_collection_shard1_replica_n1 t:null-5896] o.a.s.c.ShardLeaderElectionContextBase make sure parent is created /collections/control_collection/leaders/shard1
  2> 187170 INFO  (qtp88179238-5345-null-5896) [n:127.0.0.1:37107_solr c:control_collection s:shard1 r:core_node2 x:control_collection_shard1_replica_n1 t:null-5896] o.a.s.c.ShardLeaderElectionContext Enough replicas found to continue.
  2> 187170 INFO  (qtp88179238-5345-null-5896) [n:127.0.0.1:37107_solr c:control_collection s:shard1 r:core_node2 x:control_collection_shard1_replica_n1 t:null-5896] o.a.s.c.ShardLeaderElectionContext I may be the new leader - try and sync
  2> 187170 INFO  (qtp88179238-5345-null-5896) [n:127.0.0.1:37107_solr c:control_collection s:shard1 r:core_node2 x:control_collection_shard1_replica_n1 t:null-5896] o.a.s.c.SyncStrategy Sync replicas to http://127.0.0.1:37107/solr/control_collection_shard1_replica_n1/
  2> 187170 INFO  (qtp88179238-5345-null-5896) [n:127.0.0.1:37107_solr c:control_collection s:shard1 r:core_node2 x:control_collection_shard1_replica_n1 t:null-5896] o.a.s.c.SyncStrategy Sync Success - now sync replicas to me
  2> 187170 INFO  (qtp88179238-5345-null-5896) [n:127.0.0.1:37107_solr c:control_collection s:shard1 r:core_node2 x:control_collection_shard1_replica_n1 t:null-5896] o.a.s.c.SyncStrategy http://127.0.0.1:37107/solr/control_collection_shard1_replica_n1/ has no replicas
  2> 187170 INFO  (qtp88179238-5345-null-5896) [n:127.0.0.1:37107_solr c:control_collection s:shard1 r:core_node2 x:control_collection_shard1_replica_n1 t:null-5896] o.a.s.c.ShardLeaderElectionContextBase Creating leader registration node /collections/control_collection/leaders/shard1/leader after winning as /collections/control_collection/leader_elect/shard1/election/72082672765632516-core_node2-n_0000000000
  2> 187274 INFO  (zkCallback-2571-thread-1) [] o.a.s.c.c.ZkStateReader A cluster state change: [WatchedEvent state:SyncConnected type:NodeDataChanged path:/collections/control_collection/state.json zxid: -1] for collection [control_collection] has occurred - updating... (live nodes size: [1])
  2> 187275 INFO  (qtp88179238-5345-null-5896) [n:127.0.0.1:37107_solr c:control_collection s:shard1 r:core_node2 x:control_collection_shard1_replica_n1 t:null-5896] o.a.s.c.ShardLeaderElectionContext I am the new leader: http://127.0.0.1:37107/solr/control_collection_shard1_replica_n1/ shard1
  2> 187276 INFO  (qtp88179238-5345-null-5896) [n:127.0.0.1:37107_solr c:control_collection s:shard1 r:core_node2 x:control_collection_shard1_replica_n1 t:null-5896] o.a.s.c.ZkController I am the leader, no recovery necessary
  2> 187278 INFO  (qtp88179238-5345-null-5896) [n:127.0.0.1:37107_solr t:null-5896] o.a.s.s.HttpSolrCall [admin] path=/admin/cores params={coreNodeName=core_node2&collection.configName=conf1&newCollection=true&name=control_collection_shard1_replica_n1&action=CREATE&numShards=1&collection=control_collection&shard=shard1&wt=javabin&replicaType=NRT} status=0 QTime=199
  2> 187281 INFO  (qtp88179238-5342-null-5895) [n:127.0.0.1:37107_solr c:control_collection t:null-5895] o.a.s.h.a.CollectionsHandler Wait for new collection to be active for at most 45 seconds. Check all shard replicas
  2> 187379 INFO  (zkCallback-2571-thread-2) [] o.a.s.c.c.ZkStateReader A cluster state change: [WatchedEvent state:SyncConnected type:NodeDataChanged path:/collections/control_collection/state.json zxid: -1] for collection [control_collection] has occurred - updating... (live nodes size: [1])
  2> 187380 INFO  (qtp88179238-5342-null-5895) [n:127.0.0.1:37107_solr c:control_collection t:null-5895] o.a.s.s.HttpSolrCall [admin] path=/admin/collections params={collection.configName=conf1&name=control_collection&nrtReplicas=1&action=CREATE&numShards=1&createNodeSet=127.0.0.1:37107_solr&wt=javabin} status=0 QTime=418
  2> 187380 INFO  (TEST-RecoveryAfterSoftCommitTest.test-seed#[86D8DD490D724EE5]) [] o.a.s.c.AbstractFullDistribZkTestBase Waiting to see 1 active replicas in collection: control_collection
  2> 187381 INFO  (Curator-Framework-0) [] o.a.c.f.i.CuratorFrameworkImpl backgroundOperationsLoop exiting
  2> 187486 WARN  (TEST-RecoveryAfterSoftCommitTest.test-seed#[86D8DD490D724EE5]) [] o.a.s.c.c.SolrZkClient Using default ZkCredentialsInjector. ZkCredentialsInjector is not secure, it creates an empty list of credentials which leads to 'OPEN_ACL_UNSAFE' ACLs to Zookeeper nodes
  2> 187487 WARN  (TEST-RecoveryAfterSoftCommitTest.test-seed#[86D8DD490D724EE5]) [] o.a.s.c.c.SolrZkClient Using default ZkACLProvider. DefaultZkACLProvider is not secure, it creates 'OPEN_ACL_UNSAFE' ACLs to Zookeeper nodes
  2> 187487 INFO  (TEST-RecoveryAfterSoftCommitTest.test-seed#[86D8DD490D724EE5]) [] o.a.c.f.i.CuratorFrameworkImpl Starting
  2> 187488 INFO  (TEST-RecoveryAfterSoftCommitTest.test-seed#[86D8DD490D724EE5]) [] o.a.c.f.i.CuratorFrameworkImpl Default schema
  2> 187489 INFO  (TEST-RecoveryAfterSoftCommitTest.test-seed#[86D8DD490D724EE5]-EventThread) [] o.a.c.f.s.ConnectionStateManager State change: CONNECTED
  2> 187489 INFO  (TEST-RecoveryAfterSoftCommitTest.test-seed#[86D8DD490D724EE5]-EventThread) [] o.a.c.f.i.EnsembleTracker New config event received: {}
  2> 187489 INFO  (TEST-RecoveryAfterSoftCommitTest.test-seed#[86D8DD490D724EE5]-EventThread) [] o.a.c.f.i.EnsembleTracker New config event received: {}
  2> 187490 INFO  (TEST-RecoveryAfterSoftCommitTest.test-seed#[86D8DD490D724EE5]) [] o.a.s.c.c.ZkStateReader Updated live nodes from ZooKeeper... (0) -> (1)
  2> 187491 INFO  (TEST-RecoveryAfterSoftCommitTest.test-seed#[86D8DD490D724EE5]) [] o.a.s.c.s.i.ZkClientClusterStateProvider Cluster at 127.0.0.1:42847/solr ready
  2> 187491 INFO  (TEST-RecoveryAfterSoftCommitTest.test-seed#[86D8DD490D724EE5]) [] o.a.s.c.ChaosMonkey monkey: init - expire sessions:false cause connection loss:false
  2> 187492 INFO  (SocketProxy-Acceptor-37107) [] o.a.s.u.SocketProxy accepted Socket[addr=/127.0.0.1,port=54520,localport=37107], receiveBufferSize: 65536
  2> 187492 INFO  (SocketProxy-Acceptor-37107) [] o.a.s.u.SocketProxy proxy connection Socket[addr=/127.0.0.1,port=36809,localport=42740], receiveBufferSize=65536
  2> 187496 INFO  (OverseerThreadFactory-2577-thread-2) [ c:collection1 t:null-5898] o.a.s.c.a.c.CreateCollectionCmd Create collection collection1
  2> 187496 INFO  (OverseerThreadFactory-2577-thread-2) [ c:collection1 t:null-5898] o.a.s.c.a.c.CreateCollectionCmd solr.cloud.prs.enabled : false and collection prs : null, isPRS : false
  2> 187498 INFO  (OverseerThreadFactory-2577-thread-2) [ c:collection1 t:null-5898] o.a.s.c.c.ZkStateReader /collections/collection1/state.json is deleted, stop watching children
  2> 187601 INFO  (zkCallback-2571-thread-2) [] o.a.s.c.c.ZkStateReader A cluster state change: [WatchedEvent state:SyncConnected type:NodeCreated path:/collections/collection1/state.json zxid: -1] for collection [collection1] has occurred - updating... (live nodes size: [1])
  2> 187601 WARN  (OverseerThreadFactory-2577-thread-2) [ c:collection1 t:null-5898] o.a.s.c.a.c.CreateCollectionCmd It is unusual to create a collection (collection1) without cores.
  2> 187603 INFO  (qtp88179238-5344-null-5897) [n:127.0.0.1:37107_solr c:collection1 t:null-5897] o.a.s.h.a.CollectionsHandler Wait for new collection to be active for at most 45 seconds. Check all shard replicas
  2> 187603 INFO  (qtp88179238-5344-null-5897) [n:127.0.0.1:37107_solr c:collection1 t:null-5897] o.a.s.s.HttpSolrCall [admin] path=/admin/collections params={collection.configName=conf1&name=collection1&nrtReplicas=1&action=CREATE&numShards=1&createNodeSet=&wt=javabin} status=0 QTime=110
  2> 187604 INFO  (TEST-RecoveryAfterSoftCommitTest.test-seed#[86D8DD490D724EE5]) [] o.a.s.c.SolrCloudTestCase active slice count: 1 expected: 1
  2> 187604 INFO  (TEST-RecoveryAfterSoftCommitTest.test-seed#[86D8DD490D724EE5]) [] o.a.s.c.SolrCloudTestCase active replica count: 0 expected replica count: 0
  2> 187604 INFO  (TEST-RecoveryAfterSoftCommitTest.test-seed#[86D8DD490D724EE5]) [] o.a.s.c.AbstractFullDistribZkTestBase Creating jetty instances pullReplicaCount=0 numOtherReplicas=2
  2> 187763 INFO  (TEST-RecoveryAfterSoftCommitTest.test-seed#[86D8DD490D724EE5]) [] o.a.s.c.AbstractFullDistribZkTestBase create jetty 1 in directory /home/jenkins/jenkins-agent/workspace/Solr/Solr-Test-main/solr/core/build/tmp/tests-tmp/org.apache.solr.cloud.RecoveryAfterSoftCommitTest_86D8DD490D724EE5-001/shard-1-001 of type NRT for shard1
  2> 187764 INFO  (closeThreadPool-2600-thread-1) [] o.a.s.e.JettySolrRunner Start Jetty (configured port=0, binding port=0)
  2> 187764 INFO  (closeThreadPool-2600-thread-1) [] o.a.s.e.JettySolrRunner Trying to start Jetty on port 0 try number 2 ...
  2> 187764 INFO  (closeThreadPool-2600-thread-1) [] o.e.j.s.Server jetty-12.1.10; built: 2026-05-31T04:45:52.925Z; git: 986024525891c2c20ff08c58ba300dc3b9847586; jvm 21.0.4+7-LTS
  2> 187765 INFO  (closeThreadPool-2600-thread-1) [] o.e.j.s.DefaultSessionIdManager Session workerName=node0
  2> 187766 WARN  (closeThreadPool-2600-thread-1) [] o.e.j.e.s.ServletContextHandler BaseResource file:///home/jenkins/jenkins-agent/workspace/Solr/Solr-Test-main/solr/core/build/tmp/tests-cwd/./ is aliased to file:///home/jenkins/jenkins-agent/workspace/Solr/Solr-Test-main/solr/core/build/tmp/tests-cwd/ in oeje10s.ServletContextHandler@25590eb0{/solr,/solr,b=file:///home/jenkins/jenkins-agent/workspace/Solr/Solr-Test-main/solr/core/build/tmp/tests-cwd/./,a=STOPPED,h=oeje10s.ServletHandler@3cb18b75{STOPPED}}. May not be supported in future releases.
  2> 187766 INFO  (closeThreadPool-2600-thread-1) [] o.e.j.s.h.ContextHandler /solr Base Resource is an alias: file:///home/jenkins/jenkins-agent/workspace/Solr/Solr-Test-main/solr/core/build/tmp/tests-cwd/./ -> file:///home/jenkins/jenkins-agent/workspace/Solr/Solr-Test-main/solr/core/build/tmp/tests-cwd/
  2> 187766 INFO  (closeThreadPool-2600-thread-1) [] o.e.j.s.h.ContextHandler Started oeje10s.ServletContextHandler@25590eb0{/solr,/solr,b=file:///home/jenkins/jenkins-agent/workspace/Solr/Solr-Test-main/solr/core/build/tmp/tests-cwd/,a=AVAILABLE,h=oeje10s.ServletHandler@3cb18b75{STARTED}}
  2> 187767 INFO  (closeThreadPool-2600-thread-1) [] o.a.s.e.JettySolrRunner Jetty properties: {solrconfig=solrconfig.xml, solr.data.dir=/home/jenkins/jenkins-agent/workspace/Solr/Solr-Test-main/solr/core/build/tmp/tests-tmp/org.apache.solr.cloud.RecoveryAfterSoftCommitTest_86D8DD490D724EE5-001/tempDir-001/jetty1, hostPort=36305, coreRootDirectory=/home/jenkins/jenkins-agent/workspace/Solr/Solr-Test-main/solr/core/build/tmp/tests-tmp/org.apache.solr.cloud.RecoveryAfterSoftCommitTest_86D8DD490D724EE5-001/shard-1-001/cores, replicaType=NRT}
  2> 187767 ERROR (closeThreadPool-2600-thread-1) [] o.a.s.u.StartupLoggingUtils Missing Java Option solr.logs.dir. Logging may be missing or incomplete.
  2> 187767 INFO  (closeThreadPool-2600-thread-1) [] o.a.s.s.CoreContainerProvider Using logger factory org.apache.logging.slf4j.Log4jLoggerFactory
  2> 187767 INFO  (closeThreadPool-2600-thread-1) [] o.a.s.s.CoreContainerProvider  ___      _       Welcome to Apache Solr™ version 11.0.0
  2> 187767 INFO  (closeThreadPool-2600-thread-1) [] o.a.s.s.CoreContainerProvider / __| ___| |_ _   Starting in cloud mode on port null
  2> 187767 INFO  (closeThreadPool-2600-thread-1) [] o.a.s.s.CoreContainerProvider \__ \/ _ \ | '_|  Install dir: /home/jenkins/jenkins-agent/workspace/Solr/Solr-Test-main/solr
  2> 187767 INFO  (closeThreadPool-2600-thread-1) [] o.a.s.s.CoreContainerProvider |___/\___/_|_|    Start time: 2026-08-09T17:06:35.285285958Z
  2> 187767 INFO  (closeThreadPool-2600-thread-1) [] o.a.s.s.CoreContainerProvider Solr Home: /home/jenkins/jenkins-agent/workspace/Solr/Solr-Test-main/solr/core/build/tmp/tests-tmp/org.apache.solr.cloud.RecoveryAfterSoftCommitTest_86D8DD490D724EE5-001/shard-1-001 (source: servlet config: solr.solr.home)
  2> 187767 WARN  (closeThreadPool-2600-thread-1) [] o.a.s.c.c.SolrZkClient Using default ZkCredentialsInjector. ZkCredentialsInjector is not secure, it creates an empty list of credentials which leads to 'OPEN_ACL_UNSAFE' ACLs to Zookeeper nodes
  2> 187767 WARN  (closeThreadPool-2600-thread-1) [] o.a.s.c.c.SolrZkClient Using default ZkACLProvider. DefaultZkACLProvider is not secure, it creates 'OPEN_ACL_UNSAFE' ACLs to Zookeeper nodes
  2> 187767 INFO  (closeThreadPool-2600-thread-1) [] o.a.c.f.i.CuratorFrameworkImpl Starting
  2> 187769 INFO  (closeThreadPool-2600-thread-1) [] o.a.c.f.i.CuratorFrameworkImpl Default schema
  2> 187770 INFO  (closeThreadPool-2600-thread-1-EventThread) [] o.a.c.f.s.ConnectionStateManager State change: CONNECTED
  2> 187770 INFO  (closeThreadPool-2600-thread-1-EventThread) [] o.a.c.f.i.EnsembleTracker New config event received: {}
  2> 187770 INFO  (closeThreadPool-2600-thread-1-EventThread) [] o.a.c.f.i.EnsembleTracker New config event received: {}
  2> 187771 INFO  (Curator-Framework-0) [] o.a.c.f.i.CuratorFrameworkImpl backgroundOperationsLoop exiting
  2> 187871 INFO  (closeThreadPool-2600-thread-1) [] o.a.s.c.SolrXmlConfig Loading solr.xml from /home/jenkins/jenkins-agent/workspace/Solr/Solr-Test-main/solr/core/build/tmp/tests-tmp/org.apache.solr.cloud.RecoveryAfterSoftCommitTest_86D8DD490D724EE5-001/shard-1-001/solr.xml
  2> 187920 INFO  (TEST-RecoveryAfterSoftCommitTest.test-seed#[86D8DD490D724EE5]) [] o.a.s.c.AbstractFullDistribZkTestBase create jetty 2 in directory /home/jenkins/jenkins-agent/workspace/Solr/Solr-Test-main/solr/core/build/tmp/tests-tmp/org.apache.solr.cloud.RecoveryAfterSoftCommitTest_86D8DD490D724EE5-001/shard-2-001 of type NRT for shard1
  2> 187921 INFO  (closeThreadPool-2600-thread-2) [] o.a.s.e.JettySolrRunner Start Jetty (configured port=0, binding port=0)
  2> 187922 INFO  (closeThreadPool-2600-thread-2) [] o.a.s.e.JettySolrRunner Trying to start Jetty on port 0 try number 2 ...
  2> 187922 INFO  (closeThreadPool-2600-thread-2) [] o.e.j.s.Server jetty-12.1.10; built: 2026-05-31T04:45:52.925Z; git: 986024525891c2c20ff08c58ba300dc3b9847586; jvm 21.0.4+7-LTS
  2> 187923 INFO  (closeThreadPool-2600-thread-2) [] o.e.j.s.DefaultSessionIdManager Session workerName=node0
  2> 187923 WARN  (closeThreadPool-2600-thread-2) [] o.e.j.e.s.ServletContextHandler BaseResource file:///home/jenkins/jenkins-agent/workspace/Solr/Solr-Test-main/solr/core/build/tmp/tests-cwd/./ is aliased to file:///home/jenkins/jenkins-agent/workspace/Solr/Solr-Test-main/solr/core/build/tmp/tests-cwd/ in oeje10s.ServletContextHandler@1a6d6829{/solr,/solr,b=file:///home/jenkins/jenkins-agent/workspace/Solr/Solr-Test-main/solr/core/build/tmp/tests-cwd/./,a=STOPPED,h=oeje10s.ServletHandler@5007e28e{STOPPED}}. May not be supported in future releases.
  2> 187924 INFO  (closeThreadPool-2600-thread-2) [] o.e.j.s.h.ContextHandler /solr Base Resource is an alias: file:///home/jenkins/jenkins-agent/workspace/Solr/Solr-Test-main/solr/core/build/tmp/tests-cwd/./ -> file:///home/jenkins/jenkins-agent/workspace/Solr/Solr-Test-main/solr/core/build/tmp/tests-cwd/
  2> 187924 INFO  (closeThreadPool-2600-thread-2) [] o.e.j.s.h.ContextHandler Started oeje10s.ServletContextHandler@1a6d6829{/solr,/solr,b=file:///home/jenkins/jenkins-agent/workspace/Solr/Solr-Test-main/solr/core/build/tmp/tests-cwd/,a=AVAILABLE,h=oeje10s.ServletHandler@5007e28e{STARTED}}
  2> 187924 INFO  (closeThreadPool-2600-thread-2) [] o.a.s.e.JettySolrRunner Jetty properties: {solrconfig=solrconfig.xml, solr.data.dir=/home/jenkins/jenkins-agent/workspace/Solr/Solr-Test-main/solr/core/build/tmp/tests-tmp/org.apache.solr.cloud.RecoveryAfterSoftCommitTest_86D8DD490D724EE5-001/tempDir-001/jetty2, hostPort=38481, coreRootDirectory=/home/jenkins/jenkins-agent/workspace/Solr/Solr-Test-main/solr/core/build/tmp/tests-tmp/org.apache.solr.cloud.RecoveryAfterSoftCommitTest_86D8DD490D724EE5-001/shard-2-001/cores, replicaType=NRT}
  2> 187924 ERROR (closeThreadPool-2600-thread-2) [] o.a.s.u.StartupLoggingUtils Missing Java Option solr.logs.dir. Logging may be missing or incomplete.
  2> 187924 INFO  (closeThreadPool-2600-thread-2) [] o.a.s.s.CoreContainerProvider Using logger factory org.apache.logging.slf4j.Log4jLoggerFactory
  2> 187924 INFO  (closeThreadPool-2600-thread-2) [] o.a.s.s.CoreContainerProvider  ___      _       Welcome to Apache Solr™ version 11.0.0
  2> 187924 INFO  (closeThreadPool-2600-thread-2) [] o.a.s.s.CoreContainerProvider / __| ___| |_ _   Starting in cloud mode on port null
  2> 187924 INFO  (closeThreadPool-2600-thread-2) [] o.a.s.s.CoreContainerProvider \__ \/ _ \ | '_|  Install dir: /home/jenkins/jenkins-agent/workspace/Solr/Solr-Test-main/solr
  2> 187924 INFO  (closeThreadPool-2600-thread-2) [] o.a.s.s.CoreContainerProvider |___/\___/_|_|    Start time: 2026-08-09T17:06:35.442816646Z
  2> 187924 INFO  (closeThreadPool-2600-thread-2) [] o.a.s.s.CoreContainerProvider Solr Home: /home/jenkins/jenkins-agent/workspace/Solr/Solr-Test-main/solr/core/build/tmp/tests-tmp/org.apache.solr.cloud.RecoveryAfterSoftCommitTest_86D8DD490D724EE5-001/shard-2-001 (source: servlet config: solr.solr.home)
  2> 187925 WARN  (closeThreadPool-2600-thread-2) [] o.a.s.c.c.SolrZkClient Using default ZkCredentialsInjector. ZkCredentialsInjector is not secure, it creates an empty list of credentials which leads to 'OPEN_ACL_UNSAFE' ACLs to Zookeeper nodes
  2> 187925 WARN  (closeThreadPool-2600-thread-2) [] o.a.s.c.c.SolrZkClient Using default ZkACLProvider. DefaultZkACLProvider is not secure, it creates 'OPEN_ACL_UNSAFE' ACLs to Zookeeper nodes
  2> 187925 INFO  (closeThreadPool-2600-thread-2) [] o.a.c.f.i.CuratorFrameworkImpl Starting
  2> 187926 INFO  (closeThreadPool-2600-thread-2) [] o.a.c.f.i.CuratorFrameworkImpl Default schema
  2> 187927 INFO  (closeThreadPool-2600-thread-2-EventThread) [] o.a.c.f.s.ConnectionStateManager State change: CONNECTED
  2> 187928 INFO  (closeThreadPool-2600-thread-2-EventThread) [] o.a.c.f.i.EnsembleTracker New config event received: {}
  2> 187928 INFO  (closeThreadPool-2600-thread-2-EventThread) [] o.a.c.f.i.EnsembleTracker New config event received: {}
  2> 187928 INFO  (Curator-Framework-0) [] o.a.c.f.i.CuratorFrameworkImpl backgroundOperationsLoop exiting
  2> 188029 INFO  (closeThreadPool-2600-thread-2) [] o.a.s.c.SolrXmlConfig Loading solr.xml from /home/jenkins/jenkins-agent/workspace/Solr/Solr-Test-main/solr/core/build/tmp/tests-tmp/org.apache.solr.cloud.RecoveryAfterSoftCommitTest_86D8DD490D724EE5-001/shard-2-001/solr.xml
  2> 188759 INFO  (closeThreadPool-2600-thread-1) [] o.a.s.m.OtelRuntimeJvmMetrics JVM metrics are disabled
  2> 188769 INFO  (closeThreadPool-2600-thread-1) [] o.a.s.c.ZkContainer Zookeeper client=127.0.0.1:42847/solr
  2> 188769 WARN  (closeThreadPool-2600-thread-1) [] o.a.s.c.c.SolrZkClient Using default ZkCredentialsInjector. ZkCredentialsInjector is not secure, it creates an empty list of credentials which leads to 'OPEN_ACL_UNSAFE' ACLs to Zookeeper nodes
  2> 188769 WARN  (closeThreadPool-2600-thread-1) [] o.a.s.c.c.SolrZkClient Using default ZkACLProvider. DefaultZkACLProvider is not secure, it creates 'OPEN_ACL_UNSAFE' ACLs to Zookeeper nodes
  2> 188769 INFO  (closeThreadPool-2600-thread-1) [] o.a.c.f.i.CuratorFrameworkImpl Starting
  2> 188770 INFO  (closeThreadPool-2600-thread-1) [] o.a.c.f.i.CuratorFrameworkImpl Default schema
  2> 188771 INFO  (closeThreadPool-2600-thread-1-EventThread) [] o.a.c.f.s.ConnectionStateManager State change: CONNECTED
  2> 188772 INFO  (closeThreadPool-2600-thread-1-EventThread) [] o.a.c.f.i.EnsembleTracker New config event received: {}
  2> 188772 INFO  (closeThreadPool-2600-thread-1-EventThread) [] o.a.c.f.i.EnsembleTracker New config event received: {}
  2> 188772 INFO  (Curator-Framework-0) [] o.a.c.f.i.CuratorFrameworkImpl backgroundOperationsLoop exiting
  2> 188873 INFO  (closeThreadPool-2600-thread-1) [n:127.0.0.1:36305_solr] o.a.c.f.i.CuratorFrameworkImpl Starting
  2> 188874 INFO  (closeThreadPool-2600-thread-1) [n:127.0.0.1:36305_solr] o.a.c.f.i.CuratorFrameworkImpl Default schema
  2> 188875 INFO  (closeThreadPool-2600-thread-1-EventThread) [] o.a.c.f.s.ConnectionStateManager State change: CONNECTED
  2> 188876 INFO  (closeThreadPool-2600-thread-1-EventThread) [] o.a.c.f.i.EnsembleTracker New config event received: {}
  2> 188876 INFO  (closeThreadPool-2600-thread-1-EventThread) [] o.a.c.f.i.EnsembleTracker New config event received: {}
  2> 188881 WARN  (closeThreadPool-2600-thread-1) [n:127.0.0.1:36305_solr] o.a.s.c.ZkController Contents of zookeeper /security.json are world-readable; consider setting up ACLs as described in https://solr.apache.org/guide/solr/latest/deployment-guide/zookeeper-access-control.html
  2> 188882 INFO  (closeThreadPool-2600-thread-1) [n:127.0.0.1:36305_solr] o.a.s.c.c.ZkStateReader Updated live nodes from ZooKeeper... (0) -> (1)
  2> 188883 INFO  (closeThreadPool-2600-thread-1) [n:127.0.0.1:36305_solr] o.a.s.c.ZkController The Overseer is enabled.  It will process all cluster commands & state updates.
  2> 188886 INFO  (closeThreadPool-2600-thread-1) [n:127.0.0.1:36305_solr] o.a.s.c.ZkController Publish node=127.0.0.1:36305_solr as DOWN
  2> 188887 INFO  (closeThreadPool-2600-thread-1) [n:127.0.0.1:36305_solr] o.a.s.c.ZkController Register node as live in ZooKeeper: /live_nodes/127.0.0.1:36305_solr
  2> 188888 INFO  (zkCallback-2571-thread-2) [] o.a.s.c.c.ZkStateReader Updated live nodes from ZooKeeper... (1) -> (2)
  2> 188889 INFO  (zkCallback-2621-thread-1) [] o.a.s.c.c.ZkStateReader Updated live nodes from ZooKeeper... (1) -> (2)
  2> 188889 INFO  (zkCallback-2597-thread-1) [] o.a.s.c.c.ZkStateReader Updated live nodes from ZooKeeper... (1) -> (2)
  2> 188890 WARN  (closeThreadPool-2600-thread-1) [n:127.0.0.1:36305_solr] o.a.s.c.CoreContainer Not all security plugins configured!  authentication=disabled authorization=disabled.  Solr is only as secure as you make it. Consider configuring authentication/authorization before exposing Solr to users internal or external.  See https://s.apache.org/solrsecurity for more info
  2> 188909 INFO  (closeThreadPool-2600-thread-1) [n:127.0.0.1:36305_solr] o.a.s.c.CorePropertiesLocator Found 0 core definitions underneath /home/jenkins/jenkins-agent/workspace/Solr/Solr-Test-main/solr/core/build/tmp/tests-tmp/org.apache.solr.cloud.RecoveryAfterSoftCommitTest_86D8DD490D724EE5-001/shard-1-001/cores
  2> 188959 INFO  (closeThreadPool-2600-thread-1) [n:127.0.0.1:36305_solr] o.e.j.e.s.ServletContextHandler Started oeje10s.ServletContextHandler@25590eb0{/solr,/solr,b=file:///home/jenkins/jenkins-agent/workspace/Solr/Solr-Test-main/solr/core/build/tmp/tests-cwd/,a=AVAILABLE,h=oeje10s.ServletHandler@3cb18b75{STARTED}}
  2> 188959 INFO  (closeThreadPool-2600-thread-1) [n:127.0.0.1:36305_solr] o.e.j.s.AbstractConnector Started oejs.ServerConnector@4dff1d02{HTTP/1.1, (http/1.1, h2c)}{127.0.0.1:40443}
  2> 188959 INFO  (closeThreadPool-2600-thread-1) [n:127.0.0.1:36305_solr] o.e.j.s.Server Started oejs.Server@4880b841{STARTING}[12.1.10,sto=0] @1194ms
  2> 188959 INFO  (closeThreadPool-2600-thread-1) [] o.a.s.c.AbstractFullDistribZkTestBase waitForLiveNode: 127.0.0.1:36305_solr
  2> 189107 INFO  (closeThreadPool-2600-thread-2) [] o.a.s.m.OtelRuntimeJvmMetrics JVM metrics are disabled
  2> 189117 INFO  (closeThreadPool-2600-thread-2) [] o.a.s.c.ZkContainer Zookeeper client=127.0.0.1:42847/solr
  2> 189117 WARN  (closeThreadPool-2600-thread-2) [] o.a.s.c.c.SolrZkClient Using default ZkCredentialsInjector. ZkCredentialsInjector is not secure, it c

[...truncated too long message...]

	java.util.ServiceConfigurationError: Locale provider adapter "CLDR"cannot be instantiated.
	java.util.ServiceConfigurationError: Locale provider adapter "CLDR"cannot be instantiated.
java.security.policy: error adding Permission, java.net.URLPermission:
	java.util.ServiceConfigurationError: Locale provider adapter "CLDR"cannot be instantiated.
java.security.policy: error adding Permission, java.net.URLPermission:
	java.util.ServiceConfigurationError: Locale provider adapter "CLDR"cannot be instantiated.
java.security.policy: error adding Permission, java.net.URLPermission:
	java.util.ServiceConfigurationError: Locale provider adapter "CLDR"cannot be instantiated.
java.security.policy: error adding Permission, java.net.URLPermission:
	java.util.ServiceConfigurationError: Locale provider adapter "CLDR"cannot be instantiated.
java.security.policy: error adding Permission, java.net.URLPermission:
	java.util.ServiceConfigurationError: Locale provider adapter "CLDR"cannot be instantiated.
java.security.policy: error adding Permission, java.net.URLPermission:
	java.util.ServiceConfigurationError: Locale provider adapter "CLDR"cannot be instantiated.
java.security.policy: error adding Permission, java.net.URLPermission:
	java.util.ServiceConfigurationError: Locale provider adapter "CLDR"cannot be instantiated.
java.security.policy: error adding Permission, java.net.URLPermission:
	java.util.ServiceConfigurationError: Locale provider adapter "CLDR"cannot be instantiated.
java.security.policy: error adding Permission, java.net.URLPermission:
	java.util.ServiceConfigurationError: Locale provider adapter "CLDR"cannot be instantiated.
java.security.policy: error adding Permission, java.net.URLPermission:
	java.util.ServiceConfigurationError: Locale provider adapter "CLDR"cannot be instantiated.
java.security.policy: error adding Permission, java.net.URLPermission:
	java.util.ServiceConfigurationError: Locale provider adapter "CLDR"cannot be instantiated.
java.security.policy: error adding Permission, java.net.URLPermission:
	java.util.ServiceConfigurationError: Locale provider adapter "CLDR"cannot be instantiated.
java.security.policy: error adding Permission, java.net.URLPermission:
	java.util.ServiceConfigurationError: Locale provider adapter "CLDR"cannot be instantiated.
java.security.policy: error adding Permission, java.net.URLPermission:
	java.util.ServiceConfigurationError: Locale provider adapter "CLDR"cannot be instantiated.
java.security.policy: error adding Permission, java.net.URLPermission:
	java.util.ServiceConfigurationError: Locale provider adapter "CLDR"cannot be instantiated.
java.security.policy: error adding Permission, java.net.URLPermission:
	java.util.ServiceConfigurationError: Locale provider adapter "CLDR"cannot be instantiated.
java.security.policy: error adding Permission, java.net.URLPermission:
	java.util.ServiceConfigurationError: Locale provider adapter "CLDR"cannot be instantiated.
java.security.policy: error adding Permission, java.net.URLPermission:
	java.util.ServiceConfigurationError: Locale provider adapter "CLDR"cannot be instantiated.
:solr:modules:scripting:test (SUCCESS): 24 test(s), 19 skipped

> Task :solr:modules:scripting:wipeTaskTemp
> Task :solr:modules:sql:compileTestJava
> Task :solr:modules:sql:testClasses

> Task :solr:modules:sql:test
WARNING: Using incubator modules: jdk.incubator.vector
WARNING: Using incubator modules: jdk.incubator.vector
WARNING: Using incubator modules: jdk.incubator.vector
WARNING: A command line option has enabled the Security Manager
WARNING: The Security Manager is deprecated and will be removed in a future release
WARNING: A command line option has enabled the Security Manager
WARNING: The Security Manager is deprecated and will be removed in a future release
WARNING: A command line option has enabled the Security Manager
WARNING: The Security Manager is deprecated and will be removed in a future release
java.security.policy: error adding Permission, java.net.URLPermission:
	java.util.ServiceConfigurationError: Locale provider adapter "CLDR"cannot be instantiated.
java.security.policy: error adding Permission, java.net.URLPermission:
	java.util.ServiceConfigurationError: Locale provider adapter "CLDR"cannot be instantiated.
java.security.policy: error adding Permission, java.net.URLPermission:
	java.util.ServiceConfigurationError: Locale provider adapter "CLDR"cannot be instantiated.
java.security.policy: error adding Permission, java.net.URLPermission:
	java.util.ServiceConfigurationError: Locale provider adapter "CLDR"cannot be instantiated.
java.security.policy: error adding Permission, java.net.URLPermission:
	java.util.ServiceConfigurationError: Locale provider adapter "CLDR"cannot be instantiated.
java.security.policy: error adding Permission, java.net.URLPermission:
	java.util.ServiceConfigurationError: Locale provider adapter "CLDR"cannot be instantiated.
java.security.policy: error adding Permission, java.net.URLPermission:
	java.util.ServiceConfigurationError: Locale provider adapter "CLDR"cannot be instantiated.
java.security.policy: error adding Permission, java.net.URLPermission:
	java.util.ServiceConfigurationError: Locale provider adapter "CLDR"cannot be instantiated.
java.security.policy: error adding Permission, java.net.URLPermission:
	java.util.ServiceConfigurationError: Locale provider adapter "CLDR"cannot be instantiated.
java.security.policy: error adding Permission, java.net.URLPermission:
	java.util.ServiceConfigurationError: Locale provider adapter "CLDR"cannot be instantiated.
java.security.policy: error adding Permission, java.net.URLPermission:
	java.util.ServiceConfigurationError: Locale provider adapter "CLDR"cannot be instantiated.
java.security.policy: error adding Permission, java.net.URLPermission:
	java.util.ServiceConfigurationError: Locale provider adapter "CLDR"cannot be instantiated.
java.security.policy: error adding Permission, java.net.URLPermission:
	java.util.ServiceConfigurationError: Locale provider adapter "CLDR"cannot be instantiated.
java.security.policy: error adding Permission, java.net.URLPermission:
	java.util.ServiceConfigurationError: Locale provider adapter "CLDR"cannot be instantiated.
java.security.policy: error adding Permission, java.net.URLPermission:
	java.util.ServiceConfigurationError: Locale provider adapter "CLDR"cannot be instantiated.
:solr:modules:sql:test (SUCCESS): 34 test(s)

> Task :checkWorkingCopyClean
> Task :solr:modules:sql:wipeTaskTemp
The slowest tests (exceeding 500 ms) during this run:
  66.41s TestCpuAllowedLimit.testDistribLimit2 (:solr:core)
  57.20s TestCpuAllowedLimit.testDistribLimit (:solr:core)
  43.11s PeerSyncReplicationTest.test (:solr:core)
  40.74s LeaderElectionTest.testParallelElection (:solr:core)
  40.14s HttpJettySolrClientTest.testIdleTimeoutWithHttpClient (:solr:solrj-jetty)
  38.75s BasicDistributedZkTest.test (:solr:core)
  38.67s TestInPlaceUpdatesDistrib.test (:solr:core)
  38.54s TestRandomCollapseQParserPlugin.testRandomCollapseWithSort (:solr:core)
  35.14s TestCloudSearcherWarming.testPeersyncFailureReplicationSuccess (:solr:core)
  31.67s TestRangeQuery.testCompareTypesRandomRangeQueries (:solr:core)
The slowest suites (exceeding 1s) during this run:
  131.60s TestCpuAllowedLimit (:solr:core)
  81.42s LeaderElectionIntegrationTest (:solr:core)
  77.15s KnnQParserTest (:solr:core)
  67.26s TestCoordinatorRole (:solr:core)
  64.88s MultiThreadedOCPTest (:solr:core)
  63.08s TestRecovery (:solr:core)
  59.03s TestRangeQuery (:solr:core)
  53.77s CombinedQuerySolrCloudTest (:solr:core)
  52.18s ReindexCollectionTest (:solr:core)
  52.17s LeaderElectionTest (:solr:core)
ERROR: The following test(s) have failed:
  - org.apache.solr.cloud.RecoveryAfterSoftCommitTest.test (:solr:core)
    Test history: https://develocity.apache.org/scans/tests?search.rootProjectNames=solr-root&tests.container=org.apache.solr.cloud.RecoveryAfterSoftCommitTest&tests.test=test http://fucit.org/solr-jenkins-reports/history-trend-of-recent-failures.html#series/org.apache.solr.cloud.RecoveryAfterSoftCommitTest.test
    Test output: /home/jenkins/jenkins-agent/workspace/Solr/Solr-Test-main/solr/core/build/test-results/test/outputs/OUTPUT-org.apache.solr.cloud.RecoveryAfterSoftCommitTest.txt
    Reproduce with: ./gradlew :solr:core:test --tests "org.apache.solr.cloud.RecoveryAfterSoftCommitTest.test" -Ptests.haltonfailure=false "-Ptests.jvmargs=-XX:TieredStopAtLevel=1 -XX:+UseParallelGC -XX:ActiveProcessorCount=1 -XX:ReservedCodeCacheSize=120m" -Ptests.seed=86D8DD490D724EE5 -Ptests.multiplier=2 -Ptests.useSecurityManager=true -Ptests.badapples=false -Ptests.file.encoding=UTF-8


[Incubating] Problems report is available at: file:///home/jenkins/jenkins-agent/workspace/Solr/Solr-Test-main/build/reports/problems/problems-report.html

Deprecated Gradle features were used in this build, making it incompatible with Gradle 10.

You can use '--warning-mode all' to show the individual deprecation warnings and determine if they come from your own scripts or plugins.

For more on this, please refer to https://docs.gradle.org/9.6.0/userguide/command_line_interface.html#sec:command_line_warnings in the Gradle documentation.

BUILD SUCCESSFUL in 38m 39s
153 actionable tasks: 153 executed

Publishing Build Scan to Develocity...

The Develocity server (develocity.apache.org) rejected the credential with prefix '7x3jzizm4zpygv7psbkg6byvm4'.
Your credential has expired.

Build step 'Invoke Gradle script' changed build result to SUCCESS
Archiving artifacts
‘**/*.events’ doesn’t match anything: ‘**’ exists but not ‘**/*.events’
No artifacts found that match the file pattern "**/*.events,heapdumps/**,**/hs_err_pid*". Configuration error?
Recording test results
[Checks API] No suitable checks publisher found.
Build step 'Publish JUnit test result report' changed build result to UNSTABLE
Email was triggered for: Unstable (Test Failures)
Sending email for trigger: Unstable (Test Failures)

[JENKINS] Solr » Solr-Test-main - Build # 14487 - Still Unstable!

Posted by Apache Jenkins Server <je...@builds.apache.org>.
Build: https://ci-builds.apache.org/job/Solr/job/Solr-Test-main/14487/

1 tests failed.
FAILED:  org.apache.solr.cloud.RecoveryAfterSoftCommitTest.test

Error Message:
org.apache.solr.client.solrj.SolrServerException: java.nio.channels.ClosedChannelException

Stack Trace:
org.apache.solr.client.solrj.SolrServerException: java.nio.channels.ClosedChannelException
	at __randomizedtesting.SeedInfo.seed([1CFACF552405F1E5:94AEF08F8AF99C1D]:0)
	at org.apache.solr.client.solrj.impl.LBSolrClient.doRequest(LBSolrClient.java:680)
	at org.apache.solr.client.solrj.impl.LBSolrClient.request(LBSolrClient.java:582)
	at org.apache.solr.client.solrj.impl.CloudSolrClient.sendRequest(CloudSolrClient.java:1088)
	at org.apache.solr.client.solrj.impl.CloudSolrClient.requestWithRetryOnStaleState(CloudSolrClient.java:723)
	at org.apache.solr.client.solrj.impl.CloudSolrClient.request(CloudSolrClient.java:645)
	at org.apache.solr.client.solrj.SolrRequest.process(SolrRequest.java:314)
	at org.apache.solr.client.solrj.SolrClient.add(SolrClient.java:167)
	at org.apache.solr.client.solrj.SolrClient.add(SolrClient.java:132)
	at org.apache.solr.client.solrj.SolrClient.add(SolrClient.java:148)
	at org.apache.solr.cloud.RecoveryAfterSoftCommitTest.test(RecoveryAfterSoftCommitTest.java:106)
	at java.base/jdk.internal.reflect.DirectMethodHandleAccessor.invoke(DirectMethodHandleAccessor.java:103)
	at java.base/java.lang.reflect.Method.invoke(Method.java:580)
	at com.carrotsearch.randomizedtesting.RandomizedRunner.invoke(RandomizedRunner.java:1780)
	at com.carrotsearch.randomizedtesting.RandomizedRunner$8.evaluate(RandomizedRunner.java:959)
	at com.carrotsearch.randomizedtesting.RandomizedRunner$9.evaluate(RandomizedRunner.java:995)
	at com.carrotsearch.randomizedtesting.RandomizedRunner$10.evaluate(RandomizedRunner.java:1009)
	at org.apache.solr.BaseDistributedSearchTestCase$ShardsRepeatRule$ShardsFixedStatement.callStatement(BaseDistributedSearchTestCase.java:1088)
	at org.apache.solr.BaseDistributedSearchTestCase$ShardsRepeatRule$ShardsStatement.evaluate(BaseDistributedSearchTestCase.java:1059)
	at com.carrotsearch.randomizedtesting.rules.SystemPropertiesRestoreRule$1.evaluate(SystemPropertiesRestoreRule.java:80)
	at org.junit.rules.RunRules.evaluate(RunRules.java:20)
	at org.apache.lucene.tests.util.TestRuleSetupTeardownChained$1.evaluate(TestRuleSetupTeardownChained.java:48)
	at org.apache.lucene.tests.util.AbstractBeforeAfterRule$1.evaluate(AbstractBeforeAfterRule.java:43)
	at org.apache.lucene.tests.util.TestRuleThreadAndTestName$1.evaluate(TestRuleThreadAndTestName.java:45)
	at org.apache.lucene.tests.util.TestRuleIgnoreAfterMaxFailures$1.evaluate(TestRuleIgnoreAfterMaxFailures.java:60)
	at org.apache.lucene.tests.util.TestRuleMarkFailure$1.evaluate(TestRuleMarkFailure.java:44)
	at org.junit.rules.RunRules.evaluate(RunRules.java:20)
	at com.carrotsearch.randomizedtesting.rules.StatementAdapter.evaluate(StatementAdapter.java:36)
	at com.carrotsearch.randomizedtesting.ThreadLeakControl$StatementRunner.run(ThreadLeakControl.java:390)
	at com.carrotsearch.randomizedtesting.ThreadLeakControl.forkTimeoutingTask(ThreadLeakControl.java:843)
	at com.carrotsearch.randomizedtesting.ThreadLeakControl$3.evaluate(ThreadLeakControl.java:490)
	at com.carrotsearch.randomizedtesting.RandomizedRunner.runSingleTest(RandomizedRunner.java:968)
	at com.carrotsearch.randomizedtesting.RandomizedRunner$5.evaluate(RandomizedRunner.java:853)
	at com.carrotsearch.randomizedtesting.RandomizedRunner$6.evaluate(RandomizedRunner.java:904)
	at com.carrotsearch.randomizedtesting.RandomizedRunner$7.evaluate(RandomizedRunner.java:915)
	at com.carrotsearch.randomizedtesting.rules.StatementAdapter.evaluate(StatementAdapter.java:36)
	at com.carrotsearch.randomizedtesting.rules.StatementAdapter.evaluate(StatementAdapter.java:36)
	at org.apache.lucene.tests.util.AbstractBeforeAfterRule$1.evaluate(AbstractBeforeAfterRule.java:43)
	at com.carrotsearch.randomizedtesting.rules.SystemPropertiesRestoreRule$1.evaluate(SystemPropertiesRestoreRule.java:80)
	at org.junit.rules.RunRules.evaluate(RunRules.java:20)
	at org.apache.lucene.tests.util.AbstractBeforeAfterRule$1.evaluate(AbstractBeforeAfterRule.java:43)
	at com.carrotsearch.randomizedtesting.rules.StatementAdapter.evaluate(StatementAdapter.java:36)
	at org.apache.lucene.tests.util.TestRuleStoreClassName$1.evaluate(TestRuleStoreClassName.java:38)
	at com.carrotsearch.randomizedtesting.rules.NoShadowingOrOverridesOnMethodsRule$1.evaluate(NoShadowingOrOverridesOnMethodsRule.java:40)
	at com.carrotsearch.randomizedtesting.rules.NoShadowingOrOverridesOnMethodsRule$1.evaluate(NoShadowingOrOverridesOnMethodsRule.java:40)
	at com.carrotsearch.randomizedtesting.rules.StatementAdapter.evaluate(StatementAdapter.java:36)
	at com.carrotsearch.randomizedtesting.rules.StatementAdapter.evaluate(StatementAdapter.java:36)
	at org.apache.lucene.tests.util.TestRuleAssertionsRequired$1.evaluate(TestRuleAssertionsRequired.java:53)
	at org.apache.lucene.tests.util.AbstractBeforeAfterRule$1.evaluate(AbstractBeforeAfterRule.java:43)
	at org.apache.lucene.tests.util.TestRuleMarkFailure$1.evaluate(TestRuleMarkFailure.java:44)
	at org.apache.lucene.tests.util.TestRuleIgnoreAfterMaxFailures$1.evaluate(TestRuleIgnoreAfterMaxFailures.java:60)
	at org.apache.lucene.tests.util.TestRuleIgnoreTestSuites$1.evaluate(TestRuleIgnoreTestSuites.java:47)
	at org.junit.rules.RunRules.evaluate(RunRules.java:20)
	at com.carrotsearch.randomizedtesting.rules.StatementAdapter.evaluate(StatementAdapter.java:36)
	at com.carrotsearch.randomizedtesting.ThreadLeakControl$StatementRunner.run(ThreadLeakControl.java:390)
	at com.carrotsearch.randomizedtesting.ThreadLeakControl.lambda$forkTimeoutingTask$0(ThreadLeakControl.java:850)
	at java.base/java.lang.Thread.run(Thread.java:1583)
Caused by: java.nio.channels.ClosedChannelException
	at org.eclipse.jetty.http2.HTTP2Session$StreamsState.onShutdown(HTTP2Session.java:2173)
	at org.eclipse.jetty.http2.HTTP2Session.onShutdown(HTTP2Session.java:1206)
	at org.eclipse.jetty.http2.HTTP2Connection$HTTP2Producer.produce(HTTP2Connection.java:441)
	at org.eclipse.jetty.util.thread.strategy.AdaptiveExecutionStrategy.produceTask(AdaptiveExecutionStrategy.java:509)
	at org.eclipse.jetty.util.thread.strategy.AdaptiveExecutionStrategy.tryProduce(AdaptiveExecutionStrategy.java:251)
	at org.eclipse.jetty.util.thread.strategy.AdaptiveExecutionStrategy.produce(AdaptiveExecutionStrategy.java:196)
	at org.eclipse.jetty.http2.HTTP2Connection.produce(HTTP2Connection.java:237)
	at org.eclipse.jetty.http2.HTTP2Connection.onFillable(HTTP2Connection.java:165)
	at org.eclipse.jetty.http2.HTTP2Connection$FillableCallback.succeeded(HTTP2Connection.java:592)
	at org.eclipse.jetty.io.FillInterest.fillable(FillInterest.java:105)
	at org.eclipse.jetty.io.SelectableChannelEndPoint$1.run(SelectableChannelEndPoint.java:54)
	at org.eclipse.jetty.util.thread.Invocable.invokeNonBlocking(Invocable.java:225)
	at org.eclipse.jetty.util.thread.strategy.AdaptiveExecutionStrategy.picRunTask(AdaptiveExecutionStrategy.java:473)
	at org.eclipse.jetty.util.thread.strategy.AdaptiveExecutionStrategy.consumeTask(AdaptiveExecutionStrategy.java:399)
	at org.eclipse.jetty.util.thread.strategy.AdaptiveExecutionStrategy.tryProduce(AdaptiveExecutionStrategy.java:255)
	at org.eclipse.jetty.util.thread.strategy.AdaptiveExecutionStrategy.produce(AdaptiveExecutionStrategy.java:196)
	at org.apache.solr.common.util.ExecutorUtil$MDCAwareThreadPoolExecutor.lambda$execute$0(ExecutorUtil.java:390)
	at java.base/java.util.concurrent.ThreadPoolExecutor.runWorker(ThreadPoolExecutor.java:1144)
	at java.base/java.util.concurrent.ThreadPoolExecutor$Worker.run(ThreadPoolExecutor.java:642)
	... 1 more




Build Log:
[...truncated 12 lines...]
ERROR: Workspace has a .git repository, but it appears to be corrupt.
hudson.plugins.git.GitException: Command "git rev-parse --resolve-git-dir /home/jenkins/jenkins-agent/workspace/Solr/Solr-Test-main/.git" returned status code 128:
stdout: 
stderr: fatal: not a gitdir '/home/jenkins/jenkins-agent/workspace/Solr/Solr-Test-main/.git'

	at PluginClassLoader for git-client//org.jenkinsci.plugins.gitclient.CliGitAPIImpl.launchCommandIn(CliGitAPIImpl.java:2848)
	at PluginClassLoader for git-client//org.jenkinsci.plugins.gitclient.CliGitAPIImpl.launchCommandIn(CliGitAPIImpl.java:2768)
	at PluginClassLoader for git-client//org.jenkinsci.plugins.gitclient.CliGitAPIImpl.launchCommandIn(CliGitAPIImpl.java:2763)
	at PluginClassLoader for git-client//org.jenkinsci.plugins.gitclient.CliGitAPIImpl.launchCommand(CliGitAPIImpl.java:2052)
	at PluginClassLoader for git-client//org.jenkinsci.plugins.gitclient.CliGitAPIImpl.launchCommand(CliGitAPIImpl.java:2064)
	at PluginClassLoader for git-client//org.jenkinsci.plugins.gitclient.CliGitAPIImpl.hasGitRepo(CliGitAPIImpl.java:404)
	at PluginClassLoader for git-client//hudson.plugins.git.GitAPI.hasGitRepo(GitAPI.java:281)
	at jdk.internal.reflect.GeneratedMethodAccessor30.invoke(Unknown Source)
	at java.base/jdk.internal.reflect.DelegatingMethodAccessorImpl.invoke(DelegatingMethodAccessorImpl.java:43)
	at java.base/java.lang.reflect.Method.invoke(Method.java:569)
	at hudson.remoting.RemoteInvocationHandler$RPCRequest.perform(RemoteInvocationHandler.java:986)
	at hudson.remoting.RemoteInvocationHandler$RPCRequest.call(RemoteInvocationHandler.java:961)
	at hudson.remoting.RemoteInvocationHandler$RPCRequest.call(RemoteInvocationHandler.java:907)
	at hudson.remoting.UserRequest.perform(UserRequest.java:225)
	at hudson.remoting.UserRequest.perform(UserRequest.java:50)
	at hudson.remoting.Request$2.run(Request.java:391)
	at hudson.remoting.InterceptingExecutorService.lambda$wrap$0(InterceptingExecutorService.java:81)
	at java.base/java.util.concurrent.FutureTask.run(FutureTask.java:264)
	at java.base/java.util.concurrent.ThreadPoolExecutor.runWorker(ThreadPoolExecutor.java:1136)
	at java.base/java.util.concurrent.ThreadPoolExecutor$Worker.run(ThreadPoolExecutor.java:635)
	at java.base/java.lang.Thread.run(Thread.java:840)
Cloning the remote Git repository
Cloning repository https://gitbox.apache.org/repos/asf/solr.git
 > git init /home/jenkins/jenkins-agent/workspace/Solr/Solr-Test-main # timeout=10
Fetching upstream changes from https://gitbox.apache.org/repos/asf/solr.git
 > git --version # timeout=10
 > git --version # 'git version 2.43.0'
 > git fetch --tags --force --progress -- https://gitbox.apache.org/repos/asf/solr.git +refs/heads/*:refs/remotes/origin/* # timeout=10
 > git config remote.origin.url https://gitbox.apache.org/repos/asf/solr.git # timeout=10
 > git config --add remote.origin.fetch +refs/heads/*:refs/remotes/origin/* # timeout=10
Avoid second fetch
 > git rev-parse refs/remotes/origin/main^{commit} # timeout=10
Checking out Revision d5ee8873eb1342ccac9a59dc34eaab9afe88d4a8 (refs/remotes/origin/main)
 > git config core.sparsecheckout # timeout=10
 > git checkout -f d5ee8873eb1342ccac9a59dc34eaab9afe88d4a8 # timeout=10
 > git branch -a -v --no-abbrev # timeout=10
 > git checkout -b main d5ee8873eb1342ccac9a59dc34eaab9afe88d4a8 # timeout=10
Commit message: "SOLR-18332: More qt-removal from tests, rd 2 (#4713)"
 > git rev-list --no-walk d5ee8873eb1342ccac9a59dc34eaab9afe88d4a8 # timeout=10
No emails were triggered.
provisioning config files...
copy managed file [gradle.properties] to file:/home/jenkins/jenkins-agent/workspace/Solr/Solr-Test-main/gradle.properties
[Gradle] - Launching build.
[Solr-Test-main] $ /home/jenkins/jenkins-agent/workspace/Solr/Solr-Test-main/gradlew -Dtests.haltonfailure=false -Dtests.badapples=false --continue test
Downloading gradle-wrapper.jar from https://raw.githubusercontent.com/gradle/gradle/v8.10.2/gradle/wrapper/gradle-wrapper.jar
To honour the JVM settings for this build a single-use Daemon process will be forked. For more on this, please refer to https://docs.gradle.org/9.6.0/userguide/gradle_daemon.html#sec:disabling_the_daemon in the Gradle documentation.
Daemon will be stopped at the end of the build 

> Task :build-infra:compileJava
Note: /home/jenkins/jenkins-agent/workspace/Solr/Solr-Test-main/build-tools/build-infra/src/main/java/org/apache/lucene/gradle/Checksum.java uses or overrides a deprecated API.
Note: Recompile with -Xlint:deprecation for details.

> Task :build-infra:pluginDescriptors
> Task :build-infra:processResources
> Task :build-infra:classes
> Task :build-infra:jar
> Task :gitStatus
> Task :checkJdkInternalsExportedToGradle

> Task :solr:api:compileJava
Note: Some input files use or override a deprecated API.
Note: Recompile with -Xlint:deprecation for details.

> Task :solr:api:processResources NO-SOURCE
> Task :solr:api:classes
> Task :solr:api:jar

> Task :randomizationInfo
Running tests with randomization seed: tests.seed=1CFACF552405F1E5

> Task :solr:api:resolve
SLF4J(W): No SLF4J providers were found.
SLF4J(W): Defaulting to no-operation (NOP) logger implementation
SLF4J(W): See https://www.slf4j.org/codes.html#noProviders for further details.

> Task :solr:api:processTestResources
> Task :solr:core:processResources
> Task :solr:solrj:processResources
> Task :solr:solrj-jetty:processResources NO-SOURCE
> Task :solr:solrj-streaming:processResources
> Task :solr:solrj-zookeeper:processResources NO-SOURCE
> Task :solr:test-framework:processResources
> Task :solr:benchmark:processResources
> Task :solr:benchmark:processTestResources
> Task :solr:core:processTestResources
> Task :solr:modules:analysis-extras:processResources NO-SOURCE
> Task :solr:cross-dc-manager:processResources NO-SOURCE
> Task :solr:cross-dc-manager:processTestResources
> Task :solr:modules:cross-dc:processResources NO-SOURCE
> Task :solr:modules:opentelemetry:processResources NO-SOURCE
> Task :solr:server:compileJava SKIPPED
> Task :solr:server:processResources NO-SOURCE
> Task :solr:server:classes UP-TO-DATE
> Task :solr:server:compileTestJava NO-SOURCE
> Task :solr:server:processTestResources NO-SOURCE
> Task :solr:server:testClasses UP-TO-DATE
> Task :solr:server:test NO-SOURCE
> Task :solr:server:wipeTaskTemp
> Task :solr:solr-ref-guide:compileJava NO-SOURCE
> Task :solr:solr-ref-guide:processResources NO-SOURCE
> Task :solr:solr-ref-guide:classes UP-TO-DATE
> Task :solr:solr-ref-guide:copySolrjTestResources
> Task :solr:solr-ref-guide:processTestResources NO-SOURCE
> Task :solr:modules:sql:processResources
> Task :solr:solrj:processTestResources
> Task :solr:solrj-jetty:processTestResources
> Task :solr:solrj-streaming:processTestResources
> Task :solr:solrj-zookeeper:processTestResources
> Task :solr:test-framework:processTestResources
> Task :solr:webapp:processResources NO-SOURCE
> Task :solr:webapp:processTestResources NO-SOURCE
> Task :solr:modules:analysis-extras:processTestResources
> Task :solr:modules:clustering:processResources NO-SOURCE
> Task :solr:modules:clustering:processTestResources
> Task :solr:modules:cross-dc:processTestResources
> Task :solr:modules:cuvs:processResources NO-SOURCE
> Task :solr:modules:cuvs:processTestResources
> Task :solr:modules:extraction:processResources
> Task :solr:modules:extraction:processTestResources
> Task :solr:modules:gcs-repository:processResources NO-SOURCE
> Task :solr:modules:gcs-repository:processTestResources
> Task :solr:modules:jwt-auth:processResources NO-SOURCE
> Task :solr:modules:jwt-auth:processTestResources
> Task :solr:modules:langid:processResources NO-SOURCE
> Task :solr:modules:langid:processTestResources
> Task :solr:modules:language-models:processResources NO-SOURCE
> Task :solr:modules:language-models:processTestResources
> Task :solr:modules:ltr:processResources NO-SOURCE
> Task :solr:modules:ltr:processTestResources
> Task :solr:modules:opentelemetry:processTestResources
> Task :solr:modules:s3-repository:processResources NO-SOURCE
> Task :solr:modules:s3-repository:processTestResources
> Task :solr:modules:scripting:processResources NO-SOURCE
> Task :solr:modules:scripting:processTestResources
> Task :solr:modules:sql:copySolrCoreTestResources
> Task :solr:modules:sql:processTestResources

> Task :solr:solrj:openApiGenerate
Cleaned up output directory /home/jenkins/jenkins-agent/workspace/Solr/Solr-Test-main/solr/solrj/build/generated before code generation.
[openApiGenerate] Worker isolation: classloader (fast startup, but generator classes accumulate in Gradle daemon Metaspace - consider workerIsolation = "process" if you hit metaspace pressure)
No application/json content media type found in response. Response examples can currently only be generated for application/json media type.
############################################################################################
# Thanks for using OpenAPI Generator.                                                      #
# We appreciate your support! Please consider donation to help us maintain this project.   #
# https://opencollective.com/openapi_generator/donate                                      #
############################################################################################
Successfully generated code to /home/jenkins/jenkins-agent/workspace/Solr/Solr-Test-main/solr/solrj/build/generated

> Task :solr:solrj:generatedSpotlessHelper
> Task :solr:solrj:generatedSpotless

> Task :solr:solrj:compileJava
Note: Some input files use or override a deprecated API.
Note: Recompile with -Xlint:deprecation for details.

> Task :solr:solrj-jetty:compileJava
Note: /home/jenkins/jenkins-agent/workspace/Solr/Solr-Test-main/solr/solrj-jetty/src/java/org/apache/solr/client/solrj/jetty/HttpJettySolrClient.java uses or overrides a deprecated API.
Note: Recompile with -Xlint:deprecation for details.

> Task :solr:solrj-streaming:compileJava
Note: Some input files use or override a deprecated API.
Note: Recompile with -Xlint:deprecation for details.

> Task :solr:solrj-zookeeper:compileJava
Note: Some input files use or override a deprecated API.
Note: Recompile with -Xlint:deprecation for details.

> Task :solr:core:compileJava
Note: Some input files use or override a deprecated API.
Note: Recompile with -Xlint:deprecation for details.

> Task :solr:test-framework:compileJava
Note: Some input files use or override a deprecated API.
Note: Recompile with -Xlint:deprecation for details.

> Task :solr:api:compileTestJava
> Task :solr:api:testClasses
> Task :solr:core:classes
> Task :solr:core:jar
> Task :solr:solrj:classes
> Task :solr:solrj:jar
> Task :solr:solrj-jetty:classes
> Task :solr:solrj-jetty:jar
> Task :solr:solrj-streaming:classes
> Task :solr:solrj-streaming:jar
> Task :solr:solrj-zookeeper:classes
> Task :solr:solrj-zookeeper:jar
> Task :solr:test-framework:classes
> Task :solr:test-framework:jar

> Task :solr:api:test
WARNING: Using incubator modules: jdk.incubator.vector
WARNING: Using incubator modules: jdk.incubator.vector
WARNING: A command line option has enabled the Security Manager
WARNING: The Security Manager is deprecated and will be removed in a future release
WARNING: A command line option has enabled the Security Manager
WARNING: The Security Manager is deprecated and will be removed in a future release
java.security.policy: error adding Permission, java.net.URLPermission:
	java.util.ServiceConfigurationError: Locale provider adapter "CLDR"cannot be instantiated.
java.security.policy: error adding Permission, java.net.URLPermission:
	java.util.ServiceConfigurationError: Locale provider adapter "CLDR"cannot be instantiated.
java.security.policy: error adding Permission, java.net.URLPermission:
	java.util.ServiceConfigurationError: Locale provider adapter "CLDR"cannot be instantiated.
java.security.policy: error adding Permission, java.net.URLPermission:
	java.util.ServiceConfigurationError: Locale provider adapter "CLDR"cannot be instantiated.
java.security.policy: error adding Permission, java.net.URLPermission:
	java.util.ServiceConfigurationError: Locale provider adapter "CLDR"cannot be instantiated.
java.security.policy: error adding Permission, java.net.URLPermission:
	java.util.ServiceConfigurationError: Locale provider adapter "CLDR"cannot be instantiated.
java.security.policy: error adding Permission, java.net.URLPermission:
	java.util.ServiceConfigurationError: Locale provider adapter "CLDR"cannot be instantiated.
java.security.policy: error adding Permission, java.net.URLPermission:
	java.util.ServiceConfigurationError: Locale provider adapter "CLDR"cannot be instantiated.
java.security.policy: error adding Permission, java.net.URLPermission:
	java.util.ServiceConfigurationError: Locale provider adapter "CLDR"cannot be instantiated.
java.security.policy: error adding Permission, java.net.URLPermission:
	java.util.ServiceConfigurationError: Locale provider adapter "CLDR"cannot be instantiated.
:solr:api:test (SUCCESS): 19 test(s)

> Task :solr:api:wipeTaskTemp

> Task :solr:benchmark:compileJava
Note: /home/jenkins/jenkins-agent/workspace/Solr/Solr-Test-main/solr/benchmark/src/java/org/apache/solr/bench/lifecycle/SolrStartup.java uses or overrides a deprecated API.
Note: Recompile with -Xlint:deprecation for details.

> Task :solr:benchmark:classes
> Task :solr:benchmark:compileTestJava
> Task :solr:benchmark:testClasses

> Task :solr:benchmark:test
WARNING: Using incubator modules: jdk.incubator.vector
WARNING: Using incubator modules: jdk.incubator.vector
WARNING: Using incubator modules: jdk.incubator.vector
WARNING: A command line option has enabled the Security Manager
WARNING: The Security Manager is deprecated and will be removed in a future release
WARNING: A command line option has enabled the Security Manager
WARNING: The Security Manager is deprecated and will be removed in a future release
WARNING: A command line option has enabled the Security Manager
WARNING: The Security Manager is deprecated and will be removed in a future release
java.security.policy: error adding Permission, java.net.URLPermission:
	java.util.ServiceConfigurationError: Locale provider adapter "CLDR"cannot be instantiated.
java.security.policy: error adding Permission, java.net.URLPermission:
	java.util.ServiceConfigurationError: Locale provider adapter "CLDR"cannot be instantiated.
java.security.policy: error adding Permission, java.net.URLPermission:
	java.util.ServiceConfigurationError: Locale provider adapter "CLDR"cannot be instantiated.
java.security.policy: error adding Permission, java.net.URLPermission:
	java.util.ServiceConfigurationError: Locale provider adapter "CLDR"cannot be instantiated.
java.security.policy: error adding Permission, java.net.URLPermission:
	java.util.ServiceConfigurationError: Locale provider adapter "CLDR"cannot be instantiated.
java.security.policy: error adding Permission, java.net.URLPermission:
	java.util.ServiceConfigurationError: Locale provider adapter "CLDR"cannot be instantiated.
java.security.policy: error adding Permission, java.net.URLPermission:
	java.util.ServiceConfigurationError: Locale provider adapter "CLDR"cannot be instantiated.
java.security.policy: error adding Permission, java.net.URLPermission:
	java.util.ServiceConfigurationError: Locale provider adapter "CLDR"cannot be instantiated.
java.security.policy: error adding Permission, java.net.URLPermission:
	java.util.ServiceConfigurationError: Locale provider adapter "CLDR"cannot be instantiated.
java.security.policy: error adding Permission, java.net.URLPermission:
	java.util.ServiceConfigurationError: Locale provider adapter "CLDR"cannot be instantiated.
java.security.policy: error adding Permission, java.net.URLPermission:
	java.util.ServiceConfigurationError: Locale provider adapter "CLDR"cannot be instantiated.
java.security.policy: error adding Permission, java.net.URLPermission:
	java.util.ServiceConfigurationError: Locale provider adapter "CLDR"cannot be instantiated.
java.security.policy: error adding Permission, java.net.URLPermission:
	java.util.ServiceConfigurationError: Locale provider adapter "CLDR"cannot be instantiated.
java.security.policy: error adding Permission, java.net.URLPermission:
	java.util.ServiceConfigurationError: Locale provider adapter "CLDR"cannot be instantiated.
java.security.policy: error adding Permission, java.net.URLPermission:
	java.util.ServiceConfigurationError: Locale provider adapter "CLDR"cannot be instantiated.
:solr:benchmark:test (SUCCESS): 10 test(s)

> Task :solr:benchmark:wipeTaskTemp
> Task :solr:core:compileTestJava
Note: Some input files use or override a deprecated API.
Note: Recompile with -Xlint:deprecation for details.

> Task :solr:core:testClasses

> Task :solr:modules:analysis-extras:compileJava
Note: /home/jenkins/jenkins-agent/workspace/Solr/Solr-Test-main/solr/modules/analysis-extras/src/java/org/apache/solr/schema/ICUCollationField.java uses or overrides a deprecated API.
Note: Recompile with -Xlint:deprecation for details.

> Task :solr:modules:analysis-extras:classes
> Task :solr:modules:analysis-extras:jar

> Task :solr:core:test
WARNING: Using incubator modules: jdk.incubator.vector
WARNING: Using incubator modules: jdk.incubator.vector
WARNING: Using incubator modules: jdk.incubator.vector
WARNING: Using incubator modules: jdk.incubator.vector
WARNING: A command line option has enabled the Security Manager
WARNING: The Security Manager is deprecated and will be removed in a future release
WARNING: A command line option has enabled the Security Manager
WARNING: The Security Manager is deprecated and will be removed in a future release
WARNING: A command line option has enabled the Security Manager
WARNING: The Security Manager is deprecated and will be removed in a future release
WARNING: A command line option has enabled the Security Manager
WARNING: The Security Manager is deprecated and will be removed in a future release
java.security.policy: error adding Permission, java.net.URLPermission:
	java.util.ServiceConfigurationError: Locale provider adapter "CLDR"cannot be instantiated.
java.security.policy: error adding Permission, java.net.URLPermission:
	java.util.ServiceConfigurationError: Locale provider adapter "CLDR"cannot be instantiated.
java.security.policy: error adding Permission, java.net.URLPermission:
	java.util.ServiceConfigurationError: Locale provider adapter "CLDR"cannot be instantiated.
java.security.policy: error adding Permission, java.net.URLPermission:
	java.util.ServiceConfigurationError: Locale provider adapter "CLDR"cannot be instantiated.
java.security.policy: error adding Permission, java.net.URLPermission:
	java.util.ServiceConfigurationError: Locale provider adapter "CLDR"cannot be instantiated.
java.security.policy: error adding Permission, java.net.URLPermission:
	java.util.ServiceConfigurationError: Locale provider adapter "CLDR"cannot be instantiated.
java.security.policy: error adding Permission, java.net.URLPermission:
	java.util.ServiceConfigurationError: Locale provider adapter "CLDR"cannot be instantiated.
java.security.policy: error adding Permission, java.net.URLPermission:
	java.util.ServiceConfigurationError: Locale provider adapter "CLDR"cannot be instantiated.
java.security.policy: error adding Permission, java.net.URLPermission:
	java.util.ServiceConfigurationError: Locale provider adapter "CLDR"cannot be instantiated.
java.security.policy: error adding Permission, java.net.URLPermission:
	java.util.ServiceConfigurationError: Locale provider adapter "CLDR"cannot be instantiated.
java.security.policy: error adding Permission, java.net.URLPermission:
java.security.policy: error adding Permission, java.net.URLPermission:
	java.util.ServiceConfigurationError: Locale provider adapter "CLDR"cannot be instantiated.
	java.util.ServiceConfigurationError: Locale provider adapter "CLDR"cannot be instantiated.
java.security.policy: error adding Permission, java.net.URLPermission:
java.security.policy: error adding Permission, java.net.URLPermission:
	java.util.ServiceConfigurationError: Locale provider adapter "CLDR"cannot be instantiated.
java.security.policy: error adding Permission, java.net.URLPermission:
	java.util.ServiceConfigurationError: Locale provider adapter "CLDR"cannot be instantiated.
	java.util.ServiceConfigurationError: Locale provider adapter "CLDR"cannot be instantiated.
java.security.policy: error adding Permission, java.net.URLPermission:
	java.util.ServiceConfigurationError: Locale provider adapter "CLDR"cannot be instantiated.
java.security.policy: error adding Permission, java.net.URLPermission:
	java.util.ServiceConfigurationError: Locale provider adapter "CLDR"cannot be instantiated.
java.security.policy: error adding Permission, java.net.URLPermission:
	java.util.ServiceConfigurationError: Locale provider adapter "CLDR"cannot be instantiated.
java.security.policy: error adding Permission, java.net.URLPermission:
	java.util.ServiceConfigurationError: Locale provider adapter "CLDR"cannot be instantiated.
java.security.policy: error adding Permission, java.net.URLPermission:
	java.util.ServiceConfigurationError: Locale provider adapter "CLDR"cannot be instantiated.
WARNING: Test org.apache.solr.TestRandomFaceting wrote 25,077,328 bytes of output.

RecoveryAfterSoftCommitTest > test FAILED
    org.apache.solr.client.solrj.SolrServerException: java.nio.channels.ClosedChannelException
        at __randomizedtesting.SeedInfo.seed([1CFACF552405F1E5:94AEF08F8AF99C1D]:0)
        at app//org.apache.solr.client.solrj.impl.LBSolrClient.doRequest(LBSolrClient.java:680)
        at app//org.apache.solr.client.solrj.impl.LBSolrClient.request(LBSolrClient.java:582)
        at app//org.apache.solr.client.solrj.impl.CloudSolrClient.sendRequest(CloudSolrClient.java:1088)
        at app//org.apache.solr.client.solrj.impl.CloudSolrClient.requestWithRetryOnStaleState(CloudSolrClient.java:723)
        at app//org.apache.solr.client.solrj.impl.CloudSolrClient.request(CloudSolrClient.java:645)
        at app//org.apache.solr.client.solrj.SolrRequest.process(SolrRequest.java:314)
        at app//org.apache.solr.client.solrj.SolrClient.add(SolrClient.java:167)
        at app//org.apache.solr.client.solrj.SolrClient.add(SolrClient.java:132)
        at app//org.apache.solr.client.solrj.SolrClient.add(SolrClient.java:148)
        at app//org.apache.solr.cloud.RecoveryAfterSoftCommitTest.test(RecoveryAfterSoftCommitTest.java:106)
        at java.base@21.0.4/jdk.internal.reflect.DirectMethodHandleAccessor.invoke(DirectMethodHandleAccessor.java:103)
        at java.base@21.0.4/java.lang.reflect.Method.invoke(Method.java:580)
        at app//com.carrotsearch.randomizedtesting.RandomizedRunner.invoke(RandomizedRunner.java:1780)
        at app//com.carrotsearch.randomizedtesting.RandomizedRunner$8.evaluate(RandomizedRunner.java:959)
        at app//com.carrotsearch.randomizedtesting.RandomizedRunner$9.evaluate(RandomizedRunner.java:995)
        at app//com.carrotsearch.randomizedtesting.RandomizedRunner$10.evaluate(RandomizedRunner.java:1009)
        at app//org.apache.solr.BaseDistributedSearchTestCase$ShardsRepeatRule$ShardsFixedStatement.callStatement(BaseDistributedSearchTestCase.java:1088)
        at app//org.apache.solr.BaseDistributedSearchTestCase$ShardsRepeatRule$ShardsStatement.evaluate(BaseDistributedSearchTestCase.java:1059)
        at app//com.carrotsearch.randomizedtesting.rules.SystemPropertiesRestoreRule$1.evaluate(SystemPropertiesRestoreRule.java:80)
        at app//org.junit.rules.RunRules.evaluate(RunRules.java:20)
        at app//org.apache.lucene.tests.util.TestRuleSetupTeardownChained$1.evaluate(TestRuleSetupTeardownChained.java:48)
        at app//org.apache.lucene.tests.util.AbstractBeforeAfterRule$1.evaluate(AbstractBeforeAfterRule.java:43)
        at app//org.apache.lucene.tests.util.TestRuleThreadAndTestName$1.evaluate(TestRuleThreadAndTestName.java:45)
        at app//org.apache.lucene.tests.util.TestRuleIgnoreAfterMaxFailures$1.evaluate(TestRuleIgnoreAfterMaxFailures.java:60)
        at app//org.apache.lucene.tests.util.TestRuleMarkFailure$1.evaluate(TestRuleMarkFailure.java:44)
        at app//org.junit.rules.RunRules.evaluate(RunRules.java:20)
        at app//com.carrotsearch.randomizedtesting.rules.StatementAdapter.evaluate(StatementAdapter.java:36)
        at app//com.carrotsearch.randomizedtesting.ThreadLeakControl$StatementRunner.run(ThreadLeakControl.java:390)
        at app//com.carrotsearch.randomizedtesting.ThreadLeakControl.forkTimeoutingTask(ThreadLeakControl.java:843)
        at app//com.carrotsearch.randomizedtesting.ThreadLeakControl$3.evaluate(ThreadLeakControl.java:490)
        at app//com.carrotsearch.randomizedtesting.RandomizedRunner.runSingleTest(RandomizedRunner.java:968)
        at app//com.carrotsearch.randomizedtesting.RandomizedRunner$5.evaluate(RandomizedRunner.java:853)
        at app//com.carrotsearch.randomizedtesting.RandomizedRunner$6.evaluate(RandomizedRunner.java:904)
        at app//com.carrotsearch.randomizedtesting.RandomizedRunner$7.evaluate(RandomizedRunner.java:915)
        at app//com.carrotsearch.randomizedtesting.rules.StatementAdapter.evaluate(StatementAdapter.java:36)
        at app//com.carrotsearch.randomizedtesting.rules.StatementAdapter.evaluate(StatementAdapter.java:36)
        at app//org.apache.lucene.tests.util.AbstractBeforeAfterRule$1.evaluate(AbstractBeforeAfterRule.java:43)
        at app//com.carrotsearch.randomizedtesting.rules.SystemPropertiesRestoreRule$1.evaluate(SystemPropertiesRestoreRule.java:80)
        at app//org.junit.rules.RunRules.evaluate(RunRules.java:20)
        at app//org.apache.lucene.tests.util.AbstractBeforeAfterRule$1.evaluate(AbstractBeforeAfterRule.java:43)
        at app//com.carrotsearch.randomizedtesting.rules.StatementAdapter.evaluate(StatementAdapter.java:36)
        at app//org.apache.lucene.tests.util.TestRuleStoreClassName$1.evaluate(TestRuleStoreClassName.java:38)
        at app//com.carrotsearch.randomizedtesting.rules.NoShadowingOrOverridesOnMethodsRule$1.evaluate(NoShadowingOrOverridesOnMethodsRule.java:40)
        at app//com.carrotsearch.randomizedtesting.rules.NoShadowingOrOverridesOnMethodsRule$1.evaluate(NoShadowingOrOverridesOnMethodsRule.java:40)
        at app//com.carrotsearch.randomizedtesting.rules.StatementAdapter.evaluate(StatementAdapter.java:36)
        at app//com.carrotsearch.randomizedtesting.rules.StatementAdapter.evaluate(StatementAdapter.java:36)
        at app//org.apache.lucene.tests.util.TestRuleAssertionsRequired$1.evaluate(TestRuleAssertionsRequired.java:53)
        at app//org.apache.lucene.tests.util.AbstractBeforeAfterRule$1.evaluate(AbstractBeforeAfterRule.java:43)
        at app//org.apache.lucene.tests.util.TestRuleMarkFailure$1.evaluate(TestRuleMarkFailure.java:44)
        at app//org.apache.lucene.tests.util.TestRuleIgnoreAfterMaxFailures$1.evaluate(TestRuleIgnoreAfterMaxFailures.java:60)
        at app//org.apache.lucene.tests.util.TestRuleIgnoreTestSuites$1.evaluate(TestRuleIgnoreTestSuites.java:47)
        at app//org.junit.rules.RunRules.evaluate(RunRules.java:20)
        at app//com.carrotsearch.randomizedtesting.rules.StatementAdapter.evaluate(StatementAdapter.java:36)
        at app//com.carrotsearch.randomizedtesting.ThreadLeakControl$StatementRunner.run(ThreadLeakControl.java:390)
        at app//com.carrotsearch.randomizedtesting.ThreadLeakControl.lambda$forkTimeoutingTask$0(ThreadLeakControl.java:850)
        at java.base@21.0.4/java.lang.Thread.run(Thread.java:1583)

        Caused by:
        java.nio.channels.ClosedChannelException
            at org.eclipse.jetty.http2.HTTP2Session$StreamsState.onShutdown(HTTP2Session.java:2173)
            at org.eclipse.jetty.http2.HTTP2Session.onShutdown(HTTP2Session.java:1206)
            at org.eclipse.jetty.http2.HTTP2Connection$HTTP2Producer.produce(HTTP2Connection.java:441)
            at org.eclipse.jetty.util.thread.strategy.AdaptiveExecutionStrategy.produceTask(AdaptiveExecutionStrategy.java:509)
            at org.eclipse.jetty.util.thread.strategy.AdaptiveExecutionStrategy.tryProduce(AdaptiveExecutionStrategy.java:251)
            at org.eclipse.jetty.util.thread.strategy.AdaptiveExecutionStrategy.produce(AdaptiveExecutionStrategy.java:196)
            at org.eclipse.jetty.http2.HTTP2Connection.produce(HTTP2Connection.java:237)
            at org.eclipse.jetty.http2.HTTP2Connection.onFillable(HTTP2Connection.java:165)
            at org.eclipse.jetty.http2.HTTP2Connection$FillableCallback.succeeded(HTTP2Connection.java:592)
            at org.eclipse.jetty.io.FillInterest.fillable(FillInterest.java:105)
            at org.eclipse.jetty.io.SelectableChannelEndPoint$1.run(SelectableChannelEndPoint.java:54)
            at org.eclipse.jetty.util.thread.Invocable.invokeNonBlocking(Invocable.java:225)
            at org.eclipse.jetty.util.thread.strategy.AdaptiveExecutionStrategy.picRunTask(AdaptiveExecutionStrategy.java:473)
            at org.eclipse.jetty.util.thread.strategy.AdaptiveExecutionStrategy.consumeTask(AdaptiveExecutionStrategy.java:399)
            at org.eclipse.jetty.util.thread.strategy.AdaptiveExecutionStrategy.tryProduce(AdaptiveExecutionStrategy.java:255)
            at org.eclipse.jetty.util.thread.strategy.AdaptiveExecutionStrategy.produce(AdaptiveExecutionStrategy.java:196)
            at org.apache.solr.common.util.ExecutorUtil$MDCAwareThreadPoolExecutor.lambda$execute$0(ExecutorUtil.java:390)
            at java.base/java.util.concurrent.ThreadPoolExecutor.runWorker(ThreadPoolExecutor.java:1144)
            at java.base/java.util.concurrent.ThreadPoolExecutor$Worker.run(ThreadPoolExecutor.java:642)
            ... 1 more

org.apache.solr.cloud.RecoveryAfterSoftCommitTest > test suite's output saved to /home/jenkins/jenkins-agent/workspace/Solr/Solr-Test-main/solr/core/build/test-results/test/outputs/OUTPUT-org.apache.solr.cloud.RecoveryAfterSoftCommitTest.txt, copied below:
  2> 191385 INFO  (SUITE-RecoveryAfterSoftCommitTest-seed#[1CFACF552405F1E5]-worker) [] o.a.s.SolrTestCase Setting 'solr.configset.default.confdir' system property to test-framework derived value of '/home/jenkins/jenkins-agent/workspace/Solr/Solr-Test-main/solr/server/solr/configsets/_default/conf'
  2> 191385 INFO  (SUITE-RecoveryAfterSoftCommitTest-seed#[1CFACF552405F1E5]-worker) [] o.a.s.u.ErrorLogMuter Closing ErrorLogMuter-regex-66 after muting 0 log messages
  2> 191386 INFO  (SUITE-RecoveryAfterSoftCommitTest-seed#[1CFACF552405F1E5]-worker) [] o.a.s.u.ErrorLogMuter Creating ErrorLogMuter-regex-67 for ERROR logs matching regex: ignore_exception
  2> 191386 INFO  (SUITE-RecoveryAfterSoftCommitTest-seed#[1CFACF552405F1E5]-worker) [] o.a.s.SolrTestCaseJ4 Created dataDir: /home/jenkins/jenkins-agent/workspace/Solr/Solr-Test-main/solr/core/build/tmp/tests-tmp/org.apache.solr.cloud.RecoveryAfterSoftCommitTest_1CFACF552405F1E5-001/data-dir-27-001
  2> 191386 INFO  (SUITE-RecoveryAfterSoftCommitTest-seed#[1CFACF552405F1E5]-worker) [] o.a.s.SolrTestCaseJ4 Using PointFields (NUMERIC_POINTS_SYSPROP=true) w/NUMERIC_DOCVALUES_SYSPROP=false
  2> 191388 WARN  (SUITE-RecoveryAfterSoftCommitTest-seed#[1CFACF552405F1E5]-worker) [] o.e.j.u.r.ResourceFactory Leaked /home/jenkins/jenkins-agent/workspace/Solr/Solr-Test-main/solr/test-framework/build/libs/solr-test-framework-11.0.0-SNAPSHOT.jar for jar:file:///home/jenkins/jenkins-agent/workspace/Solr/Solr-Test-main/solr/test-framework/build/libs/solr-test-framework-11.0.0-SNAPSHOT.jar!/SSLTestConfig.hostname-and-ip-missmatch.keystore
  2> 191388 INFO  (SUITE-RecoveryAfterSoftCommitTest-seed#[1CFACF552405F1E5]-worker) [] o.a.s.SolrTestCaseJ4 Randomized ssl (false) and clientAuth (false) via: @org.apache.solr.SolrTestCaseJ4.SuppressSSL(bugUrl="None")
  2> 191388 INFO  (SUITE-RecoveryAfterSoftCommitTest-seed#[1CFACF552405F1E5]-worker) [] o.a.s.SolrTestCaseJ4 SecureRandom sanity checks: test.solr.allowed.securerandom=null & java.security.egd=file:/dev/./urandom
  2> 191393 INFO  (TEST-RecoveryAfterSoftCommitTest.test-seed#[1CFACF552405F1E5]) [] o.a.s.u.ErrorLogMuter Closing ErrorLogMuter-regex-67 after muting 0 log messages
  2> 191393 INFO  (TEST-RecoveryAfterSoftCommitTest.test-seed#[1CFACF552405F1E5]) [] o.a.s.u.ErrorLogMuter Creating ErrorLogMuter-regex-68 for ERROR logs matching regex: ignore_exception
  2> 191394 INFO  (TEST-RecoveryAfterSoftCommitTest.test-seed#[1CFACF552405F1E5]) [] o.a.s.c.ZkTestServer STARTING ZK TEST SERVER
  2> 191394 INFO  (ZkTestServer Run Thread) [] o.a.s.c.ZkTestServer client port: /127.0.0.1:0
  2> 191394 INFO  (ZkTestServer Run Thread) [] o.a.s.c.ZkTestServer Starting server
  2> 191395 WARN  (ZkTestServer Run Thread) [] o.a.z.s.ServerCnxnFactory maxCnxns is not configured, using default value 0.
  2> 191494 INFO  (TEST-RecoveryAfterSoftCommitTest.test-seed#[1CFACF552405F1E5]) [] o.a.s.c.ZkTestServer start zk server on port: 38115
  2> 191495 WARN  (TEST-RecoveryAfterSoftCommitTest.test-seed#[1CFACF552405F1E5]) [] o.a.s.c.c.SolrZkClient Using default ZkCredentialsInjector. ZkCredentialsInjector is not secure, it creates an empty list of credentials which leads to 'OPEN_ACL_UNSAFE' ACLs to Zookeeper nodes
  2> 191495 WARN  (TEST-RecoveryAfterSoftCommitTest.test-seed#[1CFACF552405F1E5]) [] o.a.s.c.c.SolrZkClient Using default ZkACLProvider. DefaultZkACLProvider is not secure, it creates 'OPEN_ACL_UNSAFE' ACLs to Zookeeper nodes
  2> 191496 INFO  (TEST-RecoveryAfterSoftCommitTest.test-seed#[1CFACF552405F1E5]) [] o.a.c.f.i.CuratorFrameworkImpl Starting
  2> 191497 INFO  (TEST-RecoveryAfterSoftCommitTest.test-seed#[1CFACF552405F1E5]) [] o.a.c.f.i.CuratorFrameworkImpl Default schema
  2> 191499 INFO  (TEST-RecoveryAfterSoftCommitTest.test-seed#[1CFACF552405F1E5]-EventThread) [] o.a.c.f.s.ConnectionStateManager State change: CONNECTED
  2> 191499 INFO  (TEST-RecoveryAfterSoftCommitTest.test-seed#[1CFACF552405F1E5]-EventThread) [] o.a.c.f.i.EnsembleTracker New config event received: {}
  2> 191499 INFO  (TEST-RecoveryAfterSoftCommitTest.test-seed#[1CFACF552405F1E5]-EventThread) [] o.a.c.f.i.EnsembleTracker New config event received: {}
  2> 191500 WARN  (TEST-RecoveryAfterSoftCommitTest.test-seed#[1CFACF552405F1E5]) [] o.a.s.c.c.SolrZkClient Using default ZkCredentialsInjector. ZkCredentialsInjector is not secure, it creates an empty list of credentials which leads to 'OPEN_ACL_UNSAFE' ACLs to Zookeeper nodes
  2> 191501 WARN  (TEST-RecoveryAfterSoftCommitTest.test-seed#[1CFACF552405F1E5]) [] o.a.s.c.c.SolrZkClient Using default ZkACLProvider. DefaultZkACLProvider is not secure, it creates 'OPEN_ACL_UNSAFE' ACLs to Zookeeper nodes
  2> 191501 INFO  (TEST-RecoveryAfterSoftCommitTest.test-seed#[1CFACF552405F1E5]) [] o.a.c.f.i.CuratorFrameworkImpl Starting
  2> 191502 INFO  (TEST-RecoveryAfterSoftCommitTest.test-seed#[1CFACF552405F1E5]) [] o.a.c.f.i.CuratorFrameworkImpl Default schema
  2> 191503 INFO  (TEST-RecoveryAfterSoftCommitTest.test-seed#[1CFACF552405F1E5]-EventThread) [] o.a.c.f.s.ConnectionStateManager State change: CONNECTED
  2> 191503 INFO  (TEST-RecoveryAfterSoftCommitTest.test-seed#[1CFACF552405F1E5]-EventThread) [] o.a.c.f.i.EnsembleTracker New config event received: {}
  2> 191503 INFO  (TEST-RecoveryAfterSoftCommitTest.test-seed#[1CFACF552405F1E5]-EventThread) [] o.a.c.f.i.EnsembleTracker New config event received: {}
  2> 191504 INFO  (TEST-RecoveryAfterSoftCommitTest.test-seed#[1CFACF552405F1E5]) [] o.a.s.c.ZkTestServer put /home/jenkins/jenkins-agent/workspace/Solr/Solr-Test-main/solr/core/build/resources/test/solr/collection1/conf/solrconfig-tlog.xml to /configs/conf1/solrconfig.xml
  2> 191505 INFO  (TEST-RecoveryAfterSoftCommitTest.test-seed#[1CFACF552405F1E5]) [] o.a.s.c.ZkTestServer put /home/jenkins/jenkins-agent/workspace/Solr/Solr-Test-main/solr/core/build/resources/test/solr/collection1/conf/schema.xml to /configs/conf1/schema.xml
  2> 191506 INFO  (TEST-RecoveryAfterSoftCommitTest.test-seed#[1CFACF552405F1E5]) [] o.a.s.c.ZkTestServer put /home/jenkins/jenkins-agent/workspace/Solr/Solr-Test-main/solr/core/build/resources/test/solr/collection1/conf/solrconfig.snippet.randomindexconfig.xml to /configs/conf1/solrconfig.snippet.randomindexconfig.xml
  2> 191507 INFO  (TEST-RecoveryAfterSoftCommitTest.test-seed#[1CFACF552405F1E5]) [] o.a.s.c.ZkTestServer put /home/jenkins/jenkins-agent/workspace/Solr/Solr-Test-main/solr/core/build/resources/test/solr/collection1/conf/stopwords.txt to /configs/conf1/stopwords.txt
  2> 191508 INFO  (TEST-RecoveryAfterSoftCommitTest.test-seed#[1CFACF552405F1E5]) [] o.a.s.c.ZkTestServer put /home/jenkins/jenkins-agent/workspace/Solr/Solr-Test-main/solr/core/build/resources/test/solr/collection1/conf/protwords.txt to /configs/conf1/protwords.txt
  2> 191509 INFO  (TEST-RecoveryAfterSoftCommitTest.test-seed#[1CFACF552405F1E5]) [] o.a.s.c.ZkTestServer put /home/jenkins/jenkins-agent/workspace/Solr/Solr-Test-main/solr/core/build/resources/test/solr/collection1/conf/currency.xml to /configs/conf1/currency.xml
  2> 191510 INFO  (TEST-RecoveryAfterSoftCommitTest.test-seed#[1CFACF552405F1E5]) [] o.a.s.c.ZkTestServer put /home/jenkins/jenkins-agent/workspace/Solr/Solr-Test-main/solr/core/build/resources/test/solr/collection1/conf/enumsConfig.xml to /configs/conf1/enumsConfig.xml
  2> 191511 INFO  (TEST-RecoveryAfterSoftCommitTest.test-seed#[1CFACF552405F1E5]) [] o.a.s.c.ZkTestServer put /home/jenkins/jenkins-agent/workspace/Solr/Solr-Test-main/solr/core/build/resources/test/solr/collection1/conf/open-exchange-rates.json to /configs/conf1/open-exchange-rates.json
  2> 191511 INFO  (TEST-RecoveryAfterSoftCommitTest.test-seed#[1CFACF552405F1E5]) [] o.a.s.c.ZkTestServer put /home/jenkins/jenkins-agent/workspace/Solr/Solr-Test-main/solr/core/build/resources/test/solr/collection1/conf/mapping-ISOLatin1Accent.txt to /configs/conf1/mapping-ISOLatin1Accent.txt
  2> 191512 INFO  (TEST-RecoveryAfterSoftCommitTest.test-seed#[1CFACF552405F1E5]) [] o.a.s.c.ZkTestServer put /home/jenkins/jenkins-agent/workspace/Solr/Solr-Test-main/solr/core/build/resources/test/solr/collection1/conf/old_synonyms.txt to /configs/conf1/old_synonyms.txt
  2> 191513 INFO  (TEST-RecoveryAfterSoftCommitTest.test-seed#[1CFACF552405F1E5]) [] o.a.s.c.ZkTestServer put /home/jenkins/jenkins-agent/workspace/Solr/Solr-Test-main/solr/core/build/resources/test/solr/collection1/conf/synonyms.txt to /configs/conf1/synonyms.txt
  2> 191514 INFO  (TEST-RecoveryAfterSoftCommitTest.test-seed#[1CFACF552405F1E5]) [] o.a.s.c.AbstractFullDistribZkTestBase Will use NRT replicas unless explicitly asked otherwise
  2> 191658 INFO  (TEST-RecoveryAfterSoftCommitTest.test-seed#[1CFACF552405F1E5]) [] o.a.s.e.JettySolrRunner Start Jetty (configured port=0, binding port=0)
  2> 191658 INFO  (TEST-RecoveryAfterSoftCommitTest.test-seed#[1CFACF552405F1E5]) [] o.a.s.e.JettySolrRunner Trying to start Jetty on port 0 try number 2 ...
  2> 191658 INFO  (TEST-RecoveryAfterSoftCommitTest.test-seed#[1CFACF552405F1E5]) [] o.e.j.s.Server jetty-12.1.10; built: 2026-05-31T04:45:52.925Z; git: 986024525891c2c20ff08c58ba300dc3b9847586; jvm 21.0.4+7-LTS
  2> 191659 INFO  (TEST-RecoveryAfterSoftCommitTest.test-seed#[1CFACF552405F1E5]) [] o.e.j.s.DefaultSessionIdManager Session workerName=node0
  2> 191659 WARN  (TEST-RecoveryAfterSoftCommitTest.test-seed#[1CFACF552405F1E5]) [] o.e.j.e.s.ServletContextHandler BaseResource file:///home/jenkins/jenkins-agent/workspace/Solr/Solr-Test-main/solr/core/build/tmp/tests-cwd/./ is aliased to file:///home/jenkins/jenkins-agent/workspace/Solr/Solr-Test-main/solr/core/build/tmp/tests-cwd/ in oeje10s.ServletContextHandler@764956c5{/solr,/solr,b=file:///home/jenkins/jenkins-agent/workspace/Solr/Solr-Test-main/solr/core/build/tmp/tests-cwd/./,a=STOPPED,h=oeje10s.ServletHandler@448f3fc6{STOPPED}}. May not be supported in future releases.
  2> 191660 INFO  (TEST-RecoveryAfterSoftCommitTest.test-seed#[1CFACF552405F1E5]) [] o.e.j.s.h.ContextHandler /solr Base Resource is an alias: file:///home/jenkins/jenkins-agent/workspace/Solr/Solr-Test-main/solr/core/build/tmp/tests-cwd/./ -> file:///home/jenkins/jenkins-agent/workspace/Solr/Solr-Test-main/solr/core/build/tmp/tests-cwd/
  2> 191660 INFO  (TEST-RecoveryAfterSoftCommitTest.test-seed#[1CFACF552405F1E5]) [] o.e.j.s.h.ContextHandler Started oeje10s.ServletContextHandler@764956c5{/solr,/solr,b=file:///home/jenkins/jenkins-agent/workspace/Solr/Solr-Test-main/solr/core/build/tmp/tests-cwd/,a=AVAILABLE,h=oeje10s.ServletHandler@448f3fc6{STARTED}}
  2> 191660 INFO  (TEST-RecoveryAfterSoftCommitTest.test-seed#[1CFACF552405F1E5]) [] o.a.s.e.JettySolrRunner Jetty properties: {solr.data.dir=/home/jenkins/jenkins-agent/workspace/Solr/Solr-Test-main/solr/core/build/tmp/tests-tmp/org.apache.solr.cloud.RecoveryAfterSoftCommitTest_1CFACF552405F1E5-001/tempDir-001/control/data, hostPort=35505, coreRootDirectory=/home/jenkins/jenkins-agent/workspace/Solr/Solr-Test-main/solr/core/build/tmp/tests-tmp/org.apache.solr.cloud.RecoveryAfterSoftCommitTest_1CFACF552405F1E5-001/control-001/cores, replicaType=NRT}
  2> 191660 ERROR (TEST-RecoveryAfterSoftCommitTest.test-seed#[1CFACF552405F1E5]) [] o.a.s.u.StartupLoggingUtils Missing Java Option solr.logs.dir. Logging may be missing or incomplete.
  2> 191660 INFO  (TEST-RecoveryAfterSoftCommitTest.test-seed#[1CFACF552405F1E5]) [] o.a.s.s.CoreContainerProvider Using logger factory org.apache.logging.slf4j.Log4jLoggerFactory
  2> 191660 INFO  (TEST-RecoveryAfterSoftCommitTest.test-seed#[1CFACF552405F1E5]) [] o.a.s.s.CoreContainerProvider  ___      _       Welcome to Apache Solr™ version 11.0.0
  2> 191660 INFO  (TEST-RecoveryAfterSoftCommitTest.test-seed#[1CFACF552405F1E5]) [] o.a.s.s.CoreContainerProvider / __| ___| |_ _   Starting in cloud mode on port null
  2> 191660 INFO  (TEST-RecoveryAfterSoftCommitTest.test-seed#[1CFACF552405F1E5]) [] o.a.s.s.CoreContainerProvider \__ \/ _ \ | '_|  Install dir: /home/jenkins/jenkins-agent/workspace/Solr/Solr-Test-main/solr
  2> 191660 INFO  (TEST-RecoveryAfterSoftCommitTest.test-seed#[1CFACF552405F1E5]) [] o.a.s.s.CoreContainerProvider |___/\___/_|_|    Start time: 2026-08-09T20:30:33.463978585Z
  2> 191661 INFO  (TEST-RecoveryAfterSoftCommitTest.test-seed#[1CFACF552405F1E5]) [] o.a.s.s.CoreContainerProvider Solr Home: /home/jenkins/jenkins-agent/workspace/Solr/Solr-Test-main/solr/core/build/tmp/tests-tmp/org.apache.solr.cloud.RecoveryAfterSoftCommitTest_1CFACF552405F1E5-001/control-001 (source: servlet config: solr.solr.home)
  2> 191661 WARN  (TEST-RecoveryAfterSoftCommitTest.test-seed#[1CFACF552405F1E5]) [] o.a.s.c.c.SolrZkClient Using default ZkCredentialsInjector. ZkCredentialsInjector is not secure, it creates an empty list of credentials which leads to 'OPEN_ACL_UNSAFE' ACLs to Zookeeper nodes
  2> 191661 WARN  (TEST-RecoveryAfterSoftCommitTest.test-seed#[1CFACF552405F1E5]) [] o.a.s.c.c.SolrZkClient Using default ZkACLProvider. DefaultZkACLProvider is not secure, it creates 'OPEN_ACL_UNSAFE' ACLs to Zookeeper nodes
  2> 191661 INFO  (TEST-RecoveryAfterSoftCommitTest.test-seed#[1CFACF552405F1E5]) [] o.a.c.f.i.CuratorFrameworkImpl Starting
  2> 191662 INFO  (TEST-RecoveryAfterSoftCommitTest.test-seed#[1CFACF552405F1E5]) [] o.a.c.f.i.CuratorFrameworkImpl Default schema
  2> 191663 INFO  (TEST-RecoveryAfterSoftCommitTest.test-seed#[1CFACF552405F1E5]-EventThread) [] o.a.c.f.s.ConnectionStateManager State change: CONNECTED
  2> 191664 INFO  (TEST-RecoveryAfterSoftCommitTest.test-seed#[1CFACF552405F1E5]-EventThread) [] o.a.c.f.i.EnsembleTracker New config event received: {}
  2> 191664 INFO  (TEST-RecoveryAfterSoftCommitTest.test-seed#[1CFACF552405F1E5]-EventThread) [] o.a.c.f.i.EnsembleTracker New config event received: {}
  2> 191664 INFO  (Curator-Framework-0) [] o.a.c.f.i.CuratorFrameworkImpl backgroundOperationsLoop exiting
  2> 191765 INFO  (TEST-RecoveryAfterSoftCommitTest.test-seed#[1CFACF552405F1E5]) [] o.a.s.c.SolrXmlConfig Loading solr.xml from /home/jenkins/jenkins-agent/workspace/Solr/Solr-Test-main/solr/core/build/tmp/tests-tmp/org.apache.solr.cloud.RecoveryAfterSoftCommitTest_1CFACF552405F1E5-001/control-001/solr.xml
  2> 192752 INFO  (TEST-RecoveryAfterSoftCommitTest.test-seed#[1CFACF552405F1E5]) [] o.a.s.c.OpenTelemetryConfigurator OpenTelemetry tracer enabled with simple propagation only.
  2> 192752 INFO  (TEST-RecoveryAfterSoftCommitTest.test-seed#[1CFACF552405F1E5]) [] o.a.s.m.OtelRuntimeJvmMetrics JVM metrics are disabled
  2> 192762 INFO  (TEST-RecoveryAfterSoftCommitTest.test-seed#[1CFACF552405F1E5]) [] o.a.s.c.ZkContainer Zookeeper client=127.0.0.1:38115/solr
  2> 192762 WARN  (TEST-RecoveryAfterSoftCommitTest.test-seed#[1CFACF552405F1E5]) [] o.a.s.c.c.SolrZkClient Using default ZkCredentialsInjector. ZkCredentialsInjector is not secure, it creates an empty list of credentials which leads to 'OPEN_ACL_UNSAFE' ACLs to Zookeeper nodes
  2> 192762 WARN  (TEST-RecoveryAfterSoftCommitTest.test-seed#[1CFACF552405F1E5]) [] o.a.s.c.c.SolrZkClient Using default ZkACLProvider. DefaultZkACLProvider is not secure, it creates 'OPEN_ACL_UNSAFE' ACLs to Zookeeper nodes
  2> 192763 INFO  (TEST-RecoveryAfterSoftCommitTest.test-seed#[1CFACF552405F1E5]) [] o.a.c.f.i.CuratorFrameworkImpl Starting
  2> 192764 INFO  (TEST-RecoveryAfterSoftCommitTest.test-seed#[1CFACF552405F1E5]) [] o.a.c.f.i.CuratorFrameworkImpl Default schema
  2> 192765 INFO  (TEST-RecoveryAfterSoftCommitTest.test-seed#[1CFACF552405F1E5]-EventThread) [] o.a.c.f.s.ConnectionStateManager State change: CONNECTED
  2> 192765 INFO  (TEST-RecoveryAfterSoftCommitTest.test-seed#[1CFACF552405F1E5]-EventThread) [] o.a.c.f.i.EnsembleTracker New config event received: {}
  2> 192765 INFO  (TEST-RecoveryAfterSoftCommitTest.test-seed#[1CFACF552405F1E5]-EventThread) [] o.a.c.f.i.EnsembleTracker New config event received: {}
  2> 192765 INFO  (Curator-Framework-0) [] o.a.c.f.i.CuratorFrameworkImpl backgroundOperationsLoop exiting
  2> 192867 INFO  (TEST-RecoveryAfterSoftCommitTest.test-seed#[1CFACF552405F1E5]) [n:127.0.0.1:35505_solr] o.a.c.f.i.CuratorFrameworkImpl Starting
  2> 192868 INFO  (TEST-RecoveryAfterSoftCommitTest.test-seed#[1CFACF552405F1E5]) [n:127.0.0.1:35505_solr] o.a.c.f.i.CuratorFrameworkImpl Default schema
  2> 192869 INFO  (TEST-RecoveryAfterSoftCommitTest.test-seed#[1CFACF552405F1E5]-EventThread) [] o.a.c.f.s.ConnectionStateManager State change: CONNECTED
  2> 192869 INFO  (TEST-RecoveryAfterSoftCommitTest.test-seed#[1CFACF552405F1E5]-EventThread) [] o.a.c.f.i.EnsembleTracker New config event received: {}
  2> 192870 INFO  (TEST-RecoveryAfterSoftCommitTest.test-seed#[1CFACF552405F1E5]-EventThread) [] o.a.c.f.i.EnsembleTracker New config event received: {}
  2> 192889 WARN  (TEST-RecoveryAfterSoftCommitTest.test-seed#[1CFACF552405F1E5]) [n:127.0.0.1:35505_solr] o.a.s.c.ZkController Contents of zookeeper /security.json are world-readable; consider setting up ACLs as described in https://solr.apache.org/guide/solr/latest/deployment-guide/zookeeper-access-control.html
  2> 192892 INFO  (TEST-RecoveryAfterSoftCommitTest.test-seed#[1CFACF552405F1E5]) [n:127.0.0.1:35505_solr] o.a.s.c.ZkController The Overseer is enabled.  It will process all cluster commands & state updates.
  2> 192895 INFO  (TEST-RecoveryAfterSoftCommitTest.test-seed#[1CFACF552405F1E5]) [n:127.0.0.1:35505_solr] o.a.s.c.OverseerElectionContext I am going to be the leader 127.0.0.1:35505_solr
  2> 192895 INFO  (TEST-RecoveryAfterSoftCommitTest.test-seed#[1CFACF552405F1E5]) [n:127.0.0.1:35505_solr] o.a.s.c.Overseer Overseer (id=72083578688372740-127.0.0.1:35505_solr-n_0000000000) starting
  2> 192899 INFO  (TEST-RecoveryAfterSoftCommitTest.test-seed#[1CFACF552405F1E5]) [n:127.0.0.1:35505_solr] o.a.s.c.ZkController Register node as live in ZooKeeper: /live_nodes/127.0.0.1:35505_solr
  2> 192899 INFO  (OverseerStateUpdate-72083578688372740-127.0.0.1:35505_solr-n_0000000000) [n:127.0.0.1:35505_solr] o.a.s.c.Overseer Starting to work on the main queue : 127.0.0.1:35505_solr
  2> 192900 INFO  (OverseerStateUpdate-72083578688372740-127.0.0.1:35505_solr-n_0000000000) [n:127.0.0.1:35505_solr] o.a.s.c.c.ZkStateReader Updated live nodes from ZooKeeper... (0) -> (1)
  2> 192902 WARN  (TEST-RecoveryAfterSoftCommitTest.test-seed#[1CFACF552405F1E5]) [n:127.0.0.1:35505_solr] o.a.s.c.CoreContainer Not all security plugins configured!  authentication=disabled authorization=disabled.  Solr is only as secure as you make it. Consider configuring authentication/authorization before exposing Solr to users internal or external.  See https://s.apache.org/solrsecurity for more info
  2> 192979 INFO  (TEST-RecoveryAfterSoftCommitTest.test-seed#[1CFACF552405F1E5]) [n:127.0.0.1:35505_solr] o.a.s.c.CorePropertiesLocator Found 0 core definitions underneath /home/jenkins/jenkins-agent/workspace/Solr/Solr-Test-main/solr/core/build/tmp/tests-tmp/org.apache.solr.cloud.RecoveryAfterSoftCommitTest_1CFACF552405F1E5-001/control-001/cores
  2> 193032 INFO  (TEST-RecoveryAfterSoftCommitTest.test-seed#[1CFACF552405F1E5]) [n:127.0.0.1:35505_solr] o.e.j.e.s.ServletContextHandler Started oeje10s.ServletContextHandler@764956c5{/solr,/solr,b=file:///home/jenkins/jenkins-agent/workspace/Solr/Solr-Test-main/solr/core/build/tmp/tests-cwd/,a=AVAILABLE,h=oeje10s.ServletHandler@448f3fc6{STARTED}}
  2> 193032 INFO  (TEST-RecoveryAfterSoftCommitTest.test-seed#[1CFACF552405F1E5]) [n:127.0.0.1:35505_solr] o.e.j.s.AbstractConnector Started oejs.ServerConnector@187c2b7{HTTP/1.1, (http/1.1, h2c)}{127.0.0.1:37941}
  2> 193032 INFO  (TEST-RecoveryAfterSoftCommitTest.test-seed#[1CFACF552405F1E5]) [n:127.0.0.1:35505_solr] o.e.j.s.Server Started oejs.Server@1e200ce4{STARTING}[12.1.10,sto=0] @1374ms
  2> 193035 WARN  (TEST-RecoveryAfterSoftCommitTest.test-seed#[1CFACF552405F1E5]) [] o.a.s.c.c.SolrZkClient Using default ZkCredentialsInjector. ZkCredentialsInjector is not secure, it creates an empty list of credentials which leads to 'OPEN_ACL_UNSAFE' ACLs to Zookeeper nodes
  2> 193036 WARN  (TEST-RecoveryAfterSoftCommitTest.test-seed#[1CFACF552405F1E5]) [] o.a.s.c.c.SolrZkClient Using default ZkACLProvider. DefaultZkACLProvider is not secure, it creates 'OPEN_ACL_UNSAFE' ACLs to Zookeeper nodes
  2> 193036 INFO  (TEST-RecoveryAfterSoftCommitTest.test-seed#[1CFACF552405F1E5]) [] o.a.c.f.i.CuratorFrameworkImpl Starting
  2> 193037 INFO  (TEST-RecoveryAfterSoftCommitTest.test-seed#[1CFACF552405F1E5]) [] o.a.c.f.i.CuratorFrameworkImpl Default schema
  2> 193038 INFO  (TEST-RecoveryAfterSoftCommitTest.test-seed#[1CFACF552405F1E5]-EventThread) [] o.a.c.f.s.ConnectionStateManager State change: CONNECTED
  2> 193039 INFO  (TEST-RecoveryAfterSoftCommitTest.test-seed#[1CFACF552405F1E5]-EventThread) [] o.a.c.f.i.EnsembleTracker New config event received: {}
  2> 193039 INFO  (TEST-RecoveryAfterSoftCommitTest.test-seed#[1CFACF552405F1E5]-EventThread) [] o.a.c.f.i.EnsembleTracker New config event received: {}
  2> 193040 INFO  (TEST-RecoveryAfterSoftCommitTest.test-seed#[1CFACF552405F1E5]) [] o.a.s.c.c.ZkStateReader Updated live nodes from ZooKeeper... (0) -> (1)
  2> 193042 INFO  (TEST-RecoveryAfterSoftCommitTest.test-seed#[1CFACF552405F1E5]) [] o.a.s.c.s.i.ZkClientClusterStateProvider Cluster at 127.0.0.1:38115/solr ready
  2> 193043 INFO  (SocketProxy-Acceptor-35505) [] o.a.s.u.SocketProxy accepted Socket[addr=/127.0.0.1,port=37350,localport=35505], receiveBufferSize: 65536
  2> 193045 INFO  (SocketProxy-Acceptor-35505) [] o.a.s.u.SocketProxy proxy connection Socket[addr=/127.0.0.1,port=37941,localport=41030], receiveBufferSize=65536
  2> 193049 INFO  (OverseerThreadFactory-2533-thread-1) [ c:control_collection t:null-6218] o.a.s.c.a.c.CreateCollectionCmd Create collection control_collection
  2> 193049 INFO  (OverseerThreadFactory-2533-thread-1) [ c:control_collection t:null-6218] o.a.s.c.a.c.CreateCollectionCmd solr.cloud.prs.enabled : false and collection prs : null, isPRS : false
  2> 193052 INFO  (OverseerThreadFactory-2533-thread-1) [ c:control_collection t:null-6218] o.a.s.c.c.ZkStateReader /collections/control_collection/state.json is deleted, stop watching children
  2> 193053 INFO  (zkCallback-2527-thread-1) [] o.a.s.c.c.ZkStateReader A cluster state change: [WatchedEvent state:SyncConnected type:NodeCreated path:/collections/control_collection/state.json zxid: -1] for collection [control_collection] has occurred - updating... (live nodes size: [1])
  2> 193058 INFO  (OverseerStateUpdate-72083578688372740-127.0.0.1:35505_solr-n_0000000000) [n:127.0.0.1:35505_solr] o.a.s.c.o.SliceMutator createReplica() {
  2>   "core":"control_collection_shard1_replica_n1",
  2>   "node_name":"127.0.0.1:35505_solr",
  2>   "base_url":"http://127.0.0.1:35505/solr",
  2>   "collection":"control_collection",
  2>   "shard":"shard1",
  2>   "state":"down",
  2>   "type":"NRT",
  2>   "operation":"ADDREPLICA",
  2>   "waitForFinalState":"false"} 
  2> 193160 INFO  (zkCallback-2527-thread-2) [] o.a.s.c.c.ZkStateReader A cluster state change: [WatchedEvent state:SyncConnected type:NodeDataChanged path:/collections/control_collection/state.json zxid: -1] for collection [control_collection] has occurred - updating... (live nodes size: [1])
  2> 193162 INFO  (SocketProxy-Acceptor-35505) [] o.a.s.u.SocketProxy accepted Socket[addr=/127.0.0.1,port=37356,localport=35505], receiveBufferSize: 65536
  2> 193163 INFO  (SocketProxy-Acceptor-35505) [] o.a.s.u.SocketProxy proxy connection Socket[addr=/127.0.0.1,port=37941,localport=41040], receiveBufferSize=65536
  2> 193164 INFO  (qtp1780019722-5521-null-6218) [n:127.0.0.1:35505_solr x:control_collection_shard1_replica_n1 t:null-6218] o.a.s.h.a.a.CreateCore core create command "org.apache.solr.client.api.model.CreateCoreParams@24d215e8"
  2> 193196 INFO  (qtp1780019722-5521-null-6218) [n:127.0.0.1:35505_solr c:control_collection s:shard1 r:core_node2 x:control_collection_shard1_replica_n1 t:null-6218] o.a.s.s.IndexSchema Loaded schema test/1.0 with uniqueid field id
  2> 193209 INFO  (qtp1780019722-5521-null-6218) [n:127.0.0.1:35505_solr c:control_collection s:shard1 r:core_node2 x:control_collection_shard1_replica_n1 t:null-6218] o.a.s.c.CoreContainer Creating SolrCore 'control_collection_shard1_replica_n1' using configuration from configset conf1
  2> 193209 INFO  (qtp1780019722-5521-null-6218) [n:127.0.0.1:35505_solr c:control_collection s:shard1 r:core_node2 x:control_collection_shard1_replica_n1 t:null-6218] o.a.s.c.SolrCore Opening new SolrCore at [/home/jenkins/jenkins-agent/workspace/Solr/Solr-Test-main/solr/core/build/tmp/tests-tmp/org.apache.solr.cloud.RecoveryAfterSoftCommitTest_1CFACF552405F1E5-001/control-001/cores/control_collection_shard1_replica_n1], dataDir=[/home/jenkins/jenkins-agent/workspace/Solr/Solr-Test-main/solr/core/build/tmp/tests-tmp/org.apache.solr.cloud.RecoveryAfterSoftCommitTest_1CFACF552405F1E5-001/control-001/cores/control_collection_shard1_replica_n1/data/]
  2> 193210 INFO  (qtp1780019722-5521-null-6218) [n:127.0.0.1:35505_solr c:control_collection s:shard1 r:core_node2 x:control_collection_shard1_replica_n1 t:null-6218] o.a.s.u.RandomMergePolicy RandomMergePolicy wrapping class org.apache.lucene.index.LogByteSizeMergePolicy: [LogByteSizeMergePolicy: minMergeSize=16777216, mergeFactor=14, maxMergeSize=2147483648, maxMergeSizeForForcedMerge=9223372036854775807, calibrateSizeByDeletes=false, maxMergeDocs=2147483647, maxCFSSegmentSizeMB=8.796093022208E12, noCFSRatio=0.0]
  2> 193212 WARN  (qtp1780019722-5521-null-6218) [n:127.0.0.1:35505_solr c:control_collection s:shard1 r:core_node2 x:control_collection_shard1_replica_n1 t:null-6218] o.a.s.c.RequestHandlers INVALID paramSet a in requestHandler {type = requestHandler,name = /dump,class = DumpRequestHandler,attributes = {initParams=a, name=/dump, class=DumpRequestHandler},args = {defaults={a=A, b=B}}}
  2> 193242 INFO  (qtp1780019722-5521-null-6218) [n:127.0.0.1:35505_solr c:control_collection s:shard1 r:core_node2 x:control_collection_shard1_replica_n1 t:null-6218] o.a.s.u.UpdateLog Initializing UpdateLog: dataDir= defaultSyncLevel=FLUSH numRecordsToKeep=2 maxNumLogsToKeep=10
  2> 193242 INFO  (qtp1780019722-5521-null-6218) [n:127.0.0.1:35505_solr c:control_collection s:shard1 r:core_node2 x:control_collection_shard1_replica_n1 t:null-6218] o.a.s.u.CommitTracker Hard AutoCommit: disabled
  2> 193242 INFO  (qtp1780019722-5521-null-6218) [n:127.0.0.1:35505_solr c:control_collection s:shard1 r:core_node2 x:control_collection_shard1_replica_n1 t:null-6218] o.a.s.u.CommitTracker Soft AutoCommit: disabled
  2> 193244 INFO  (qtp1780019722-5521-null-6218) [n:127.0.0.1:35505_solr c:control_collection s:shard1 r:core_node2 x:control_collection_shard1_replica_n1 t:null-6218] o.a.s.u.RandomMergePolicy RandomMergePolicy wrapping class org.apache.lucene.index.LogByteSizeMergePolicy: [LogByteSizeMergePolicy: minMergeSize=16777216, mergeFactor=12, maxMergeSize=2147483648, maxMergeSizeForForcedMerge=9223372036854775807, calibrateSizeByDeletes=true, maxMergeDocs=2147483647, maxCFSSegmentSizeMB=8.796093022208E12, noCFSRatio=0.19950000161998338]
  2> 193245 INFO  (qtp1780019722-5521-null-6218) [n:127.0.0.1:35505_solr c:control_collection s:shard1 r:core_node2 x:control_collection_shard1_replica_n1 t:null-6218] o.a.s.r.ManagedResourceStorage Configured ZooKeeperStorageIO with znodeBase: /configs/conf1
  2> 193246 INFO  (qtp1780019722-5521-null-6218) [n:127.0.0.1:35505_solr c:control_collection s:shard1 r:core_node2 x:control_collection_shard1_replica_n1 t:null-6218] o.a.s.r.ManagedResourceStorage Loaded null at path _rest_managed.json using ZooKeeperStorageIO:path=/configs/conf1
  2> 193246 INFO  (qtp1780019722-5521-null-6218) [n:127.0.0.1:35505_solr c:control_collection s:shard1 r:core_node2 x:control_collection_shard1_replica_n1 t:null-6218] o.a.s.h.ReplicationHandler Commits will be reserved for 10000 ms
  2> 193247 INFO  (searcherExecutor-2544-thread-1-processing-127.0.0.1:35505_solr control_collection_shard1_replica_n1 null-6218 control_collection shard1 core_node2) [n:127.0.0.1:35505_solr c:control_collection s:shard1 r:core_node2 x:control_collection_shard1_replica_n1 t:null-6218] o.a.s.c.SolrCore Registered new searcher autowarm time: 0 ms
  2> 193250 INFO  (qtp1780019722-5521-null-6218) [n:127.0.0.1:35505_solr c:control_collection s:shard1 r:core_node2 x:control_collection_shard1_replica_n1 t:null-6218] o.a.s.c.ZkShardTerms Successful update of terms at /collections/control_collection/terms/shard1 to Terms{values={core_node2=0}, version=0} for registerTerm
  2> 193250 INFO  (qtp1780019722-5521-null-6218) [n:127.0.0.1:35505_solr c:control_collection s:shard1 r:core_node2 x:control_collection_shard1_replica_n1 t:null-6218] o.a.s.c.ShardLeaderElectionContextBase make sure parent is created /collections/control_collection/leaders/shard1
  2> 193256 INFO  (qtp1780019722-5521-null-6218) [n:127.0.0.1:35505_solr c:control_collection s:shard1 r:core_node2 x:control_collection_shard1_replica_n1 t:null-6218] o.a.s.c.ShardLeaderElectionContext Enough replicas found to continue.
  2> 193256 INFO  (qtp1780019722-5521-null-6218) [n:127.0.0.1:35505_solr c:control_collection s:shard1 r:core_node2 x:control_collection_shard1_replica_n1 t:null-6218] o.a.s.c.ShardLeaderElectionContext I may be the new leader - try and sync
  2> 193256 INFO  (qtp1780019722-5521-null-6218) [n:127.0.0.1:35505_solr c:control_collection s:shard1 r:core_node2 x:control_collection_shard1_replica_n1 t:null-6218] o.a.s.c.SyncStrategy Sync replicas to http://127.0.0.1:35505/solr/control_collection_shard1_replica_n1/
  2> 193257 INFO  (qtp1780019722-5521-null-6218) [n:127.0.0.1:35505_solr c:control_collection s:shard1 r:core_node2 x:control_collection_shard1_replica_n1 t:null-6218] o.a.s.c.SyncStrategy Sync Success - now sync replicas to me
  2> 193257 INFO  (qtp1780019722-5521-null-6218) [n:127.0.0.1:35505_solr c:control_collection s:shard1 r:core_node2 x:control_collection_shard1_replica_n1 t:null-6218] o.a.s.c.SyncStrategy http://127.0.0.1:35505/solr/control_collection_shard1_replica_n1/ has no replicas
  2> 193257 INFO  (qtp1780019722-5521-null-6218) [n:127.0.0.1:35505_solr c:control_collection s:shard1 r:core_node2 x:control_collection_shard1_replica_n1 t:null-6218] o.a.s.c.ShardLeaderElectionContextBase Creating leader registration node /collections/control_collection/leaders/shard1/leader after winning as /collections/control_collection/leader_elect/shard1/election/72083578688372740-core_node2-n_0000000000
  2> 193362 INFO  (zkCallback-2527-thread-1) [] o.a.s.c.c.ZkStateReader A cluster state change: [WatchedEvent state:SyncConnected type:NodeDataChanged path:/collections/control_collection/state.json zxid: -1] for collection [control_collection] has occurred - updating... (live nodes size: [1])
  2> 193362 INFO  (qtp1780019722-5521-null-6218) [n:127.0.0.1:35505_solr c:control_collection s:shard1 r:core_node2 x:control_collection_shard1_replica_n1 t:null-6218] o.a.s.c.ShardLeaderElectionContext I am the new leader: http://127.0.0.1:35505/solr/control_collection_shard1_replica_n1/ shard1
  2> 193363 INFO  (qtp1780019722-5521-null-6218) [n:127.0.0.1:35505_solr c:control_collection s:shard1 r:core_node2 x:control_collection_shard1_replica_n1 t:null-6218] o.a.s.c.ZkController I am the leader, no recovery necessary
  2> 193366 INFO  (qtp1780019722-5521-null-6218) [n:127.0.0.1:35505_solr t:null-6218] o.a.s.s.HttpSolrCall [admin] path=/admin/cores params={coreNodeName=core_node2&collection.configName=conf1&newCollection=true&name=control_collection_shard1_replica_n1&action=CREATE&numShards=1&collection=control_collection&shard=shard1&wt=javabin&replicaType=NRT} status=0 QTime=202
  2> 193369 INFO  (qtp1780019722-5518-null-6217) [n:127.0.0.1:35505_solr c:control_collection t:null-6217] o.a.s.h.a.CollectionsHandler Wait for new collection to be active for at most 45 seconds. Check all shard replicas
  2> 193467 INFO  (zkCallback-2527-thread-1) [] o.a.s.c.c.ZkStateReader A cluster state change: [WatchedEvent state:SyncConnected type:NodeDataChanged path:/collections/control_collection/state.json zxid: -1] for collection [control_collection] has occurred - updating... (live nodes size: [1])
  2> 193468 INFO  (qtp1780019722-5518-null-6217) [n:127.0.0.1:35505_solr c:control_collection t:null-6217] o.a.s.s.HttpSolrCall [admin] path=/admin/collections params={collection.configName=conf1&name=control_collection&nrtReplicas=1&action=CREATE&numShards=1&createNodeSet=127.0.0.1:35505_solr&wt=javabin} status=0 QTime=421
  2> 193468 INFO  (TEST-RecoveryAfterSoftCommitTest.test-seed#[1CFACF552405F1E5]) [] o.a.s.c.AbstractFullDistribZkTestBase Waiting to see 1 active replicas in collection: control_collection
  2> 193469 INFO  (Curator-Framework-0) [] o.a.c.f.i.CuratorFrameworkImpl backgroundOperationsLoop exiting
  2> 193576 WARN  (TEST-RecoveryAfterSoftCommitTest.test-seed#[1CFACF552405F1E5]) [] o.a.s.c.c.SolrZkClient Using default ZkCredentialsInjector. ZkCredentialsInjector is not secure, it creates an empty list of credentials which leads to 'OPEN_ACL_UNSAFE' ACLs to Zookeeper nodes
  2> 193576 WARN  (TEST-RecoveryAfterSoftCommitTest.test-seed#[1CFACF552405F1E5]) [] o.a.s.c.c.SolrZkClient Using default ZkACLProvider. DefaultZkACLProvider is not secure, it creates 'OPEN_ACL_UNSAFE' ACLs to Zookeeper nodes
  2> 193576 INFO  (TEST-RecoveryAfterSoftCommitTest.test-seed#[1CFACF552405F1E5]) [] o.a.c.f.i.CuratorFrameworkImpl Starting
  2> 193577 INFO  (TEST-RecoveryAfterSoftCommitTest.test-seed#[1CFACF552405F1E5]) [] o.a.c.f.i.CuratorFrameworkImpl Default schema
  2> 193578 INFO  (TEST-RecoveryAfterSoftCommitTest.test-seed#[1CFACF552405F1E5]-EventThread) [] o.a.c.f.s.ConnectionStateManager State change: CONNECTED
  2> 193578 INFO  (TEST-RecoveryAfterSoftCommitTest.test-seed#[1CFACF552405F1E5]-EventThread) [] o.a.c.f.i.EnsembleTracker New config event received: {}
  2> 193578 INFO  (TEST-RecoveryAfterSoftCommitTest.test-seed#[1CFACF552405F1E5]-EventThread) [] o.a.c.f.i.EnsembleTracker New config event received: {}
  2> 193579 INFO  (TEST-RecoveryAfterSoftCommitTest.test-seed#[1CFACF552405F1E5]) [] o.a.s.c.c.ZkStateReader Updated live nodes from ZooKeeper... (0) -> (1)
  2> 193580 INFO  (TEST-RecoveryAfterSoftCommitTest.test-seed#[1CFACF552405F1E5]) [] o.a.s.c.s.i.ZkClientClusterStateProvider Cluster at 127.0.0.1:38115/solr ready
  2> 193580 INFO  (TEST-RecoveryAfterSoftCommitTest.test-seed#[1CFACF552405F1E5]) [] o.a.s.c.ChaosMonkey monkey: init - expire sessions:false cause connection loss:false
  2> 193581 INFO  (SocketProxy-Acceptor-35505) [] o.a.s.u.SocketProxy accepted Socket[addr=/127.0.0.1,port=37368,localport=35505], receiveBufferSize: 65536
  2> 193582 INFO  (SocketProxy-Acceptor-35505) [] o.a.s.u.SocketProxy proxy connection Socket[addr=/127.0.0.1,port=37941,localport=41046], receiveBufferSize=65536
  2> 193586 INFO  (OverseerThreadFactory-2533-thread-2) [ c:collection1 t:null-6220] o.a.s.c.a.c.CreateCollectionCmd Create collection collection1
  2> 193586 INFO  (OverseerThreadFactory-2533-thread-2) [ c:collection1 t:null-6220] o.a.s.c.a.c.CreateCollectionCmd solr.cloud.prs.enabled : false and collection prs : null, isPRS : false
  2> 193589 INFO  (OverseerThreadFactory-2533-thread-2) [ c:collection1 t:null-6220] o.a.s.c.c.ZkStateReader /collections/collection1/state.json is deleted, stop watching children
  2> 193692 INFO  (zkCallback-2527-thread-1) [] o.a.s.c.c.ZkStateReader A cluster state change: [WatchedEvent state:SyncConnected type:NodeCreated path:/collections/collection1/state.json zxid: -1] for collection [collection1] has occurred - updating... (live nodes size: [1])
  2> 193692 WARN  (OverseerThreadFactory-2533-thread-2) [ c:collection1 t:null-6220] o.a.s.c.a.c.CreateCollectionCmd It is unusual to create a collection (collection1) without cores.
  2> 193694 INFO  (qtp1780019722-5520-null-6219) [n:127.0.0.1:35505_solr c:collection1 t:null-6219] o.a.s.h.a.CollectionsHandler Wait for new collection to be active for at most 45 seconds. Check all shard replicas
  2> 193694 INFO  (qtp1780019722-5520-null-6219) [n:127.0.0.1:35505_solr c:collection1 t:null-6219] o.a.s.s.HttpSolrCall [admin] path=/admin/collections params={collection.configName=conf1&name=collection1&nrtReplicas=1&action=CREATE&numShards=1&createNodeSet=&wt=javabin} status=0 QTime=111
  2> 193695 INFO  (TEST-RecoveryAfterSoftCommitTest.test-seed#[1CFACF552405F1E5]) [] o.a.s.c.SolrCloudTestCase active slice count: 1 expected: 1
  2> 193696 INFO  (TEST-RecoveryAfterSoftCommitTest.test-seed#[1CFACF552405F1E5]) [] o.a.s.c.SolrCloudTestCase active replica count: 0 expected replica count: 0
  2> 193696 INFO  (TEST-RecoveryAfterSoftCommitTest.test-seed#[1CFACF552405F1E5]) [] o.a.s.c.AbstractFullDistribZkTestBase Creating jetty instances pullReplicaCount=0 numOtherReplicas=2
  2> 193856 INFO  (TEST-RecoveryAfterSoftCommitTest.test-seed#[1CFACF552405F1E5]) [] o.a.s.c.AbstractFullDistribZkTestBase create jetty 1 in directory /home/jenkins/jenkins-agent/workspace/Solr/Solr-Test-main/solr/core/build/tmp/tests-tmp/org.apache.solr.cloud.RecoveryAfterSoftCommitTest_1CFACF552405F1E5-001/shard-1-001 of type NRT for shard1
  2> 193857 INFO  (closeThreadPool-2556-thread-1) [] o.a.s.e.JettySolrRunner Start Jetty (configured port=0, binding port=0)
  2> 193857 INFO  (closeThreadPool-2556-thread-1) [] o.a.s.e.JettySolrRunner Trying to start Jetty on port 0 try number 2 ...
  2> 193857 INFO  (closeThreadPool-2556-thread-1) [] o.e.j.s.Server jetty-12.1.10; built: 2026-05-31T04:45:52.925Z; git: 986024525891c2c20ff08c58ba300dc3b9847586; jvm 21.0.4+7-LTS
  2> 193858 INFO  (closeThreadPool-2556-thread-1) [] o.e.j.s.DefaultSessionIdManager Session workerName=node0
  2> 193859 WARN  (closeThreadPool-2556-thread-1) [] o.e.j.e.s.ServletContextHandler BaseResource file:///home/jenkins/jenkins-agent/workspace/Solr/Solr-Test-main/solr/core/build/tmp/tests-cwd/./ is aliased to file:///home/jenkins/jenkins-agent/workspace/Solr/Solr-Test-main/solr/core/build/tmp/tests-cwd/ in oeje10s.ServletContextHandler@38a4bb3b{/solr,/solr,b=file:///home/jenkins/jenkins-agent/workspace/Solr/Solr-Test-main/solr/core/build/tmp/tests-cwd/./,a=STOPPED,h=oeje10s.ServletHandler@3b24f264{STOPPED}}. May not be supported in future releases.
  2> 193860 INFO  (closeThreadPool-2556-thread-1) [] o.e.j.s.h.ContextHandler /solr Base Resource is an alias: file:///home/jenkins/jenkins-agent/workspace/Solr/Solr-Test-main/solr/core/build/tmp/tests-cwd/./ -> file:///home/jenkins/jenkins-agent/workspace/Solr/Solr-Test-main/solr/core/build/tmp/tests-cwd/
  2> 193860 INFO  (closeThreadPool-2556-thread-1) [] o.e.j.s.h.ContextHandler Started oeje10s.ServletContextHandler@38a4bb3b{/solr,/solr,b=file:///home/jenkins/jenkins-agent/workspace/Solr/Solr-Test-main/solr/core/build/tmp/tests-cwd/,a=AVAILABLE,h=oeje10s.ServletHandler@3b24f264{STARTED}}
  2> 193860 INFO  (closeThreadPool-2556-thread-1) [] o.a.s.e.JettySolrRunner Jetty properties: {solrconfig=solrconfig.xml, solr.data.dir=/home/jenkins/jenkins-agent/workspace/Solr/Solr-Test-main/solr/core/build/tmp/tests-tmp/org.apache.solr.cloud.RecoveryAfterSoftCommitTest_1CFACF552405F1E5-001/tempDir-001/jetty1, hostPort=44179, coreRootDirectory=/home/jenkins/jenkins-agent/workspace/Solr/Solr-Test-main/solr/core/build/tmp/tests-tmp/org.apache.solr.cloud.RecoveryAfterSoftCommitTest_1CFACF552405F1E5-001/shard-1-001/cores, replicaType=NRT}
  2> 193860 ERROR (closeThreadPool-2556-thread-1) [] o.a.s.u.StartupLoggingUtils Missing Java Option solr.logs.dir. Logging may be missing or incomplete.
  2> 193860 INFO  (closeThreadPool-2556-thread-1) [] o.a.s.s.CoreContainerProvider Using logger factory org.apache.logging.slf4j.Log4jLoggerFactory
  2> 193860 INFO  (closeThreadPool-2556-thread-1) [] o.a.s.s.CoreContainerProvider  ___      _       Welcome to Apache Solr™ version 11.0.0
  2> 193860 INFO  (closeThreadPool-2556-thread-1) [] o.a.s.s.CoreContainerProvider / __| ___| |_ _   Starting in cloud mode on port null
  2> 193860 INFO  (closeThreadPool-2556-thread-1) [] o.a.s.s.CoreContainerProvider \__ \/ _ \ | '_|  Install dir: /home/jenkins/jenkins-agent/workspace/Solr/Solr-Test-main/solr
  2> 193860 INFO  (closeThreadPool-2556-thread-1) [] o.a.s.s.CoreContainerProvider |___/\___/_|_|    Start time: 2026-08-09T20:30:35.663672634Z
  2> 193860 INFO  (closeThreadPool-2556-thread-1) [] o.a.s.s.CoreContainerProvider Solr Home: /home/jenkins/jenkins-agent/workspace/Solr/Solr-Test-main/solr/core/build/tmp/tests-tmp/org.apache.solr.cloud.RecoveryAfterSoftCommitTest_1CFACF552405F1E5-001/shard-1-001 (source: servlet config: solr.solr.home)
  2> 193861 WARN  (closeThreadPool-2556-thread-1) [] o.a.s.c.c.SolrZkClient Using default ZkCredentialsInjector. ZkCredentialsInjector is not secure, it creates an empty list of credentials which leads to 'OPEN_ACL_UNSAFE' ACLs to Zookeeper nodes
  2> 193861 WARN  (closeThreadPool-2556-thread-1) [] o.a.s.c.c.SolrZkClient Using default ZkACLProvider. DefaultZkACLProvider is not secure, it creates 'OPEN_ACL_UNSAFE' ACLs to Zookeeper nodes
  2> 193861 INFO  (closeThreadPool-2556-thread-1) [] o.a.c.f.i.CuratorFrameworkImpl Starting
  2> 193862 INFO  (closeThreadPool-2556-thread-1) [] o.a.c.f.i.CuratorFrameworkImpl Default schema
  2> 193863 INFO  (closeThreadPool-2556-thread-1-EventThread) [] o.a.c.f.s.ConnectionStateManager State change: CONNECTED
  2> 193864 INFO  (closeThreadPool-2556-thread-1-EventThread) [] o.a.c.f.i.EnsembleTracker New config event received: {}
  2> 193864 INFO  (closeThreadPool-2556-thread-1-EventThread) [] o.a.c.f.i.EnsembleTracker New config event received: {}
  2> 193864 INFO  (Curator-Framework-0) [] o.a.c.f.i.CuratorFrameworkImpl backgroundOperationsLoop exiting
  2> 193965 INFO  (closeThreadPool-2556-thread-1) [] o.a.s.c.SolrXmlConfig Loading solr.xml from /home/jenkins/jenkins-agent/workspace/Solr/Solr-Test-main/solr/core/build/tmp/tests-tmp/org.apache.solr.cloud.RecoveryAfterSoftCommitTest_1CFACF552405F1E5-001/shard-1-001/solr.xml
  2> 194001 INFO  (TEST-RecoveryAfterSoftCommitTest.test-seed#[1CFACF552405F1E5]) [] o.a.s.c.AbstractFullDistribZkTestBase create jetty 2 in directory /home/jenkins/jenkins-agent/workspace/Solr/Solr-Test-main/solr/core/build/tmp/tests-tmp/org.apache.solr.cloud.RecoveryAfterSoftCommitTest_1CFACF552405F1E5-001/shard-2-001 of type NRT for shard1
  2> 194002 INFO  (closeThreadPool-2556-thread-2) [] o.a.s.e.JettySolrRunner Start Jetty (configured port=0, binding port=0)
  2> 194002 INFO  (closeThreadPool-2556-thread-2) [] o.a.s.e.JettySolrRunner Trying to start Jetty on port 0 try number 2 ...
  2> 194002 INFO  (closeThreadPool-2556-thread-2) [] o.e.j.s.Server jetty-12.1.10; built: 2026-05-31T04:45:52.925Z; git: 986024525891c2c20ff08c58ba300dc3b9847586; jvm 21.0.4+7-LTS
  2> 194021 INFO  (closeThreadPool-2556-thread-2) [] o.e.j.s.DefaultSessionIdManager Session workerName=node0
  2> 194021 WARN  (closeThreadPool-2556-thread-2) [] o.e.j.e.s.ServletContextHandler BaseResource file:///home/jenkins/jenkins-agent/workspace/Solr/Solr-Test-main/solr/core/build/tmp/tests-cwd/./ is aliased to file:///home/jenkins/jenkins-agent/workspace/Solr/Solr-Test-main/solr/core/build/tmp/tests-cwd/ in oeje10s.ServletContextHandler@3d131935{/solr,/solr,b=file:///home/jenkins/jenkins-agent/workspace/Solr/Solr-Test-main/solr/core/build/tmp/tests-cwd/./,a=STOPPED,h=oeje10s.ServletHandler@5935b9b3{STOPPED}}. May not be supported in future releases.
  2> 194022 INFO  (closeThreadPool-2556-thread-2) [] o.e.j.s.h.ContextHandler /solr Base Resource is an alias: file:///home/jenkins/jenkins-agent/workspace/Solr/Solr-Test-main/solr/core/build/tmp/tests-cwd/./ -> file:///home/jenkins/jenkins-agent/workspace/Solr/Solr-Test-main/solr/core/build/tmp/tests-cwd/
  2> 194022 INFO  (closeThreadPool-2556-thread-2) [] o.e.j.s.h.ContextHandler Started oeje10s.ServletContextHandler@3d131935{/solr,/solr,b=file:///home/jenkins/jenkins-agent/workspace/Solr/Solr-Test-main/solr/core/build/tmp/tests-cwd/,a=AVAILABLE,h=oeje10s.ServletHandler@5935b9b3{STARTED}}
  2> 194023 INFO  (closeThreadPool-2556-thread-2) [] o.a.s.e.JettySolrRunner Jetty properties: {solrconfig=solrconfig.xml, solr.data.dir=/home/jenkins/jenkins-agent/workspace/Solr/Solr-Test-main/solr/core/build/tmp/tests-tmp/org.apache.solr.cloud.RecoveryAfterSoftCommitTest_1CFACF552405F1E5-001/tempDir-001/jetty2, hostPort=39123, coreRootDirectory=/home/jenkins/jenkins-agent/workspace/Solr/Solr-Test-main/solr/core/build/tmp/tests-tmp/org.apache.solr.cloud.RecoveryAfterSoftCommitTest_1CFACF552405F1E5-001/shard-2-001/cores, replicaType=NRT}
  2> 194023 ERROR (closeThreadPool-2556-thread-2) [] o.a.s.u.StartupLoggingUtils Missing Java Option solr.logs.dir. Logging may be missing or incomplete.
  2> 194023 INFO  (closeThreadPool-2556-thread-2) [] o.a.s.s.CoreContainerProvider Using logger factory org.apache.logging.slf4j.Log4jLoggerFactory
  2> 194023 INFO  (closeThreadPool-2556-thread-2) [] o.a.s.s.CoreContainerProvider  ___      _       Welcome to Apache Solr™ version 11.0.0
  2> 194023 INFO  (closeThreadPool-2556-thread-2) [] o.a.s.s.CoreContainerProvider / __| ___| |_ _   Starting in cloud mode on port null
  2> 194023 INFO  (closeThreadPool-2556-thread-2) [] o.a.s.s.CoreContainerProvider \__ \/ _ \ | '_|  Install dir: /home/jenkins/jenkins-agent/workspace/Solr/Solr-Test-main/solr
  2> 194023 INFO  (closeThreadPool-2556-thread-2) [] o.a.s.s.CoreContainerProvider |___/\___/_|_|    Start time: 2026-08-09T20:30:35.826395309Z
  2> 194023 INFO  (closeThreadPool-2556-thread-2) [] o.a.s.s.CoreContainerProvider Solr Home: /home/jenkins/jenkins-agent/workspace/Solr/Solr-Test-main/solr/core/build/tmp/tests-tmp/org.apache.solr.cloud.RecoveryAfterSoftCommitTest_1CFACF552405F1E5-001/shard-2-001 (source: servlet config: solr.solr.home)
  2> 194023 WARN  (closeThreadPool-2556-thread-2) [] o.a.s.c.c.SolrZkClient Using default ZkCredentialsInjector. ZkCredentialsInjector is not secure, it creates an empty list of credentials which leads to 'OPEN_ACL_UNSAFE' ACLs to Zookeeper nodes
  2> 194023 WARN  (closeThreadPool-2556-thread-2) [] o.a.s.c.c.SolrZkClient Using default ZkACLProvider. DefaultZkACLProvider is not secure, it creates 'OPEN_ACL_UNSAFE' ACLs to Zookeeper nodes
  2> 194024 INFO  (closeThreadPool-2556-thread-2) [] o.a.c.f.i.CuratorFrameworkImpl Starting
  2> 194025 INFO  (closeThreadPool-2556-thread-2) [] o.a.c.f.i.CuratorFrameworkImpl Default schema
  2> 194026 INFO  (closeThreadPool-2556-thread-2-EventThread) [] o.a.c.f.s.ConnectionStateManager State change: CONNECTED
  2> 194027 INFO  (closeThreadPool-2556-thread-2-EventThread) [] o.a.c.f.i.EnsembleTracker New config event received: {}
  2> 194027 INFO  (closeThreadPool-2556-thread-2-EventThread) [] o.a.c.f.i.EnsembleTracker New config event received: {}
  2> 194027 INFO  (Curator-Framework-0) [] o.a.c.f.i.CuratorFrameworkImpl backgroundOperationsLoop exiting
  2> 194128 INFO  (closeThreadPool-2556-thread-2) [] o.a.s.c.SolrXmlConfig Loading solr.xml from /home/jenkins/jenkins-agent/workspace/Solr/Solr-Test-main/solr/core/build/tmp/tests-tmp/org.apache.solr.cloud.RecoveryAfterSoftCommitTest_1CFACF552405F1E5-001/shard-2-001/solr.xml
  2> 194306 INFO  (closeThreadPool-2556-thread-1) [] o.a.s.m.OtelRuntimeJvmMetrics JVM metrics are disabled
  2> 194317 INFO  (closeThreadPool-2556-thread-1) [] o.a.s.c.ZkContainer Zookeeper client=127.0.0.1:38115/solr
  2> 194317 WARN  (closeThreadPool-2556-thread-1) [] o.a.s.c.c.SolrZkClient Using default ZkCredentialsInjector. ZkCredentialsInjector is not secure, it creates an empty list of credentials which leads to 'OPEN_ACL_UNSAFE' ACLs to Zookeeper nodes
  2> 194317 WARN  (closeThreadPool-2556-thread-1) [] o.a.s.c.c.SolrZkClient Using default ZkACLProvider. DefaultZkACLProvider is not secure, it creates 'OPEN_ACL_UNSAFE' ACLs to Zookeeper nodes
  2> 194317 INFO  (closeThreadPool-2556-thread-1) [] o.a.c.f.i.CuratorFrameworkImpl Starting
  2> 194318 INFO  (closeThreadPool-2556-thread-1) [] o.a.c.f.i.CuratorFrameworkImpl Default schema
  2> 194319 INFO  (closeThreadPool-2556-thread-1-EventThread) [] o.a.c.f.s.ConnectionStateManager State change: CONNECTED
  2> 194320 INFO  (closeThreadPool-2556-thread-1-EventThread) [] o.a.c.f.i.EnsembleTracker New config event received: {}
  2> 194320 INFO  (closeThreadPool-2556-thread-1-EventThread) [] o.a.c.f.i.EnsembleTracker New config event received: {}
  2> 194320 INFO  (Curator-Framework-0) [] o.a.c.f.i.CuratorFrameworkImpl backgroundOperationsLoop exiting
  2> 194421 INFO  (closeThreadPool-2556-thread-1) [n:127.0.0.1:44179_solr] o.a.c.f.i.CuratorFrameworkImpl Starting
  2> 194422 INFO  (closeThreadPool-2556-thread-1) [n:127.0.0.1:44179_solr] o.a.c.f.i.CuratorFrameworkImpl Default schema
  2> 194423 INFO  (closeThreadPool-2556-thread-1-EventThread) [] o.a.c.f.s.ConnectionStateManager State change: CONNECTED
  2> 194424 INFO  (closeThreadPool-2556-thread-1-EventThread) [] o.a.c.f.i.EnsembleTracker New config event received: {}
  2> 194424 INFO  (closeThreadPool-2556-thread-1-EventThread) [] o.a.c.f.i.EnsembleTracker New config event received: {}
  2> 194430 WARN  (closeThreadPool-2556-thread-1) [n:127.0.0.1:44179_solr] o.a.s.c.ZkController Contents of zookeeper /security.json are world-readable; consider setting up ACLs as described in https://solr.apache.org/guide/solr/latest/deployment-guide/zookeeper-access-control.html
  2> 194431 INFO  (closeThreadPool-2556-thread-1) [n:127.0.0.1:44179_solr] o.a.s.c.c.ZkStateReader Updated live nodes from ZooKeeper... (0) -> (1)
  2> 194433 INFO  (closeThreadPool-2556-thread-1) [n:127.0.0.1:44179_solr] o.a.s.c.ZkController The Overseer is enabled.  It will process all cluster commands & state updates.
  2> 194437 INFO  (closeThreadPool-2556-thread-1) [n:127.0.0.1:44179_solr] o.a.s.c.ZkController Publish node=127.0.0.1:44179_solr as DOWN
  2> 194439 INFO  (closeThreadPool-2556-thread-1) [n:127.0.0.1:44179_solr] o.a.s.c.ZkController Register node as live in ZooKeeper: /live_nodes/127.0.0.1:44179_solr
  2> 194440 INFO  (zkCallback-2527-thread-1) [] o.a.s.c.c.ZkStateReader Updated live nodes from ZooKeeper... (1) -> (2)
  2> 194440 INFO  (zkCallback-2577-thread-1) [] o.a.s.c.c.ZkStateReader Updated live nodes from ZooKeeper... (1) -> (2)
  2> 194440 INFO  (zkCallback-2553-thread-1) [] o.a.s.c.c.ZkStateReader Updated live nodes from ZooKeeper... (1) -> (2)
  2> 194442 WARN  (closeThreadPool-2556-thread-1) [n:127.0.0.1:44179_solr] o.a.s.c.CoreContainer Not all security plugins configured!  authentication=disabled authorization=disabled.  Solr is only as secure as you make it. Consider configuring authentication/authorization before exposing Solr to users internal or external.  See https://s.apache.org/solrsecurity for more info
  2> 194460 INFO  (closeThreadPool-2556-thread-1) [n:127.0.0.1:44179_solr] o.a.s.c.CorePropertiesLocator Found 0 core definitions underneath /home/jenkins/jenkins-agent/workspace/Solr/Solr-Test-main/solr/core/build/tmp/tests-tmp/org.apache.solr.cloud.RecoveryAfterSoftCommitTest_1CFACF552405F1E5-001/shard-1-001/cores
  2> 194511 INFO  (closeThreadPool-2556-thread-1) [n:127.0.0.1:44179_solr] o.e.j.e.s.ServletContextHandler Started oeje10s.ServletContextHandler@38a4bb3b{/solr,/solr,b=file:///home/jenkins/jenkins-agent/workspace/Solr/Solr-Test-main/solr/core/build/tmp/tests-cwd/,a=AVAILABLE,h=oeje10s.ServletHandler@3b24f264{STARTED}}
  2> 194512 INFO  (closeThreadPool-2556-thread-1) [n:127.0.0.1:44179_solr] o.e.j.s.AbstractConnector Started oejs.ServerConnector@2453366d{HTTP/1.1, (http/1.1, h2c)}{127.0.0.1:46287}
  2> 194512 INFO  (closeThreadPool-2556-thread-1) [n:127.0.0.1:44179_solr] o.e.j.s.Server Started oejs.Server@52fd99fc{STARTING}[12.1.10,sto=0] @654ms
  2> 194512 INFO  (closeThreadPool-2556-thread-1) [] o.a.s.c.AbstractFullDistribZkTestBase waitForLiveNode: 127.0.0.1:44179_solr
  2> 195033 INFO  (closeThreadPool-2556-thread-2) [] o.a.s.m.OtelRuntimeJvmMetrics JVM metrics are disabled
  2> 195043 INFO  (closeThreadPool-2556-thread-2) [] o.a.s.c.ZkContainer Zookeeper client=127.0.0.1:38115/solr
  2> 195043 WARN  (closeThreadPool-2556-thread-2) [] o.a.s.c.c.SolrZkClient Using default ZkCredentialsInjector. ZkCredentialsInjector is not secure, it creates an empty lis

[...truncated too long message...]

ity.policy: error adding Permission, java.net.URLPermission:
	java.util.ServiceConfigurationError: Locale provider adapter "CLDR"cannot be instantiated.
java.security.policy: error adding Permission, java.net.URLPermission:
	java.util.ServiceConfigurationError: Locale provider adapter "CLDR"cannot be instantiated.
java.security.policy: error adding Permission, java.net.URLPermission:
	java.util.ServiceConfigurationError: Locale provider adapter "CLDR"cannot be instantiated.
java.security.policy: error adding Permission, java.net.URLPermission:
	java.util.ServiceConfigurationError: Locale provider adapter "CLDR"cannot be instantiated.
java.security.policy: error adding Permission, java.net.URLPermission:
java.security.policy: error adding Permission, java.net.URLPermission:
	java.util.ServiceConfigurationError: Locale provider adapter "CLDR"cannot be instantiated.
	java.util.ServiceConfigurationError: Locale provider adapter "CLDR"cannot be instantiated.
java.security.policy: error adding Permission, java.net.URLPermission:
	java.util.ServiceConfigurationError: Locale provider adapter "CLDR"cannot be instantiated.
java.security.policy: error adding Permission, java.net.URLPermission:
	java.util.ServiceConfigurationError: Locale provider adapter "CLDR"cannot be instantiated.
java.security.policy: error adding Permission, java.net.URLPermission:
	java.util.ServiceConfigurationError: Locale provider adapter "CLDR"cannot be instantiated.
java.security.policy: error adding Permission, java.net.URLPermission:
	java.util.ServiceConfigurationError: Locale provider adapter "CLDR"cannot be instantiated.
java.security.policy: error adding Permission, java.net.URLPermission:
java.security.policy: error adding Permission, java.net.URLPermission:
	java.util.ServiceConfigurationError: Locale provider adapter "CLDR"cannot be instantiated.
	java.util.ServiceConfigurationError: Locale provider adapter "CLDR"cannot be instantiated.
java.security.policy: error adding Permission, java.net.URLPermission:
	java.util.ServiceConfigurationError: Locale provider adapter "CLDR"cannot be instantiated.
java.security.policy: error adding Permission, java.net.URLPermission:
	java.util.ServiceConfigurationError: Locale provider adapter "CLDR"cannot be instantiated.
java.security.policy: error adding Permission, java.net.URLPermission:
	java.util.ServiceConfigurationError: Locale provider adapter "CLDR"cannot be instantiated.
java.security.policy: error adding Permission, java.net.URLPermission:
	java.util.ServiceConfigurationError: Locale provider adapter "CLDR"cannot be instantiated.
java.security.policy: error adding Permission, java.net.URLPermission:
	java.util.ServiceConfigurationError: Locale provider adapter "CLDR"cannot be instantiated.
java.security.policy: error adding Permission, java.net.URLPermission:
	java.util.ServiceConfigurationError: Locale provider adapter "CLDR"cannot be instantiated.
java.security.policy: error adding Permission, java.net.URLPermission:
	java.util.ServiceConfigurationError: Locale provider adapter "CLDR"cannot be instantiated.
:solr:modules:scripting:test (SUCCESS): 24 test(s), 19 skipped

> Task :solr:modules:scripting:wipeTaskTemp
> Task :solr:modules:sql:compileTestJava
> Task :solr:modules:sql:testClasses

> Task :solr:modules:sql:test
WARNING: Using incubator modules: jdk.incubator.vector
WARNING: Using incubator modules: jdk.incubator.vector
WARNING: Using incubator modules: jdk.incubator.vector
WARNING: A command line option has enabled the Security Manager
WARNING: The Security Manager is deprecated and will be removed in a future release
WARNING: A command line option has enabled the Security Manager
WARNING: The Security Manager is deprecated and will be removed in a future release
WARNING: A command line option has enabled the Security Manager
WARNING: The Security Manager is deprecated and will be removed in a future release
java.security.policy: error adding Permission, java.net.URLPermission:
	java.util.ServiceConfigurationError: Locale provider adapter "CLDR"cannot be instantiated.
java.security.policy: error adding Permission, java.net.URLPermission:
	java.util.ServiceConfigurationError: Locale provider adapter "CLDR"cannot be instantiated.
java.security.policy: error adding Permission, java.net.URLPermission:
	java.util.ServiceConfigurationError: Locale provider adapter "CLDR"cannot be instantiated.
java.security.policy: error adding Permission, java.net.URLPermission:
	java.util.ServiceConfigurationError: Locale provider adapter "CLDR"cannot be instantiated.
java.security.policy: error adding Permission, java.net.URLPermission:
	java.util.ServiceConfigurationError: Locale provider adapter "CLDR"cannot be instantiated.
java.security.policy: error adding Permission, java.net.URLPermission:
	java.util.ServiceConfigurationError: Locale provider adapter "CLDR"cannot be instantiated.
java.security.policy: error adding Permission, java.net.URLPermission:
	java.util.ServiceConfigurationError: Locale provider adapter "CLDR"cannot be instantiated.
java.security.policy: error adding Permission, java.net.URLPermission:
	java.util.ServiceConfigurationError: Locale provider adapter "CLDR"cannot be instantiated.
java.security.policy: error adding Permission, java.net.URLPermission:
	java.util.ServiceConfigurationError: Locale provider adapter "CLDR"cannot be instantiated.
java.security.policy: error adding Permission, java.net.URLPermission:
	java.util.ServiceConfigurationError: Locale provider adapter "CLDR"cannot be instantiated.
java.security.policy: error adding Permission, java.net.URLPermission:
	java.util.ServiceConfigurationError: Locale provider adapter "CLDR"cannot be instantiated.
java.security.policy: error adding Permission, java.net.URLPermission:
	java.util.ServiceConfigurationError: Locale provider adapter "CLDR"cannot be instantiated.
java.security.policy: error adding Permission, java.net.URLPermission:
	java.util.ServiceConfigurationError: Locale provider adapter "CLDR"cannot be instantiated.
java.security.policy: error adding Permission, java.net.URLPermission:
	java.util.ServiceConfigurationError: Locale provider adapter "CLDR"cannot be instantiated.
java.security.policy: error adding Permission, java.net.URLPermission:
	java.util.ServiceConfigurationError: Locale provider adapter "CLDR"cannot be instantiated.
:solr:modules:sql:test (SUCCESS): 34 test(s)

> Task :checkWorkingCopyClean
> Task :solr:modules:sql:wipeTaskTemp
The slowest tests (exceeding 500 ms) during this run:
  69.36s TestCpuAllowedLimit.testDistribLimit (:solr:core)
  60.81s TestRandomCollapseQParserPlugin.testRandomCollapseWithSort (:solr:core)
  52.97s TestCpuAllowedLimit.testDistribLimit2 (:solr:core)
  42.37s PeerSyncReplicationTest.test (:solr:core)
  41.07s BasicDistributedZkTest.test (:solr:core)
  40.15s HttpJettySolrClientTest.testIdleTimeoutWithHttpClient (:solr:solrj-jetty)
  38.35s TestRandomFaceting.testRandomFaceting (:solr:core)
  35.57s TestCloudSearcherWarming.testPeersyncFailureReplicationSuccess (:solr:core)
  30.62s TestRangeQuery.testCompareTypesRandomRangeQueries (:solr:core)
  29.46s TestDistributedStatsComponentCardinality.test (:solr:core)
The slowest suites (exceeding 1s) during this run:
  130.73s TestCpuAllowedLimit (:solr:core)
  79.50s KnnQParserTest (:solr:core)
  67.72s TestRecovery (:solr:core)
  67.50s TestRandomCollapseQParserPlugin (:solr:core)
  66.62s TestCoordinatorRole (:solr:core)
  63.89s MultiThreadedOCPTest (:solr:core)
  52.17s ReindexCollectionTest (:solr:core)
  52.03s TestRangeQuery (:solr:core)
  51.93s HttpJettySolrClientTest (:solr:solrj-jetty)
  49.00s CombinedQuerySolrCloudTest (:solr:core)
ERROR: The following test(s) have failed:
  - org.apache.solr.cloud.RecoveryAfterSoftCommitTest.test (:solr:core)
    Test history: https://develocity.apache.org/scans/tests?search.rootProjectNames=solr-root&tests.container=org.apache.solr.cloud.RecoveryAfterSoftCommitTest&tests.test=test http://fucit.org/solr-jenkins-reports/history-trend-of-recent-failures.html#series/org.apache.solr.cloud.RecoveryAfterSoftCommitTest.test
    Test output: /home/jenkins/jenkins-agent/workspace/Solr/Solr-Test-main/solr/core/build/test-results/test/outputs/OUTPUT-org.apache.solr.cloud.RecoveryAfterSoftCommitTest.txt
    Reproduce with: ./gradlew :solr:core:test --tests "org.apache.solr.cloud.RecoveryAfterSoftCommitTest.test" -Ptests.haltonfailure=false "-Ptests.jvmargs=-XX:TieredStopAtLevel=1 -XX:+UseParallelGC -XX:ActiveProcessorCount=1 -XX:ReservedCodeCacheSize=120m" -Ptests.seed=1CFACF552405F1E5 -Ptests.multiplier=2 -Ptests.useSecurityManager=true -Ptests.badapples=false -Ptests.file.encoding=ISO-8859-1


[Incubating] Problems report is available at: file:///home/jenkins/jenkins-agent/workspace/Solr/Solr-Test-main/build/reports/problems/problems-report.html

Deprecated Gradle features were used in this build, making it incompatible with Gradle 10.

You can use '--warning-mode all' to show the individual deprecation warnings and determine if they come from your own scripts or plugins.

For more on this, please refer to https://docs.gradle.org/9.6.0/userguide/command_line_interface.html#sec:command_line_warnings in the Gradle documentation.

BUILD SUCCESSFUL in 39m 9s
153 actionable tasks: 153 executed

Publishing Build Scan to Develocity...

The Develocity server (develocity.apache.org) rejected the credential with prefix '7x3jzizm4zpygv7psbkg6byvm4'.
Your credential has expired.

Build step 'Invoke Gradle script' changed build result to SUCCESS
Archiving artifacts
‘**/*.events’ doesn’t match anything: ‘**’ exists but not ‘**/*.events’
No artifacts found that match the file pattern "**/*.events,heapdumps/**,**/hs_err_pid*". Configuration error?
Recording test results
[Checks API] No suitable checks publisher found.
Build step 'Publish JUnit test result report' changed build result to UNSTABLE
Email was triggered for: Unstable (Test Failures)
Sending email for trigger: Unstable (Test Failures)