You are viewing a plain text version of this content. The canonical link for it is here.
Posted to builds@solr.apache.org by Apache Jenkins Server <je...@builds.apache.org> on 2025/01/08 05:11:15 UTC
[JENKINS] Solr » Solr-Test-main - Build # 9520 - Unstable!
Build: https://ci-builds.apache.org/job/Solr/job/Solr-Test-main/9520/
4 tests failed.
FAILED: org.apache.solr.search.TestReRankQParserPlugin.testMinExactCount
Error Message:
java.lang.AssertionError: REQUEST FAILED: xpath=//result/doc[2]/str[@name='id'][.='0']
xml response was: <?xml version="1.0" encoding="UTF-8"?>
<response>
<lst name="responseHeader"><int name="status">0</int><int name="QTime">2</int></lst><result name="response" numFound="200" start="0" maxScore="0.0011321187" numFoundExact="true"><doc><str name="id">10</str><float name="score">4.4537134</float></doc><doc><str name="id">11</str><float name="score">0.0011321187</float></doc><doc><str name="id">12</str><float name="score">0.0011321187</float></doc><doc><str name="id">13</str><float name="score">0.0011321187</float></doc><doc><str name="id">14</str><float name="score">0.0011321187</float></doc><doc><str name="id">15</str><float name="score">0.0011321187</float></doc><doc><str name="id">16</str><float name="score">0.0011321187</float></doc><doc><str name="id">17</str><float name="score">0.0011321187</float></doc><doc><str name="id">18</str><float name="score">0.0011321187</float></doc><doc><str name="id">19</str><float name="score">0.0011321187</float></doc></result>
</response>
request was:q=field_t:0&start=0&rows=10&fl=id,score&sort=score+desc,+id_p_i+asc&rq={!rerank+reRankQuery%3D$rrq+reRankDocs%3D20}&rrq=id:10
Stack Trace:
java.lang.AssertionError: REQUEST FAILED: xpath=//result/doc[2]/str[@name='id'][.='0']
xml response was: <?xml version="1.0" encoding="UTF-8"?>
<response>
<lst name="responseHeader"><int name="status">0</int><int name="QTime">2</int></lst><result name="response" numFound="200" start="0" maxScore="0.0011321187" numFoundExact="true"><doc><str name="id">10</str><float name="score">4.4537134</float></doc><doc><str name="id">11</str><float name="score">0.0011321187</float></doc><doc><str name="id">12</str><float name="score">0.0011321187</float></doc><doc><str name="id">13</str><float name="score">0.0011321187</float></doc><doc><str name="id">14</str><float name="score">0.0011321187</float></doc><doc><str name="id">15</str><float name="score">0.0011321187</float></doc><doc><str name="id">16</str><float name="score">0.0011321187</float></doc><doc><str name="id">17</str><float name="score">0.0011321187</float></doc><doc><str name="id">18</str><float name="score">0.0011321187</float></doc><doc><str name="id">19</str><float name="score">0.0011321187</float></doc></result>
</response>
request was:q=field_t:0&start=0&rows=10&fl=id,score&sort=score+desc,+id_p_i+asc&rq={!rerank+reRankQuery%3D$rrq+reRankDocs%3D20}&rrq=id:10
at __randomizedtesting.SeedInfo.seed([F95E67188E92E403:8CDE5D80614F1A74]:0)
at org.junit.Assert.fail(Assert.java:89)
at org.apache.solr.SolrTestCaseJ4.assertQ(SolrTestCaseJ4.java:924)
at org.apache.solr.SolrTestCaseJ4.assertQ(SolrTestCaseJ4.java:888)
at org.apache.solr.search.TestReRankQParserPlugin.testMinExactCount(TestReRankQParserPlugin.java:1047)
at java.base/jdk.internal.reflect.DirectMethodHandleAccessor.invoke(DirectMethodHandleAccessor.java:103)
at java.base/java.lang.reflect.Method.invoke(Method.java:580)
at com.carrotsearch.randomizedtesting.RandomizedRunner.invoke(RandomizedRunner.java:1758)
at com.carrotsearch.randomizedtesting.RandomizedRunner$8.evaluate(RandomizedRunner.java:946)
at com.carrotsearch.randomizedtesting.RandomizedRunner$9.evaluate(RandomizedRunner.java:982)
at com.carrotsearch.randomizedtesting.RandomizedRunner$10.evaluate(RandomizedRunner.java:996)
at com.carrotsearch.randomizedtesting.rules.SystemPropertiesRestoreRule$1.evaluate(SystemPropertiesRestoreRule.java:80)
at org.junit.rules.RunRules.evaluate(RunRules.java:20)
at org.apache.lucene.tests.util.TestRuleSetupTeardownChained$1.evaluate(TestRuleSetupTeardownChained.java:48)
at org.apache.lucene.tests.util.AbstractBeforeAfterRule$1.evaluate(AbstractBeforeAfterRule.java:43)
at org.apache.lucene.tests.util.TestRuleThreadAndTestName$1.evaluate(TestRuleThreadAndTestName.java:45)
at org.apache.lucene.tests.util.TestRuleIgnoreAfterMaxFailures$1.evaluate(TestRuleIgnoreAfterMaxFailures.java:60)
at org.apache.lucene.tests.util.TestRuleMarkFailure$1.evaluate(TestRuleMarkFailure.java:44)
at org.junit.rules.RunRules.evaluate(RunRules.java:20)
at com.carrotsearch.randomizedtesting.rules.StatementAdapter.evaluate(StatementAdapter.java:36)
at com.carrotsearch.randomizedtesting.ThreadLeakControl$StatementRunner.run(ThreadLeakControl.java:390)
at com.carrotsearch.randomizedtesting.ThreadLeakControl.forkTimeoutingTask(ThreadLeakControl.java:843)
at com.carrotsearch.randomizedtesting.ThreadLeakControl$3.evaluate(ThreadLeakControl.java:490)
at com.carrotsearch.randomizedtesting.RandomizedRunner.runSingleTest(RandomizedRunner.java:955)
at com.carrotsearch.randomizedtesting.RandomizedRunner$5.evaluate(RandomizedRunner.java:840)
at com.carrotsearch.randomizedtesting.RandomizedRunner$6.evaluate(RandomizedRunner.java:891)
at com.carrotsearch.randomizedtesting.RandomizedRunner$7.evaluate(RandomizedRunner.java:902)
at com.carrotsearch.randomizedtesting.rules.StatementAdapter.evaluate(StatementAdapter.java:36)
at com.carrotsearch.randomizedtesting.rules.StatementAdapter.evaluate(StatementAdapter.java:36)
at org.apache.lucene.tests.util.AbstractBeforeAfterRule$1.evaluate(AbstractBeforeAfterRule.java:43)
at com.carrotsearch.randomizedtesting.rules.SystemPropertiesRestoreRule$1.evaluate(SystemPropertiesRestoreRule.java:80)
at org.junit.rules.RunRules.evaluate(RunRules.java:20)
at org.apache.lucene.tests.util.AbstractBeforeAfterRule$1.evaluate(AbstractBeforeAfterRule.java:43)
at com.carrotsearch.randomizedtesting.rules.StatementAdapter.evaluate(StatementAdapter.java:36)
at org.apache.lucene.tests.util.TestRuleStoreClassName$1.evaluate(TestRuleStoreClassName.java:38)
at com.carrotsearch.randomizedtesting.rules.NoShadowingOrOverridesOnMethodsRule$1.evaluate(NoShadowingOrOverridesOnMethodsRule.java:40)
at com.carrotsearch.randomizedtesting.rules.NoShadowingOrOverridesOnMethodsRule$1.evaluate(NoShadowingOrOverridesOnMethodsRule.java:40)
at com.carrotsearch.randomizedtesting.rules.StatementAdapter.evaluate(StatementAdapter.java:36)
at com.carrotsearch.randomizedtesting.rules.StatementAdapter.evaluate(StatementAdapter.java:36)
at org.apache.lucene.tests.util.TestRuleAssertionsRequired$1.evaluate(TestRuleAssertionsRequired.java:53)
at org.apache.lucene.tests.util.AbstractBeforeAfterRule$1.evaluate(AbstractBeforeAfterRule.java:43)
at org.apache.lucene.tests.util.TestRuleMarkFailure$1.evaluate(TestRuleMarkFailure.java:44)
at org.apache.lucene.tests.util.TestRuleIgnoreAfterMaxFailures$1.evaluate(TestRuleIgnoreAfterMaxFailures.java:60)
at org.apache.lucene.tests.util.TestRuleIgnoreTestSuites$1.evaluate(TestRuleIgnoreTestSuites.java:47)
at org.junit.rules.RunRules.evaluate(RunRules.java:20)
at com.carrotsearch.randomizedtesting.rules.StatementAdapter.evaluate(StatementAdapter.java:36)
at com.carrotsearch.randomizedtesting.ThreadLeakControl$StatementRunner.run(ThreadLeakControl.java:390)
at com.carrotsearch.randomizedtesting.ThreadLeakControl.lambda$forkTimeoutingTask$0(ThreadLeakControl.java:850)
at java.base/java.lang.Thread.run(Thread.java:1583)
FAILED: org.apache.solr.search.TestReRankQParserPlugin.testMinExactCount
Error Message:
java.lang.AssertionError: REQUEST FAILED: xpath=//result/doc[2]/str[@name='id'][.='0']
xml response was: <?xml version="1.0" encoding="UTF-8"?>
<response>
<lst name="responseHeader"><int name="status">0</int><int name="QTime">10</int></lst><result name="response" numFound="200" start="0" maxScore="0.0011321187" numFoundExact="true"><doc><str name="id">10</str><float name="score">4.4537134</float></doc><doc><str name="id">11</str><float name="score">0.0011321187</float></doc><doc><str name="id">12</str><float name="score">0.0011321187</float></doc><doc><str name="id">13</str><float name="score">0.0011321187</float></doc><doc><str name="id">14</str><float name="score">0.0011321187</float></doc><doc><str name="id">15</str><float name="score">0.0011321187</float></doc><doc><str name="id">16</str><float name="score">0.0011321187</float></doc><doc><str name="id">17</str><float name="score">0.0011321187</float></doc><doc><str name="id">18</str><float name="score">0.0011321187</float></doc><doc><str name="id">19</str><float name="score">0.0011321187</float></doc></result>
</response>
request was:q=field_t:0&start=0&rows=10&fl=id,score&sort=score+desc,+id_p_i+asc&rq={!rerank+reRankQuery%3D$rrq+reRankDocs%3D20}&rrq=id:10
Stack Trace:
java.lang.AssertionError: REQUEST FAILED: xpath=//result/doc[2]/str[@name='id'][.='0']
xml response was: <?xml version="1.0" encoding="UTF-8"?>
<response>
<lst name="responseHeader"><int name="status">0</int><int name="QTime">10</int></lst><result name="response" numFound="200" start="0" maxScore="0.0011321187" numFoundExact="true"><doc><str name="id">10</str><float name="score">4.4537134</float></doc><doc><str name="id">11</str><float name="score">0.0011321187</float></doc><doc><str name="id">12</str><float name="score">0.0011321187</float></doc><doc><str name="id">13</str><float name="score">0.0011321187</float></doc><doc><str name="id">14</str><float name="score">0.0011321187</float></doc><doc><str name="id">15</str><float name="score">0.0011321187</float></doc><doc><str name="id">16</str><float name="score">0.0011321187</float></doc><doc><str name="id">17</str><float name="score">0.0011321187</float></doc><doc><str name="id">18</str><float name="score">0.0011321187</float></doc><doc><str name="id">19</str><float name="score">0.0011321187</float></doc></result>
</response>
request was:q=field_t:0&start=0&rows=10&fl=id,score&sort=score+desc,+id_p_i+asc&rq={!rerank+reRankQuery%3D$rrq+reRankDocs%3D20}&rrq=id:10
at __randomizedtesting.SeedInfo.seed([F95E67188E92E403:8CDE5D80614F1A74]:0)
at org.junit.Assert.fail(Assert.java:89)
at org.apache.solr.SolrTestCaseJ4.assertQ(SolrTestCaseJ4.java:924)
at org.apache.solr.SolrTestCaseJ4.assertQ(SolrTestCaseJ4.java:888)
at org.apache.solr.search.TestReRankQParserPlugin.testMinExactCount(TestReRankQParserPlugin.java:1047)
at java.base/jdk.internal.reflect.DirectMethodHandleAccessor.invoke(DirectMethodHandleAccessor.java:103)
at java.base/java.lang.reflect.Method.invoke(Method.java:580)
at com.carrotsearch.randomizedtesting.RandomizedRunner.invoke(RandomizedRunner.java:1758)
at com.carrotsearch.randomizedtesting.RandomizedRunner$8.evaluate(RandomizedRunner.java:946)
at com.carrotsearch.randomizedtesting.RandomizedRunner$9.evaluate(RandomizedRunner.java:982)
at com.carrotsearch.randomizedtesting.RandomizedRunner$10.evaluate(RandomizedRunner.java:996)
at com.carrotsearch.randomizedtesting.rules.SystemPropertiesRestoreRule$1.evaluate(SystemPropertiesRestoreRule.java:80)
at org.junit.rules.RunRules.evaluate(RunRules.java:20)
at org.apache.lucene.tests.util.TestRuleSetupTeardownChained$1.evaluate(TestRuleSetupTeardownChained.java:48)
at org.apache.lucene.tests.util.AbstractBeforeAfterRule$1.evaluate(AbstractBeforeAfterRule.java:43)
at org.apache.lucene.tests.util.TestRuleThreadAndTestName$1.evaluate(TestRuleThreadAndTestName.java:45)
at org.apache.lucene.tests.util.TestRuleIgnoreAfterMaxFailures$1.evaluate(TestRuleIgnoreAfterMaxFailures.java:60)
at org.apache.lucene.tests.util.TestRuleMarkFailure$1.evaluate(TestRuleMarkFailure.java:44)
at org.junit.rules.RunRules.evaluate(RunRules.java:20)
at com.carrotsearch.randomizedtesting.rules.StatementAdapter.evaluate(StatementAdapter.java:36)
at com.carrotsearch.randomizedtesting.ThreadLeakControl$StatementRunner.run(ThreadLeakControl.java:390)
at com.carrotsearch.randomizedtesting.ThreadLeakControl.forkTimeoutingTask(ThreadLeakControl.java:843)
at com.carrotsearch.randomizedtesting.ThreadLeakControl$3.evaluate(ThreadLeakControl.java:490)
at com.carrotsearch.randomizedtesting.RandomizedRunner.runSingleTest(RandomizedRunner.java:955)
at com.carrotsearch.randomizedtesting.RandomizedRunner$5.evaluate(RandomizedRunner.java:840)
at com.carrotsearch.randomizedtesting.RandomizedRunner$6.evaluate(RandomizedRunner.java:891)
at com.carrotsearch.randomizedtesting.RandomizedRunner$7.evaluate(RandomizedRunner.java:902)
at com.carrotsearch.randomizedtesting.rules.StatementAdapter.evaluate(StatementAdapter.java:36)
at com.carrotsearch.randomizedtesting.rules.StatementAdapter.evaluate(StatementAdapter.java:36)
at org.apache.lucene.tests.util.AbstractBeforeAfterRule$1.evaluate(AbstractBeforeAfterRule.java:43)
at com.carrotsearch.randomizedtesting.rules.SystemPropertiesRestoreRule$1.evaluate(SystemPropertiesRestoreRule.java:80)
at org.junit.rules.RunRules.evaluate(RunRules.java:20)
at org.apache.lucene.tests.util.AbstractBeforeAfterRule$1.evaluate(AbstractBeforeAfterRule.java:43)
at com.carrotsearch.randomizedtesting.rules.StatementAdapter.evaluate(StatementAdapter.java:36)
at org.apache.lucene.tests.util.TestRuleStoreClassName$1.evaluate(TestRuleStoreClassName.java:38)
at com.carrotsearch.randomizedtesting.rules.NoShadowingOrOverridesOnMethodsRule$1.evaluate(NoShadowingOrOverridesOnMethodsRule.java:40)
at com.carrotsearch.randomizedtesting.rules.NoShadowingOrOverridesOnMethodsRule$1.evaluate(NoShadowingOrOverridesOnMethodsRule.java:40)
at com.carrotsearch.randomizedtesting.rules.StatementAdapter.evaluate(StatementAdapter.java:36)
at com.carrotsearch.randomizedtesting.rules.StatementAdapter.evaluate(StatementAdapter.java:36)
at org.apache.lucene.tests.util.TestRuleAssertionsRequired$1.evaluate(TestRuleAssertionsRequired.java:53)
at org.apache.lucene.tests.util.AbstractBeforeAfterRule$1.evaluate(AbstractBeforeAfterRule.java:43)
at org.apache.lucene.tests.util.TestRuleMarkFailure$1.evaluate(TestRuleMarkFailure.java:44)
at org.apache.lucene.tests.util.TestRuleIgnoreAfterMaxFailures$1.evaluate(TestRuleIgnoreAfterMaxFailures.java:60)
at org.apache.lucene.tests.util.TestRuleIgnoreTestSuites$1.evaluate(TestRuleIgnoreTestSuites.java:47)
at org.junit.rules.RunRules.evaluate(RunRules.java:20)
at com.carrotsearch.randomizedtesting.rules.StatementAdapter.evaluate(StatementAdapter.java:36)
at com.carrotsearch.randomizedtesting.ThreadLeakControl$StatementRunner.run(ThreadLeakControl.java:390)
at com.carrotsearch.randomizedtesting.ThreadLeakControl.lambda$forkTimeoutingTask$0(ThreadLeakControl.java:850)
at java.base/java.lang.Thread.run(Thread.java:1583)
FAILED: org.apache.solr.search.TestReRankQParserPlugin.testMinExactCount
Error Message:
java.lang.AssertionError: REQUEST FAILED: xpath=//result/doc[2]/str[@name='id'][.='0']
xml response was: <?xml version="1.0" encoding="UTF-8"?>
<response>
<lst name="responseHeader"><int name="status">0</int><int name="QTime">11</int></lst><result name="response" numFound="200" start="0" maxScore="0.0011321187" numFoundExact="true"><doc><str name="id">10</str><float name="score">4.4537134</float></doc><doc><str name="id">11</str><float name="score">0.0011321187</float></doc><doc><str name="id">12</str><float name="score">0.0011321187</float></doc><doc><str name="id">13</str><float name="score">0.0011321187</float></doc><doc><str name="id">14</str><float name="score">0.0011321187</float></doc><doc><str name="id">15</str><float name="score">0.0011321187</float></doc><doc><str name="id">16</str><float name="score">0.0011321187</float></doc><doc><str name="id">17</str><float name="score">0.0011321187</float></doc><doc><str name="id">18</str><float name="score">0.0011321187</float></doc><doc><str name="id">19</str><float name="score">0.0011321187</float></doc></result>
</response>
request was:q=field_t:0&start=0&rows=10&fl=id,score&sort=score+desc,+id_p_i+asc&rq={!rerank+reRankQuery%3D$rrq+reRankDocs%3D20}&rrq=id:10
Stack Trace:
java.lang.AssertionError: REQUEST FAILED: xpath=//result/doc[2]/str[@name='id'][.='0']
xml response was: <?xml version="1.0" encoding="UTF-8"?>
<response>
<lst name="responseHeader"><int name="status">0</int><int name="QTime">11</int></lst><result name="response" numFound="200" start="0" maxScore="0.0011321187" numFoundExact="true"><doc><str name="id">10</str><float name="score">4.4537134</float></doc><doc><str name="id">11</str><float name="score">0.0011321187</float></doc><doc><str name="id">12</str><float name="score">0.0011321187</float></doc><doc><str name="id">13</str><float name="score">0.0011321187</float></doc><doc><str name="id">14</str><float name="score">0.0011321187</float></doc><doc><str name="id">15</str><float name="score">0.0011321187</float></doc><doc><str name="id">16</str><float name="score">0.0011321187</float></doc><doc><str name="id">17</str><float name="score">0.0011321187</float></doc><doc><str name="id">18</str><float name="score">0.0011321187</float></doc><doc><str name="id">19</str><float name="score">0.0011321187</float></doc></result>
</response>
request was:q=field_t:0&start=0&rows=10&fl=id,score&sort=score+desc,+id_p_i+asc&rq={!rerank+reRankQuery%3D$rrq+reRankDocs%3D20}&rrq=id:10
at __randomizedtesting.SeedInfo.seed([F95E67188E92E403:8CDE5D80614F1A74]:0)
at org.junit.Assert.fail(Assert.java:89)
at org.apache.solr.SolrTestCaseJ4.assertQ(SolrTestCaseJ4.java:924)
at org.apache.solr.SolrTestCaseJ4.assertQ(SolrTestCaseJ4.java:888)
at org.apache.solr.search.TestReRankQParserPlugin.testMinExactCount(TestReRankQParserPlugin.java:1047)
at java.base/jdk.internal.reflect.DirectMethodHandleAccessor.invoke(DirectMethodHandleAccessor.java:103)
at java.base/java.lang.reflect.Method.invoke(Method.java:580)
at com.carrotsearch.randomizedtesting.RandomizedRunner.invoke(RandomizedRunner.java:1758)
at com.carrotsearch.randomizedtesting.RandomizedRunner$8.evaluate(RandomizedRunner.java:946)
at com.carrotsearch.randomizedtesting.RandomizedRunner$9.evaluate(RandomizedRunner.java:982)
at com.carrotsearch.randomizedtesting.RandomizedRunner$10.evaluate(RandomizedRunner.java:996)
at com.carrotsearch.randomizedtesting.rules.SystemPropertiesRestoreRule$1.evaluate(SystemPropertiesRestoreRule.java:80)
at org.junit.rules.RunRules.evaluate(RunRules.java:20)
at org.apache.lucene.tests.util.TestRuleSetupTeardownChained$1.evaluate(TestRuleSetupTeardownChained.java:48)
at org.apache.lucene.tests.util.AbstractBeforeAfterRule$1.evaluate(AbstractBeforeAfterRule.java:43)
at org.apache.lucene.tests.util.TestRuleThreadAndTestName$1.evaluate(TestRuleThreadAndTestName.java:45)
at org.apache.lucene.tests.util.TestRuleIgnoreAfterMaxFailures$1.evaluate(TestRuleIgnoreAfterMaxFailures.java:60)
at org.apache.lucene.tests.util.TestRuleMarkFailure$1.evaluate(TestRuleMarkFailure.java:44)
at org.junit.rules.RunRules.evaluate(RunRules.java:20)
at com.carrotsearch.randomizedtesting.rules.StatementAdapter.evaluate(StatementAdapter.java:36)
at com.carrotsearch.randomizedtesting.ThreadLeakControl$StatementRunner.run(ThreadLeakControl.java:390)
at com.carrotsearch.randomizedtesting.ThreadLeakControl.forkTimeoutingTask(ThreadLeakControl.java:843)
at com.carrotsearch.randomizedtesting.ThreadLeakControl$3.evaluate(ThreadLeakControl.java:490)
at com.carrotsearch.randomizedtesting.RandomizedRunner.runSingleTest(RandomizedRunner.java:955)
at com.carrotsearch.randomizedtesting.RandomizedRunner$5.evaluate(RandomizedRunner.java:840)
at com.carrotsearch.randomizedtesting.RandomizedRunner$6.evaluate(RandomizedRunner.java:891)
at com.carrotsearch.randomizedtesting.RandomizedRunner$7.evaluate(RandomizedRunner.java:902)
at com.carrotsearch.randomizedtesting.rules.StatementAdapter.evaluate(StatementAdapter.java:36)
at com.carrotsearch.randomizedtesting.rules.StatementAdapter.evaluate(StatementAdapter.java:36)
at org.apache.lucene.tests.util.AbstractBeforeAfterRule$1.evaluate(AbstractBeforeAfterRule.java:43)
at com.carrotsearch.randomizedtesting.rules.SystemPropertiesRestoreRule$1.evaluate(SystemPropertiesRestoreRule.java:80)
at org.junit.rules.RunRules.evaluate(RunRules.java:20)
at org.apache.lucene.tests.util.AbstractBeforeAfterRule$1.evaluate(AbstractBeforeAfterRule.java:43)
at com.carrotsearch.randomizedtesting.rules.StatementAdapter.evaluate(StatementAdapter.java:36)
at org.apache.lucene.tests.util.TestRuleStoreClassName$1.evaluate(TestRuleStoreClassName.java:38)
at com.carrotsearch.randomizedtesting.rules.NoShadowingOrOverridesOnMethodsRule$1.evaluate(NoShadowingOrOverridesOnMethodsRule.java:40)
at com.carrotsearch.randomizedtesting.rules.NoShadowingOrOverridesOnMethodsRule$1.evaluate(NoShadowingOrOverridesOnMethodsRule.java:40)
at com.carrotsearch.randomizedtesting.rules.StatementAdapter.evaluate(StatementAdapter.java:36)
at com.carrotsearch.randomizedtesting.rules.StatementAdapter.evaluate(StatementAdapter.java:36)
at org.apache.lucene.tests.util.TestRuleAssertionsRequired$1.evaluate(TestRuleAssertionsRequired.java:53)
at org.apache.lucene.tests.util.AbstractBeforeAfterRule$1.evaluate(AbstractBeforeAfterRule.java:43)
at org.apache.lucene.tests.util.TestRuleMarkFailure$1.evaluate(TestRuleMarkFailure.java:44)
at org.apache.lucene.tests.util.TestRuleIgnoreAfterMaxFailures$1.evaluate(TestRuleIgnoreAfterMaxFailures.java:60)
at org.apache.lucene.tests.util.TestRuleIgnoreTestSuites$1.evaluate(TestRuleIgnoreTestSuites.java:47)
at org.junit.rules.RunRules.evaluate(RunRules.java:20)
at com.carrotsearch.randomizedtesting.rules.StatementAdapter.evaluate(StatementAdapter.java:36)
at com.carrotsearch.randomizedtesting.ThreadLeakControl$StatementRunner.run(ThreadLeakControl.java:390)
at com.carrotsearch.randomizedtesting.ThreadLeakControl.lambda$forkTimeoutingTask$0(ThreadLeakControl.java:850)
at java.base/java.lang.Thread.run(Thread.java:1583)
FAILED: org.apache.solr.search.TestReRankQParserPlugin.testMinExactCount
Error Message:
java.lang.AssertionError: REQUEST FAILED: xpath=//result/doc[2]/str[@name='id'][.='0']
xml response was: <?xml version="1.0" encoding="UTF-8"?>
<response>
<lst name="responseHeader"><int name="status">0</int><int name="QTime">10</int></lst><result name="response" numFound="200" start="0" maxScore="0.0011321187" numFoundExact="true"><doc><str name="id">10</str><float name="score">4.4537134</float></doc><doc><str name="id">11</str><float name="score">0.0011321187</float></doc><doc><str name="id">12</str><float name="score">0.0011321187</float></doc><doc><str name="id">13</str><float name="score">0.0011321187</float></doc><doc><str name="id">14</str><float name="score">0.0011321187</float></doc><doc><str name="id">15</str><float name="score">0.0011321187</float></doc><doc><str name="id">16</str><float name="score">0.0011321187</float></doc><doc><str name="id">17</str><float name="score">0.0011321187</float></doc><doc><str name="id">18</str><float name="score">0.0011321187</float></doc><doc><str name="id">19</str><float name="score">0.0011321187</float></doc></result>
</response>
request was:q=field_t:0&start=0&rows=10&fl=id,score&sort=score+desc,+id_p_i+asc&rq={!rerank+reRankQuery%3D$rrq+reRankDocs%3D20}&rrq=id:10
Stack Trace:
java.lang.AssertionError: REQUEST FAILED: xpath=//result/doc[2]/str[@name='id'][.='0']
xml response was: <?xml version="1.0" encoding="UTF-8"?>
<response>
<lst name="responseHeader"><int name="status">0</int><int name="QTime">10</int></lst><result name="response" numFound="200" start="0" maxScore="0.0011321187" numFoundExact="true"><doc><str name="id">10</str><float name="score">4.4537134</float></doc><doc><str name="id">11</str><float name="score">0.0011321187</float></doc><doc><str name="id">12</str><float name="score">0.0011321187</float></doc><doc><str name="id">13</str><float name="score">0.0011321187</float></doc><doc><str name="id">14</str><float name="score">0.0011321187</float></doc><doc><str name="id">15</str><float name="score">0.0011321187</float></doc><doc><str name="id">16</str><float name="score">0.0011321187</float></doc><doc><str name="id">17</str><float name="score">0.0011321187</float></doc><doc><str name="id">18</str><float name="score">0.0011321187</float></doc><doc><str name="id">19</str><float name="score">0.0011321187</float></doc></result>
</response>
request was:q=field_t:0&start=0&rows=10&fl=id,score&sort=score+desc,+id_p_i+asc&rq={!rerank+reRankQuery%3D$rrq+reRankDocs%3D20}&rrq=id:10
at __randomizedtesting.SeedInfo.seed([F95E67188E92E403:8CDE5D80614F1A74]:0)
at org.junit.Assert.fail(Assert.java:89)
at org.apache.solr.SolrTestCaseJ4.assertQ(SolrTestCaseJ4.java:924)
at org.apache.solr.SolrTestCaseJ4.assertQ(SolrTestCaseJ4.java:888)
at org.apache.solr.search.TestReRankQParserPlugin.testMinExactCount(TestReRankQParserPlugin.java:1047)
at java.base/jdk.internal.reflect.DirectMethodHandleAccessor.invoke(DirectMethodHandleAccessor.java:103)
at java.base/java.lang.reflect.Method.invoke(Method.java:580)
at com.carrotsearch.randomizedtesting.RandomizedRunner.invoke(RandomizedRunner.java:1758)
at com.carrotsearch.randomizedtesting.RandomizedRunner$8.evaluate(RandomizedRunner.java:946)
at com.carrotsearch.randomizedtesting.RandomizedRunner$9.evaluate(RandomizedRunner.java:982)
at com.carrotsearch.randomizedtesting.RandomizedRunner$10.evaluate(RandomizedRunner.java:996)
at com.carrotsearch.randomizedtesting.rules.SystemPropertiesRestoreRule$1.evaluate(SystemPropertiesRestoreRule.java:80)
at org.junit.rules.RunRules.evaluate(RunRules.java:20)
at org.apache.lucene.tests.util.TestRuleSetupTeardownChained$1.evaluate(TestRuleSetupTeardownChained.java:48)
at org.apache.lucene.tests.util.AbstractBeforeAfterRule$1.evaluate(AbstractBeforeAfterRule.java:43)
at org.apache.lucene.tests.util.TestRuleThreadAndTestName$1.evaluate(TestRuleThreadAndTestName.java:45)
at org.apache.lucene.tests.util.TestRuleIgnoreAfterMaxFailures$1.evaluate(TestRuleIgnoreAfterMaxFailures.java:60)
at org.apache.lucene.tests.util.TestRuleMarkFailure$1.evaluate(TestRuleMarkFailure.java:44)
at org.junit.rules.RunRules.evaluate(RunRules.java:20)
at com.carrotsearch.randomizedtesting.rules.StatementAdapter.evaluate(StatementAdapter.java:36)
at com.carrotsearch.randomizedtesting.ThreadLeakControl$StatementRunner.run(ThreadLeakControl.java:390)
at com.carrotsearch.randomizedtesting.ThreadLeakControl.forkTimeoutingTask(ThreadLeakControl.java:843)
at com.carrotsearch.randomizedtesting.ThreadLeakControl$3.evaluate(ThreadLeakControl.java:490)
at com.carrotsearch.randomizedtesting.RandomizedRunner.runSingleTest(RandomizedRunner.java:955)
at com.carrotsearch.randomizedtesting.RandomizedRunner$5.evaluate(RandomizedRunner.java:840)
at com.carrotsearch.randomizedtesting.RandomizedRunner$6.evaluate(RandomizedRunner.java:891)
at com.carrotsearch.randomizedtesting.RandomizedRunner$7.evaluate(RandomizedRunner.java:902)
at com.carrotsearch.randomizedtesting.rules.StatementAdapter.evaluate(StatementAdapter.java:36)
at com.carrotsearch.randomizedtesting.rules.StatementAdapter.evaluate(StatementAdapter.java:36)
at org.apache.lucene.tests.util.AbstractBeforeAfterRule$1.evaluate(AbstractBeforeAfterRule.java:43)
at com.carrotsearch.randomizedtesting.rules.SystemPropertiesRestoreRule$1.evaluate(SystemPropertiesRestoreRule.java:80)
at org.junit.rules.RunRules.evaluate(RunRules.java:20)
at org.apache.lucene.tests.util.AbstractBeforeAfterRule$1.evaluate(AbstractBeforeAfterRule.java:43)
at com.carrotsearch.randomizedtesting.rules.StatementAdapter.evaluate(StatementAdapter.java:36)
at org.apache.lucene.tests.util.TestRuleStoreClassName$1.evaluate(TestRuleStoreClassName.java:38)
at com.carrotsearch.randomizedtesting.rules.NoShadowingOrOverridesOnMethodsRule$1.evaluate(NoShadowingOrOverridesOnMethodsRule.java:40)
at com.carrotsearch.randomizedtesting.rules.NoShadowingOrOverridesOnMethodsRule$1.evaluate(NoShadowingOrOverridesOnMethodsRule.java:40)
at com.carrotsearch.randomizedtesting.rules.StatementAdapter.evaluate(StatementAdapter.java:36)
at com.carrotsearch.randomizedtesting.rules.StatementAdapter.evaluate(StatementAdapter.java:36)
at org.apache.lucene.tests.util.TestRuleAssertionsRequired$1.evaluate(TestRuleAssertionsRequired.java:53)
at org.apache.lucene.tests.util.AbstractBeforeAfterRule$1.evaluate(AbstractBeforeAfterRule.java:43)
at org.apache.lucene.tests.util.TestRuleMarkFailure$1.evaluate(TestRuleMarkFailure.java:44)
at org.apache.lucene.tests.util.TestRuleIgnoreAfterMaxFailures$1.evaluate(TestRuleIgnoreAfterMaxFailures.java:60)
at org.apache.lucene.tests.util.TestRuleIgnoreTestSuites$1.evaluate(TestRuleIgnoreTestSuites.java:47)
at org.junit.rules.RunRules.evaluate(RunRules.java:20)
at com.carrotsearch.randomizedtesting.rules.StatementAdapter.evaluate(StatementAdapter.java:36)
at com.carrotsearch.randomizedtesting.ThreadLeakControl$StatementRunner.run(ThreadLeakControl.java:390)
at com.carrotsearch.randomizedtesting.ThreadLeakControl.lambda$forkTimeoutingTask$0(ThreadLeakControl.java:850)
at java.base/java.lang.Thread.run(Thread.java:1583)
Build Log:
[...truncated 2295 lines...]
ERROR: The following test(s) have failed:
- org.apache.solr.search.TestReRankQParserPlugin.testMinExactCount (:solr:core)
Test history: https://ge.apache.org/scans/tests?search.rootProjectNames=solr-root&tests.container=org.apache.solr.search.TestReRankQParserPlugin&tests.test=testMinExactCount http://fucit.org/solr-jenkins-reports/history-trend-of-recent-failures.html#series/org.apache.solr.search.TestReRankQParserPlugin.testMinExactCount
Test output: /home/jenkins/jenkins-slave/workspace/Solr/Solr-Test-main/solr/core/build/test-results/test/outputs/OUTPUT-org.apache.solr.search.TestReRankQParserPlugin.txt
Reproduce with: ./gradlew :solr:core:test --tests "org.apache.solr.search.TestReRankQParserPlugin.testMinExactCount" -Ptests.jvms=4 -Ptests.haltonfailure=false "-Ptests.jvmargs=-XX:TieredStopAtLevel=1 -XX:+UseParallelGC -XX:ActiveProcessorCount=1 -XX:ReservedCodeCacheSize=120m" -Ptests.seed=F95E67188E92E403 -Ptests.multiplier=2 -Ptests.badapples=false -Ptests.file.encoding=ISO-8859-1
Deprecated Gradle features were used in this build, making it incompatible with Gradle 9.0.
You can use '--warning-mode all' to show the individual deprecation warnings and determine if they come from your own scripts or plugins.
For more on this, please refer to https://docs.gradle.org/8.10/userguide/command_line_interface.html#sec:command_line_warnings in the Gradle documentation.
BUILD SUCCESSFUL in 51m 41s
152 actionable tasks: 152 executed
Publishing build scan...
https://ge.apache.org/s/yr7x5v7vtfjpa
Build step 'Invoke Gradle script' changed build result to SUCCESS
Archiving artifacts
‘**/*.events’ doesn’t match anything: ‘**’ exists but not ‘**/*.events’
No artifacts found that match the file pattern "**/*.events,heapdumps/**,**/hs_err_pid*". Configuration error?
Recording test results
[Checks API] No suitable checks publisher found.
Build step 'Publish JUnit test result report' changed build result to UNSTABLE
Email was triggered for: Unstable (Test Failures)
Sending email for trigger: Unstable (Test Failures)