You are viewing a plain text version of this content. The canonical link for it is here.
Posted to dev@lucene.apache.org by Policeman Jenkins Server <je...@thetaphi.de> on 2015/08/06 03:12:29 UTC

[JENKINS] Lucene-Solr-trunk-Linux (32bit/jdk1.8.0_51) - Build # 13746 - Still Failing!

Build: http://jenkins.thetaphi.de/job/Lucene-Solr-trunk-Linux/13746/
Java: 32bit/jdk1.8.0_51 -server -XX:+UseConcMarkSweepGC

2 tests failed.
FAILED:  junit.framework.TestSuite.org.apache.solr.cloud.TestCryptoKeys

Error Message:
Suite timeout exceeded (>= 7200000 msec).

Stack Trace:
java.lang.Exception: Suite timeout exceeded (>= 7200000 msec).
	at __randomizedtesting.SeedInfo.seed([AE7E9E22798D439C]:0)


FAILED:  org.apache.solr.cloud.TestCryptoKeys.test

Error Message:
Test abandoned because suite timeout was reached.

Stack Trace:
java.lang.Exception: Test abandoned because suite timeout was reached.
	at __randomizedtesting.SeedInfo.seed([AE7E9E22798D439C]:0)




Build Log:
[...truncated 11155 lines...]
   [junit4] Suite: org.apache.solr.cloud.TestCryptoKeys
   [junit4]   2> Creating dataDir: /home/jenkins/workspace/Lucene-Solr-trunk-Linux/solr/build/solr-core/test/J0/temp/solr.cloud.TestCryptoKeys_AE7E9E22798D439C-001/init-core-data-001
   [junit4]   2> 216657 INFO  (SUITE-TestCryptoKeys-seed#[AE7E9E22798D439C]-worker) [    ] o.a.s.SolrTestCaseJ4 Randomized ssl (false) and clientAuth (false)
   [junit4]   2> 216657 INFO  (SUITE-TestCryptoKeys-seed#[AE7E9E22798D439C]-worker) [    ] o.a.s.BaseDistributedSearchTestCase Setting hostContext system property: /vj_xb/cg
   [junit4]   2> 216658 INFO  (TEST-TestCryptoKeys.test-seed#[AE7E9E22798D439C]) [    ] o.a.s.c.ZkTestServer STARTING ZK TEST SERVER
   [junit4]   2> 216659 INFO  (Thread-616) [    ] o.a.s.c.ZkTestServer client port:0.0.0.0/0.0.0.0:0
   [junit4]   2> 216659 INFO  (Thread-616) [    ] o.a.s.c.ZkTestServer Starting server
   [junit4]   2> 216759 INFO  (TEST-TestCryptoKeys.test-seed#[AE7E9E22798D439C]) [    ] o.a.s.c.ZkTestServer start zk server on port:45421
   [junit4]   2> 216759 INFO  (TEST-TestCryptoKeys.test-seed#[AE7E9E22798D439C]) [    ] o.a.s.c.c.SolrZkClient Using default ZkCredentialsProvider
   [junit4]   2> 216759 INFO  (TEST-TestCryptoKeys.test-seed#[AE7E9E22798D439C]) [    ] o.a.s.c.c.ConnectionManager Waiting for client to connect to ZooKeeper
   [junit4]   2> 216768 INFO  (zkCallback-127-thread-1) [    ] o.a.s.c.c.ConnectionManager Watcher org.apache.solr.common.cloud.ConnectionManager@4a2270 name:ZooKeeperConnection Watcher:127.0.0.1:45421 got event WatchedEvent state:SyncConnected type:None path:null path:null type:None
   [junit4]   2> 216768 INFO  (TEST-TestCryptoKeys.test-seed#[AE7E9E22798D439C]) [    ] o.a.s.c.c.ConnectionManager Client is connected to ZooKeeper
   [junit4]   2> 216768 INFO  (TEST-TestCryptoKeys.test-seed#[AE7E9E22798D439C]) [    ] o.a.s.c.c.SolrZkClient Using default ZkACLProvider
   [junit4]   2> 216768 INFO  (TEST-TestCryptoKeys.test-seed#[AE7E9E22798D439C]) [    ] o.a.s.c.c.SolrZkClient makePath: /solr
   [junit4]   2> 216770 INFO  (TEST-TestCryptoKeys.test-seed#[AE7E9E22798D439C]) [    ] o.a.s.c.c.SolrZkClient Using default ZkCredentialsProvider
   [junit4]   2> 216770 INFO  (TEST-TestCryptoKeys.test-seed#[AE7E9E22798D439C]) [    ] o.a.s.c.c.ConnectionManager Waiting for client to connect to ZooKeeper
   [junit4]   2> 216771 INFO  (zkCallback-128-thread-1) [    ] o.a.s.c.c.ConnectionManager Watcher org.apache.solr.common.cloud.ConnectionManager@1ada2db name:ZooKeeperConnection Watcher:127.0.0.1:45421/solr got event WatchedEvent state:SyncConnected type:None path:null path:null type:None
   [junit4]   2> 216771 INFO  (TEST-TestCryptoKeys.test-seed#[AE7E9E22798D439C]) [    ] o.a.s.c.c.ConnectionManager Client is connected to ZooKeeper
   [junit4]   2> 216771 INFO  (TEST-TestCryptoKeys.test-seed#[AE7E9E22798D439C]) [    ] o.a.s.c.c.SolrZkClient Using default ZkACLProvider
   [junit4]   2> 216771 INFO  (TEST-TestCryptoKeys.test-seed#[AE7E9E22798D439C]) [    ] o.a.s.c.c.SolrZkClient makePath: /collections/collection1
   [junit4]   2> 216772 INFO  (TEST-TestCryptoKeys.test-seed#[AE7E9E22798D439C]) [    ] o.a.s.c.c.SolrZkClient makePath: /collections/collection1/shards
   [junit4]   2> 216773 INFO  (TEST-TestCryptoKeys.test-seed#[AE7E9E22798D439C]) [    ] o.a.s.c.c.SolrZkClient makePath: /collections/control_collection
   [junit4]   2> 216773 INFO  (TEST-TestCryptoKeys.test-seed#[AE7E9E22798D439C]) [    ] o.a.s.c.c.SolrZkClient makePath: /collections/control_collection/shards
   [junit4]   2> 216774 INFO  (TEST-TestCryptoKeys.test-seed#[AE7E9E22798D439C]) [    ] o.a.s.c.AbstractZkTestCase put /home/jenkins/workspace/Lucene-Solr-trunk-Linux/solr/core/src/test-files/solr/collection1/conf/solrconfig-tlog.xml to /configs/conf1/solrconfig.xml
   [junit4]   2> 216774 INFO  (TEST-TestCryptoKeys.test-seed#[AE7E9E22798D439C]) [    ] o.a.s.c.c.SolrZkClient makePath: /configs/conf1/solrconfig.xml
   [junit4]   2> 216775 INFO  (TEST-TestCryptoKeys.test-seed#[AE7E9E22798D439C]) [    ] o.a.s.c.AbstractZkTestCase put /home/jenkins/workspace/Lucene-Solr-trunk-Linux/solr/core/src/test-files/solr/collection1/conf/schema.xml to /configs/conf1/schema.xml
   [junit4]   2> 216775 INFO  (TEST-TestCryptoKeys.test-seed#[AE7E9E22798D439C]) [    ] o.a.s.c.c.SolrZkClient makePath: /configs/conf1/schema.xml
   [junit4]   2> 216776 INFO  (TEST-TestCryptoKeys.test-seed#[AE7E9E22798D439C]) [    ] o.a.s.c.AbstractZkTestCase put /home/jenkins/workspace/Lucene-Solr-trunk-Linux/solr/core/src/test-files/solr/collection1/conf/solrconfig.snippet.randomindexconfig.xml to /configs/conf1/solrconfig.snippet.randomindexconfig.xml
   [junit4]   2> 216776 INFO  (TEST-TestCryptoKeys.test-seed#[AE7E9E22798D439C]) [    ] o.a.s.c.c.SolrZkClient makePath: /configs/conf1/solrconfig.snippet.randomindexconfig.xml
   [junit4]   2> 216777 INFO  (TEST-TestCryptoKeys.test-seed#[AE7E9E22798D439C]) [    ] o.a.s.c.AbstractZkTestCase put /home/jenkins/workspace/Lucene-Solr-trunk-Linux/solr/core/src/test-files/solr/collection1/conf/stopwords.txt to /configs/conf1/stopwords.txt
   [junit4]   2> 216777 INFO  (TEST-TestCryptoKeys.test-seed#[AE7E9E22798D439C]) [    ] o.a.s.c.c.SolrZkClient makePath: /configs/conf1/stopwords.txt
   [junit4]   2> 216777 INFO  (TEST-TestCryptoKeys.test-seed#[AE7E9E22798D439C]) [    ] o.a.s.c.AbstractZkTestCase put /home/jenkins/workspace/Lucene-Solr-trunk-Linux/solr/core/src/test-files/solr/collection1/conf/protwords.txt to /configs/conf1/protwords.txt
   [junit4]   2> 216777 INFO  (TEST-TestCryptoKeys.test-seed#[AE7E9E22798D439C]) [    ] o.a.s.c.c.SolrZkClient makePath: /configs/conf1/protwords.txt
   [junit4]   2> 216778 INFO  (TEST-TestCryptoKeys.test-seed#[AE7E9E22798D439C]) [    ] o.a.s.c.AbstractZkTestCase put /home/jenkins/workspace/Lucene-Solr-trunk-Linux/solr/core/src/test-files/solr/collection1/conf/currency.xml to /configs/conf1/currency.xml
   [junit4]   2> 216778 INFO  (TEST-TestCryptoKeys.test-seed#[AE7E9E22798D439C]) [    ] o.a.s.c.c.SolrZkClient makePath: /configs/conf1/currency.xml
   [junit4]   2> 216779 INFO  (TEST-TestCryptoKeys.test-seed#[AE7E9E22798D439C]) [    ] o.a.s.c.AbstractZkTestCase put /home/jenkins/workspace/Lucene-Solr-trunk-Linux/solr/core/src/test-files/solr/collection1/conf/enumsConfig.xml to /configs/conf1/enumsConfig.xml
   [junit4]   2> 216779 INFO  (TEST-TestCryptoKeys.test-seed#[AE7E9E22798D439C]) [    ] o.a.s.c.c.SolrZkClient makePath: /configs/conf1/enumsConfig.xml
   [junit4]   2> 216779 INFO  (TEST-TestCryptoKeys.test-seed#[AE7E9E22798D439C]) [    ] o.a.s.c.AbstractZkTestCase put /home/jenkins/workspace/Lucene-Solr-trunk-Linux/solr/core/src/test-files/solr/collection1/conf/open-exchange-rates.json to /configs/conf1/open-exchange-rates.json
   [junit4]   2> 216779 INFO  (TEST-TestCryptoKeys.test-seed#[AE7E9E22798D439C]) [    ] o.a.s.c.c.SolrZkClient makePath: /configs/conf1/open-exchange-rates.json
   [junit4]   2> 216780 INFO  (TEST-TestCryptoKeys.test-seed#[AE7E9E22798D439C]) [    ] o.a.s.c.AbstractZkTestCase put /home/jenkins/workspace/Lucene-Solr-trunk-Linux/solr/core/src/test-files/solr/collection1/conf/mapping-ISOLatin1Accent.txt to /configs/conf1/mapping-ISOLatin1Accent.txt
   [junit4]   2> 216780 INFO  (TEST-TestCryptoKeys.test-seed#[AE7E9E22798D439C]) [    ] o.a.s.c.c.SolrZkClient makePath: /configs/conf1/mapping-ISOLatin1Accent.txt
   [junit4]   2> 216781 INFO  (TEST-TestCryptoKeys.test-seed#[AE7E9E22798D439C]) [    ] o.a.s.c.AbstractZkTestCase put /home/jenkins/workspace/Lucene-Solr-trunk-Linux/solr/core/src/test-files/solr/collection1/conf/old_synonyms.txt to /configs/conf1/old_synonyms.txt
   [junit4]   2> 216781 INFO  (TEST-TestCryptoKeys.test-seed#[AE7E9E22798D439C]) [    ] o.a.s.c.c.SolrZkClient makePath: /configs/conf1/old_synonyms.txt
   [junit4]   2> 216781 INFO  (TEST-TestCryptoKeys.test-seed#[AE7E9E22798D439C]) [    ] o.a.s.c.AbstractZkTestCase put /home/jenkins/workspace/Lucene-Solr-trunk-Linux/solr/core/src/test-files/solr/collection1/conf/synonyms.txt to /configs/conf1/synonyms.txt
   [junit4]   2> 216782 INFO  (TEST-TestCryptoKeys.test-seed#[AE7E9E22798D439C]) [    ] o.a.s.c.c.SolrZkClient makePath: /configs/conf1/synonyms.txt
   [junit4]   2> 216879 INFO  (TEST-TestCryptoKeys.test-seed#[AE7E9E22798D439C]) [    ] o.a.s.SolrTestCaseJ4 Writing core.properties file to /home/jenkins/workspace/Lucene-Solr-trunk-Linux/solr/build/solr-core/test/J0/temp/solr.cloud.TestCryptoKeys_AE7E9E22798D439C-001/control-001/cores/collection1
   [junit4]   2> 216880 INFO  (TEST-TestCryptoKeys.test-seed#[AE7E9E22798D439C]) [    ] o.e.j.s.Server jetty-9.2.11.v20150529
   [junit4]   2> 216882 INFO  (TEST-TestCryptoKeys.test-seed#[AE7E9E22798D439C]) [    ] o.e.j.s.h.ContextHandler Started o.e.j.s.ServletContextHandler@10d43bf{/vj_xb/cg,null,AVAILABLE}
   [junit4]   2> 216889 INFO  (TEST-TestCryptoKeys.test-seed#[AE7E9E22798D439C]) [    ] o.e.j.s.ServerConnector Started ServerConnector@1542952{HTTP/1.1}{127.0.0.1:๓๖๔๒๑}
   [junit4]   2> 216889 INFO  (TEST-TestCryptoKeys.test-seed#[AE7E9E22798D439C]) [    ] o.e.j.s.Server Started @๒๑๘๗๑๗ms
   [junit4]   2> 216889 INFO  (TEST-TestCryptoKeys.test-seed#[AE7E9E22798D439C]) [    ] o.a.s.c.s.e.JettySolrRunner Jetty properties: {solr.data.dir=/home/jenkins/workspace/Lucene-Solr-trunk-Linux/solr/build/solr-core/test/J0/temp/solr.cloud.TestCryptoKeys_AE7E9E22798D439C-001/tempDir-001/control/data, hostContext=/vj_xb/cg, hostPort=36421, coreRootDirectory=/home/jenkins/workspace/Lucene-Solr-trunk-Linux/solr/build/solr-core/test/J0/temp/solr.cloud.TestCryptoKeys_AE7E9E22798D439C-001/control-001/cores}
   [junit4]   2> 216890 INFO  (TEST-TestCryptoKeys.test-seed#[AE7E9E22798D439C]) [    ] o.a.s.s.SolrDispatchFilter SolrDispatchFilter.init(): sun.misc.Launcher$AppClassLoader@e2f2a
   [junit4]   2> 216890 INFO  (TEST-TestCryptoKeys.test-seed#[AE7E9E22798D439C]) [    ] o.a.s.c.SolrResourceLoader new SolrResourceLoader for directory: '/home/jenkins/workspace/Lucene-Solr-trunk-Linux/solr/build/solr-core/test/J0/temp/solr.cloud.TestCryptoKeys_AE7E9E22798D439C-001/control-001/'
   [junit4]   2> 216901 INFO  (TEST-TestCryptoKeys.test-seed#[AE7E9E22798D439C]) [    ] o.a.s.c.c.SolrZkClient Using default ZkCredentialsProvider
   [junit4]   2> 216901 INFO  (TEST-TestCryptoKeys.test-seed#[AE7E9E22798D439C]) [    ] o.a.s.c.c.ConnectionManager Waiting for client to connect to ZooKeeper
   [junit4]   2> 216904 INFO  (zkCallback-129-thread-1) [    ] o.a.s.c.c.ConnectionManager Watcher org.apache.solr.common.cloud.ConnectionManager@1813a24 name:ZooKeeperConnection Watcher:127.0.0.1:45421/solr got event WatchedEvent state:SyncConnected type:None path:null path:null type:None
   [junit4]   2> 216904 INFO  (TEST-TestCryptoKeys.test-seed#[AE7E9E22798D439C]) [    ] o.a.s.c.c.ConnectionManager Client is connected to ZooKeeper
   [junit4]   2> 216904 INFO  (TEST-TestCryptoKeys.test-seed#[AE7E9E22798D439C]) [    ] o.a.s.c.c.SolrZkClient Using default ZkACLProvider
   [junit4]   2> 216905 INFO  (TEST-TestCryptoKeys.test-seed#[AE7E9E22798D439C]) [    ] o.a.s.s.SolrDispatchFilter Loading solr.xml from SolrHome (not found in ZooKeeper)
   [junit4]   2> 216905 INFO  (TEST-TestCryptoKeys.test-seed#[AE7E9E22798D439C]) [    ] o.a.s.c.SolrXmlConfig Loading container configuration from /home/jenkins/workspace/Lucene-Solr-trunk-Linux/solr/build/solr-core/test/J0/temp/solr.cloud.TestCryptoKeys_AE7E9E22798D439C-001/control-001/solr.xml
   [junit4]   2> 216908 INFO  (TEST-TestCryptoKeys.test-seed#[AE7E9E22798D439C]) [    ] o.a.s.c.CoresLocator Config-defined core root directory: /home/jenkins/workspace/Lucene-Solr-trunk-Linux/solr/build/solr-core/test/J0/temp/solr.cloud.TestCryptoKeys_AE7E9E22798D439C-001/control-001/cores
   [junit4]   2> 216908 INFO  (TEST-TestCryptoKeys.test-seed#[AE7E9E22798D439C]) [    ] o.a.s.c.CoreContainer New CoreContainer 25752933
   [junit4]   2> 216908 INFO  (TEST-TestCryptoKeys.test-seed#[AE7E9E22798D439C]) [    ] o.a.s.c.CoreContainer Loading cores into CoreContainer [instanceDir=/home/jenkins/workspace/Lucene-Solr-trunk-Linux/solr/build/solr-core/test/J0/temp/solr.cloud.TestCryptoKeys_AE7E9E22798D439C-001/control-001/]
   [junit4]   2> 216909 INFO  (TEST-TestCryptoKeys.test-seed#[AE7E9E22798D439C]) [    ] o.a.s.c.CoreContainer loading shared library: /home/jenkins/workspace/Lucene-Solr-trunk-Linux/solr/build/solr-core/test/J0/temp/solr.cloud.TestCryptoKeys_AE7E9E22798D439C-001/control-001/lib
   [junit4]   2> 216909 WARN  (TEST-TestCryptoKeys.test-seed#[AE7E9E22798D439C]) [    ] o.a.s.c.SolrResourceLoader Can't find (or read) directory to add to classloader: lib (resolved as: /home/jenkins/workspace/Lucene-Solr-trunk-Linux/solr/build/solr-core/test/J0/temp/solr.cloud.TestCryptoKeys_AE7E9E22798D439C-001/control-001/lib).
   [junit4]   2> 216913 INFO  (TEST-TestCryptoKeys.test-seed#[AE7E9E22798D439C]) [    ] o.a.s.h.c.HttpShardHandlerFactory created with socketTimeout : 90000,urlScheme : ,connTimeout : 15000,maxConnectionsPerHost : 20,maxConnections : 10000,corePoolSize : 0,maximumPoolSize : 2147483647,maxThreadIdleTime : 5,sizeOfQueue : -1,fairnessPolicy : false,useRetries : false,
   [junit4]   2> 216914 INFO  (TEST-TestCryptoKeys.test-seed#[AE7E9E22798D439C]) [    ] o.a.s.u.UpdateShardHandler Creating UpdateShardHandler HTTP client with params: socketTimeout=340000&connTimeout=45000&retry=true
   [junit4]   2> 216914 INFO  (TEST-TestCryptoKeys.test-seed#[AE7E9E22798D439C]) [    ] o.a.s.l.LogWatcher SLF4J impl is org.slf4j.impl.Log4jLoggerFactory
   [junit4]   2> 216914 INFO  (TEST-TestCryptoKeys.test-seed#[AE7E9E22798D439C]) [    ] o.a.s.l.LogWatcher Registering Log Listener [Log4j (org.slf4j.impl.Log4jLoggerFactory)]
   [junit4]   2> 216915 INFO  (TEST-TestCryptoKeys.test-seed#[AE7E9E22798D439C]) [    ] o.a.s.c.ZkContainer Zookeeper client=127.0.0.1:45421/solr
   [junit4]   2> 216915 INFO  (TEST-TestCryptoKeys.test-seed#[AE7E9E22798D439C]) [    ] o.a.s.c.ZkController zkHost includes chroot
   [junit4]   2> 216915 INFO  (TEST-TestCryptoKeys.test-seed#[AE7E9E22798D439C]) [    ] o.a.s.c.c.SolrZkClient Using default ZkCredentialsProvider
   [junit4]   2> 216915 INFO  (TEST-TestCryptoKeys.test-seed#[AE7E9E22798D439C]) [    ] o.a.s.c.c.ConnectionManager Waiting for client to connect to ZooKeeper
   [junit4]   2> 216930 INFO  (zkCallback-131-thread-1) [    ] o.a.s.c.c.ConnectionManager Watcher org.apache.solr.common.cloud.ConnectionManager@159410c name:ZooKeeperConnection Watcher:127.0.0.1:45421 got event WatchedEvent state:SyncConnected type:None path:null path:null type:None
   [junit4]   2> 216930 INFO  (TEST-TestCryptoKeys.test-seed#[AE7E9E22798D439C]) [    ] o.a.s.c.c.ConnectionManager Client is connected to ZooKeeper
   [junit4]   2> 216930 INFO  (TEST-TestCryptoKeys.test-seed#[AE7E9E22798D439C]) [    ] o.a.s.c.c.SolrZkClient Using default ZkACLProvider
   [junit4]   2> 216932 INFO  (TEST-TestCryptoKeys.test-seed#[AE7E9E22798D439C]) [n:127.0.0.1:36421_vj_xb%2Fcg    ] o.a.s.c.c.ConnectionManager Waiting for client to connect to ZooKeeper
   [junit4]   2> 216934 INFO  (zkCallback-132-thread-1-processing-n:127.0.0.1:36421_vj_xb%2Fcg) [n:127.0.0.1:36421_vj_xb%2Fcg    ] o.a.s.c.c.ConnectionManager Watcher org.apache.solr.common.cloud.ConnectionManager@10854f0 name:ZooKeeperConnection Watcher:127.0.0.1:45421/solr got event WatchedEvent state:SyncConnected type:None path:null path:null type:None
   [junit4]   2> 216935 INFO  (TEST-TestCryptoKeys.test-seed#[AE7E9E22798D439C]) [n:127.0.0.1:36421_vj_xb%2Fcg    ] o.a.s.c.c.ConnectionManager Client is connected to ZooKeeper
   [junit4]   2> 216935 INFO  (TEST-TestCryptoKeys.test-seed#[AE7E9E22798D439C]) [n:127.0.0.1:36421_vj_xb%2Fcg    ] o.a.s.c.c.SolrZkClient makePath: /overseer/queue
   [junit4]   2> 216936 INFO  (TEST-TestCryptoKeys.test-seed#[AE7E9E22798D439C]) [n:127.0.0.1:36421_vj_xb%2Fcg    ] o.a.s.c.c.SolrZkClient makePath: /overseer/collection-queue-work
   [junit4]   2> 216937 INFO  (TEST-TestCryptoKeys.test-seed#[AE7E9E22798D439C]) [n:127.0.0.1:36421_vj_xb%2Fcg    ] o.a.s.c.c.SolrZkClient makePath: /overseer/collection-map-running
   [junit4]   2> 216937 INFO  (TEST-TestCryptoKeys.test-seed#[AE7E9E22798D439C]) [n:127.0.0.1:36421_vj_xb%2Fcg    ] o.a.s.c.c.SolrZkClient makePath: /overseer/collection-map-completed
   [junit4]   2> 216938 INFO  (TEST-TestCryptoKeys.test-seed#[AE7E9E22798D439C]) [n:127.0.0.1:36421_vj_xb%2Fcg    ] o.a.s.c.c.SolrZkClient makePath: /overseer/collection-map-failure
   [junit4]   2> 216938 INFO  (TEST-TestCryptoKeys.test-seed#[AE7E9E22798D439C]) [n:127.0.0.1:36421_vj_xb%2Fcg    ] o.a.s.c.c.SolrZkClient makePath: /live_nodes
   [junit4]   2> 216939 INFO  (TEST-TestCryptoKeys.test-seed#[AE7E9E22798D439C]) [n:127.0.0.1:36421_vj_xb%2Fcg    ] o.a.s.c.c.SolrZkClient makePath: /aliases.json
   [junit4]   2> 216939 INFO  (TEST-TestCryptoKeys.test-seed#[AE7E9E22798D439C]) [n:127.0.0.1:36421_vj_xb%2Fcg    ] o.a.s.c.c.SolrZkClient makePath: /clusterstate.json
   [junit4]   2> 216940 INFO  (TEST-TestCryptoKeys.test-seed#[AE7E9E22798D439C]) [n:127.0.0.1:36421_vj_xb%2Fcg    ] o.a.s.c.ZkController Register node as live in ZooKeeper:/live_nodes/127.0.0.1:36421_vj_xb%2Fcg
   [junit4]   2> 216940 INFO  (TEST-TestCryptoKeys.test-seed#[AE7E9E22798D439C]) [n:127.0.0.1:36421_vj_xb%2Fcg    ] o.a.s.c.c.SolrZkClient makePath: /live_nodes/127.0.0.1:36421_vj_xb%2Fcg
   [junit4]   2> 216940 INFO  (TEST-TestCryptoKeys.test-seed#[AE7E9E22798D439C]) [n:127.0.0.1:36421_vj_xb%2Fcg    ] o.a.s.c.c.SolrZkClient makePath: /overseer_elect
   [junit4]   2> 216941 INFO  (TEST-TestCryptoKeys.test-seed#[AE7E9E22798D439C]) [n:127.0.0.1:36421_vj_xb%2Fcg    ] o.a.s.c.c.SolrZkClient makePath: /overseer_elect/election
   [junit4]   2> 216941 INFO  (TEST-TestCryptoKeys.test-seed#[AE7E9E22798D439C]) [n:127.0.0.1:36421_vj_xb%2Fcg    ] o.a.s.c.Overseer Overseer (id=null) closing
   [junit4]   2> 216941 INFO  (TEST-TestCryptoKeys.test-seed#[AE7E9E22798D439C]) [n:127.0.0.1:36421_vj_xb%2Fcg    ] o.a.s.c.LeaderElector Joined leadership election with path: /overseer_elect/election/94294265847414788-127.0.0.1:36421_vj_xb%2Fcg-n_0000000000
   [junit4]   2> 216942 INFO  (TEST-TestCryptoKeys.test-seed#[AE7E9E22798D439C]) [n:127.0.0.1:36421_vj_xb%2Fcg    ] o.a.s.c.OverseerElectionContext I am going to be the leader 127.0.0.1:36421_vj_xb%2Fcg
   [junit4]   2> 216942 INFO  (TEST-TestCryptoKeys.test-seed#[AE7E9E22798D439C]) [n:127.0.0.1:36421_vj_xb%2Fcg    ] o.a.s.c.c.SolrZkClient makePath: /overseer_elect/leader
   [junit4]   2> 216942 INFO  (TEST-TestCryptoKeys.test-seed#[AE7E9E22798D439C]) [n:127.0.0.1:36421_vj_xb%2Fcg    ] o.a.s.c.Overseer Overseer (id=94294265847414788-127.0.0.1:36421_vj_xb%2Fcg-n_0000000000) starting
   [junit4]   2> 216943 INFO  (TEST-TestCryptoKeys.test-seed#[AE7E9E22798D439C]) [n:127.0.0.1:36421_vj_xb%2Fcg    ] o.a.s.c.c.SolrZkClient makePath: /overseer/queue-work
   [junit4]   2> 216945 INFO  (TEST-TestCryptoKeys.test-seed#[AE7E9E22798D439C]) [n:127.0.0.1:36421_vj_xb%2Fcg    ] o.a.s.c.OverseerAutoReplicaFailoverThread Starting OverseerAutoReplicaFailoverThread autoReplicaFailoverWorkLoopDelay=10000 autoReplicaFailoverWaitAfterExpiration=30000 autoReplicaFailoverBadNodeExpiration=60000
   [junit4]   2> 216945 INFO  (OverseerCollectionProcessor-94294265847414788-127.0.0.1:36421_vj_xb%2Fcg-n_0000000000) [n:127.0.0.1:36421_vj_xb%2Fcg    ] o.a.s.c.OverseerCollectionProcessor Process current queue of collection creations
   [junit4]   2> 216945 INFO  (OverseerStateUpdate-94294265847414788-127.0.0.1:36421_vj_xb%2Fcg-n_0000000000) [n:127.0.0.1:36421_vj_xb%2Fcg    ] o.a.s.c.Overseer Starting to work on the main queue
   [junit4]   2> 216945 INFO  (TEST-TestCryptoKeys.test-seed#[AE7E9E22798D439C]) [n:127.0.0.1:36421_vj_xb%2Fcg    ] o.a.s.c.c.ZkStateReader Updating cluster state from ZooKeeper... 
   [junit4]   2> 216959 INFO  (TEST-TestCryptoKeys.test-seed#[AE7E9E22798D439C]) [n:127.0.0.1:36421_vj_xb%2Fcg    ] o.a.s.c.CoreContainer No authentication plugin used.
   [junit4]   2> 216959 INFO  (TEST-TestCryptoKeys.test-seed#[AE7E9E22798D439C]) [n:127.0.0.1:36421_vj_xb%2Fcg    ] o.a.s.c.CoreContainer Security conf doesn't exist. Skipping setup for authorization module.
   [junit4]   2> 216960 INFO  (TEST-TestCryptoKeys.test-seed#[AE7E9E22798D439C]) [n:127.0.0.1:36421_vj_xb%2Fcg    ] o.a.s.c.CoresLocator Looking for core definitions underneath /home/jenkins/workspace/Lucene-Solr-trunk-Linux/solr/build/solr-core/test/J0/temp/solr.cloud.TestCryptoKeys_AE7E9E22798D439C-001/control-001/cores
   [junit4]   2> 216960 INFO  (TEST-TestCryptoKeys.test-seed#[AE7E9E22798D439C]) [n:127.0.0.1:36421_vj_xb%2Fcg    ] o.a.s.c.SolrCore Created CoreDescriptor: {name=collection1, config=solrconfig.xml, transient=false, schema=schema.xml, loadOnStartup=true, configSetProperties=configsetprops.json, instanceDir=/home/jenkins/workspace/Lucene-Solr-trunk-Linux/solr/build/solr-core/test/J0/temp/solr.cloud.TestCryptoKeys_AE7E9E22798D439C-001/control-001/cores/collection1, collection=control_collection, absoluteInstDir=/home/jenkins/workspace/Lucene-Solr-trunk-Linux/solr/build/solr-core/test/J0/temp/solr.cloud.TestCryptoKeys_AE7E9E22798D439C-001/control-001/cores/collection1/, coreNodeName=, dataDir=data/, shard=}
   [junit4]   2> 216960 INFO  (TEST-TestCryptoKeys.test-seed#[AE7E9E22798D439C]) [n:127.0.0.1:36421_vj_xb%2Fcg    ] o.a.s.c.CoresLocator Found core collection1 in /home/jenkins/workspace/Lucene-Solr-trunk-Linux/solr/build/solr-core/test/J0/temp/solr.cloud.TestCryptoKeys_AE7E9E22798D439C-001/control-001/cores/collection1/
   [junit4]   2> 216960 INFO  (TEST-TestCryptoKeys.test-seed#[AE7E9E22798D439C]) [n:127.0.0.1:36421_vj_xb%2Fcg    ] o.a.s.c.CoresLocator Found 1 core definitions
   [junit4]   2> 216975 INFO  (coreLoadExecutor-912-thread-1-processing-n:127.0.0.1:36421_vj_xb%2Fcg) [n:127.0.0.1:36421_vj_xb%2Fcg c:control_collection   x:collection1] o.a.s.c.ZkController publishing state=down
   [junit4]   2> 216975 INFO  (TEST-TestCryptoKeys.test-seed#[AE7E9E22798D439C]) [n:127.0.0.1:36421_vj_xb%2Fcg    ] o.a.s.s.SolrDispatchFilter user.dir=/home/jenkins/workspace/Lucene-Solr-trunk-Linux/solr/build/solr-core/test/J0
   [junit4]   2> 216975 INFO  (coreLoadExecutor-912-thread-1-processing-n:127.0.0.1:36421_vj_xb%2Fcg) [n:127.0.0.1:36421_vj_xb%2Fcg c:control_collection   x:collection1] o.a.s.c.ZkController numShards not found on descriptor - reading it from system property
   [junit4]   2> 216975 INFO  (TEST-TestCryptoKeys.test-seed#[AE7E9E22798D439C]) [n:127.0.0.1:36421_vj_xb%2Fcg    ] o.a.s.s.SolrDispatchFilter SolrDispatchFilter.init() done
   [junit4]   2> 216976 INFO  (zkCallback-132-thread-1-processing-n:127.0.0.1:36421_vj_xb%2Fcg) [n:127.0.0.1:36421_vj_xb%2Fcg    ] o.a.s.c.DistributedQueue NodeChildrenChanged fired on path /overseer/queue state SyncConnected
   [junit4]   2> 216976 INFO  (coreLoadExecutor-912-thread-1-processing-n:127.0.0.1:36421_vj_xb%2Fcg) [n:127.0.0.1:36421_vj_xb%2Fcg c:control_collection   x:collection1] o.a.s.c.ZkController look for our core node name
   [junit4]   2> 216976 INFO  (OverseerStateUpdate-94294265847414788-127.0.0.1:36421_vj_xb%2Fcg-n_0000000000) [n:127.0.0.1:36421_vj_xb%2Fcg    ] o.a.s.c.Overseer processMessage: queueSize: 1, message = {
   [junit4]   2>   "core":"collection1",
   [junit4]   2>   "roles":null,
   [junit4]   2>   "base_url":"http://127.0.0.1:36421/vj_xb/cg",
   [junit4]   2>   "node_name":"127.0.0.1:36421_vj_xb%2Fcg",
   [junit4]   2>   "numShards":"1",
   [junit4]   2>   "state":"down",
   [junit4]   2>   "shard":null,
   [junit4]   2>   "collection":"control_collection",
   [junit4]   2>   "operation":"state"} current state version: 0
   [junit4]   2> 216977 INFO  (OverseerStateUpdate-94294265847414788-127.0.0.1:36421_vj_xb%2Fcg-n_0000000000) [n:127.0.0.1:36421_vj_xb%2Fcg    ] o.a.s.c.o.ReplicaMutator Update state numShards=1 message={
   [junit4]   2>   "core":"collection1",
   [junit4]   2>   "roles":null,
   [junit4]   2>   "base_url":"http://127.0.0.1:36421/vj_xb/cg",
   [junit4]   2>   "node_name":"127.0.0.1:36421_vj_xb%2Fcg",
   [junit4]   2>   "numShards":"1",
   [junit4]   2>   "state":"down",
   [junit4]   2>   "shard":null,
   [junit4]   2>   "collection":"control_collection",
   [junit4]   2>   "operation":"state"}
   [junit4]   2> 216977 INFO  (OverseerStateUpdate-94294265847414788-127.0.0.1:36421_vj_xb%2Fcg-n_0000000000) [n:127.0.0.1:36421_vj_xb%2Fcg    ] o.a.s.c.o.ClusterStateMutator building a new cName: control_collection
   [junit4]   2> 216977 INFO  (OverseerStateUpdate-94294265847414788-127.0.0.1:36421_vj_xb%2Fcg-n_0000000000) [n:127.0.0.1:36421_vj_xb%2Fcg    ] o.a.s.c.o.ReplicaMutator Assigning new node to shard shard=shard1
   [junit4]   2> 216977 INFO  (zkCallback-132-thread-1-processing-n:127.0.0.1:36421_vj_xb%2Fcg) [n:127.0.0.1:36421_vj_xb%2Fcg    ] o.a.s.c.c.ZkStateReader A cluster state change: WatchedEvent state:SyncConnected type:NodeDataChanged path:/clusterstate.json, has occurred - updating... (live nodes size: 1)
   [junit4]   2> 216978 INFO  (zkCallback-132-thread-1-processing-n:127.0.0.1:36421_vj_xb%2Fcg) [n:127.0.0.1:36421_vj_xb%2Fcg    ] o.a.s.c.c.ZkStateReader Updated cluster state version to 1
   [junit4]   2> 217976 INFO  (coreLoadExecutor-912-thread-1-processing-n:127.0.0.1:36421_vj_xb%2Fcg) [n:127.0.0.1:36421_vj_xb%2Fcg c:control_collection   x:collection1] o.a.s.c.ZkController waiting to find shard id in clusterstate for collection1
   [junit4]   2> 217976 INFO  (coreLoadExecutor-912-thread-1-processing-n:127.0.0.1:36421_vj_xb%2Fcg) [n:127.0.0.1:36421_vj_xb%2Fcg c:control_collection   x:collection1] o.a.s.c.ZkController Check for collection zkNode:control_collection
   [junit4]   2> 217977 INFO  (coreLoadExecutor-912-thread-1-processing-n:127.0.0.1:36421_vj_xb%2Fcg) [n:127.0.0.1:36421_vj_xb%2Fcg c:control_collection   x:collection1] o.a.s.c.ZkController Collection zkNode exists
   [junit4]   2> 217977 INFO  (coreLoadExecutor-912-thread-1-processing-n:127.0.0.1:36421_vj_xb%2Fcg) [n:127.0.0.1:36421_vj_xb%2Fcg c:control_collection   x:collection1] o.a.s.c.c.ZkStateReader Load collection config from:/collections/control_collection
   [junit4]   2> 217977 INFO  (coreLoadExecutor-912-thread-1-processing-n:127.0.0.1:36421_vj_xb%2Fcg) [n:127.0.0.1:36421_vj_xb%2Fcg c:control_collection   x:collection1] o.a.s.c.c.ZkStateReader path=/collections/control_collection configName=conf1 specified config exists in ZooKeeper
   [junit4]   2> 217977 INFO  (coreLoadExecutor-912-thread-1-processing-n:127.0.0.1:36421_vj_xb%2Fcg) [n:127.0.0.1:36421_vj_xb%2Fcg c:control_collection   x:collection1] o.a.s.c.SolrResourceLoader new SolrResourceLoader for directory: '/home/jenkins/workspace/Lucene-Solr-trunk-Linux/solr/build/solr-core/test/J0/temp/solr.cloud.TestCryptoKeys_AE7E9E22798D439C-001/control-001/cores/collection1/'
   [junit4]   2> 217984 INFO  (coreLoadExecutor-912-thread-1-processing-n:127.0.0.1:36421_vj_xb%2Fcg) [n:127.0.0.1:36421_vj_xb%2Fcg c:control_collection   x:collection1] o.a.s.c.Config loaded config solrconfig.xml with version 0 
   [junit4]   2> 217987 INFO  (coreLoadExecutor-912-thread-1-processing-n:127.0.0.1:36421_vj_xb%2Fcg) [n:127.0.0.1:36421_vj_xb%2Fcg c:control_collection   x:collection1] o.a.s.c.SolrConfig current version of requestparams : -1
   [junit4]   2> 217990 INFO  (coreLoadExecutor-912-thread-1-processing-n:127.0.0.1:36421_vj_xb%2Fcg) [n:127.0.0.1:36421_vj_xb%2Fcg c:control_collection   x:collection1] o.a.s.c.SolrConfig Using Lucene MatchVersion: 6.0.0
   [junit4]   2> 217996 INFO  (coreLoadExecutor-912-thread-1-processing-n:127.0.0.1:36421_vj_xb%2Fcg) [n:127.0.0.1:36421_vj_xb%2Fcg c:control_collection   x:collection1] o.a.s.c.Config Loaded SolrConfig: solrconfig.xml
   [junit4]   2> 217997 INFO  (coreLoadExecutor-912-thread-1-processing-n:127.0.0.1:36421_vj_xb%2Fcg) [n:127.0.0.1:36421_vj_xb%2Fcg c:control_collection   x:collection1] o.a.s.s.IndexSchema Reading Solr Schema from /configs/conf1/schema.xml
   [junit4]   2> 218002 INFO  (coreLoadExecutor-912-thread-1-processing-n:127.0.0.1:36421_vj_xb%2Fcg) [n:127.0.0.1:36421_vj_xb%2Fcg c:control_collection   x:collection1] o.a.s.s.IndexSchema [collection1] Schema name=test
   [junit4]   2> 218067 INFO  (coreLoadExecutor-912-thread-1-processing-n:127.0.0.1:36421_vj_xb%2Fcg) [n:127.0.0.1:36421_vj_xb%2Fcg c:control_collection   x:collection1] o.a.s.s.OpenExchangeRatesOrgProvider Initialized with rates=open-exchange-rates.json, refreshInterval=1440.
   [junit4]   2> 218070 INFO  (coreLoadExecutor-912-thread-1-processing-n:127.0.0.1:36421_vj_xb%2Fcg) [n:127.0.0.1:36421_vj_xb%2Fcg c:control_collection   x:collection1] o.a.s.s.IndexSchema default search field in schema is text
   [junit4]   2> 218071 INFO  (coreLoadExecutor-912-thread-1-processing-n:127.0.0.1:36421_vj_xb%2Fcg) [n:127.0.0.1:36421_vj_xb%2Fcg c:control_collection   x:collection1] o.a.s.s.IndexSchema unique key field: id
   [junit4]   2> 218075 INFO  (coreLoadExecutor-912-thread-1-processing-n:127.0.0.1:36421_vj_xb%2Fcg) [n:127.0.0.1:36421_vj_xb%2Fcg c:control_collection   x:collection1] o.a.s.s.FileExchangeRateProvider Reloading exchange rates from file currency.xml
   [junit4]   2> 218076 INFO  (coreLoadExecutor-912-thread-1-processing-n:127.0.0.1:36421_vj_xb%2Fcg) [n:127.0.0.1:36421_vj_xb%2Fcg c:control_collection   x:collection1] o.a.s.s.FileExchangeRateProvider Reloading exchange rates from file currency.xml
   [junit4]   2> 218077 INFO  (coreLoadExecutor-912-thread-1-processing-n:127.0.0.1:36421_vj_xb%2Fcg) [n:127.0.0.1:36421_vj_xb%2Fcg c:control_collection   x:collection1] o.a.s.s.OpenExchangeRatesOrgProvider Reloading exchange rates from open-exchange-rates.json
   [junit4]   2> 218078 WARN  (coreLoadExecutor-912-thread-1-processing-n:127.0.0.1:36421_vj_xb%2Fcg) [n:127.0.0.1:36421_vj_xb%2Fcg c:control_collection   x:collection1] o.a.s.s.OpenExchangeRatesOrgProvider Unknown key IMPORTANT NOTE
   [junit4]   2> 218078 WARN  (coreLoadExecutor-912-thread-1-processing-n:127.0.0.1:36421_vj_xb%2Fcg) [n:127.0.0.1:36421_vj_xb%2Fcg c:control_collection   x:collection1] o.a.s.s.OpenExchangeRatesOrgProvider Expected key, got STRING
   [junit4]   2> 218078 INFO  (coreLoadExecutor-912-thread-1-processing-n:127.0.0.1:36421_vj_xb%2Fcg) [n:127.0.0.1:36421_vj_xb%2Fcg c:control_collection   x:collection1] o.a.s.s.OpenExchangeRatesOrgProvider Reloading exchange rates from open-exchange-rates.json
   [junit4]   2> 218078 WARN  (coreLoadExecutor-912-thread-1-processing-n:127.0.0.1:36421_vj_xb%2Fcg) [n:127.0.0.1:36421_vj_xb%2Fcg c:control_collection   x:collection1] o.a.s.s.OpenExchangeRatesOrgProvider Unknown key IMPORTANT NOTE
   [junit4]   2> 218078 WARN  (coreLoadExecutor-912-thread-1-processing-n:127.0.0.1:36421_vj_xb%2Fcg) [n:127.0.0.1:36421_vj_xb%2Fcg c:control_collection   x:collection1] o.a.s.s.OpenExchangeRatesOrgProvider Expected key, got STRING
   [junit4]   2> 218079 INFO  (coreLoadExecutor-912-thread-1-processing-n:127.0.0.1:36421_vj_xb%2Fcg) [n:127.0.0.1:36421_vj_xb%2Fcg c:control_collection   x:collection1] o.a.s.c.ConfigSetProperties Did not find ConfigSet properties, assuming default properties: Can't find resource 'configsetprops.json' in classpath or '/configs/conf1', cwd=/home/jenkins/workspace/Lucene-Solr-trunk-Linux/solr/build/solr-core/test/J0
   [junit4]   2> 218079 INFO  (coreLoadExecutor-912-thread-1-processing-n:127.0.0.1:36421_vj_xb%2Fcg) [n:127.0.0.1:36421_vj_xb%2Fcg c:control_collection   x:collection1] o.a.s.c.CoreContainer Creating SolrCore 'collection1' using configuration from collection control_collection
   [junit4]   2> 218079 INFO  (coreLoadExecutor-912-thread-1-processing-n:127.0.0.1:36421_vj_xb%2Fcg) [n:127.0.0.1:36421_vj_xb%2Fcg c:control_collection s:shard1 r:core_node1 x:collection1] o.a.s.c.SolrCore org.apache.solr.core.MockDirectoryFactory
   [junit4]   2> 218079 INFO  (coreLoadExecutor-912-thread-1-processing-n:127.0.0.1:36421_vj_xb%2Fcg) [n:127.0.0.1:36421_vj_xb%2Fcg c:control_collection s:shard1 r:core_node1 x:collection1] o.a.s.c.SolrCore [[collection1] ] Opening new SolrCore at [/home/jenkins/workspace/Lucene-Solr-trunk-Linux/solr/build/solr-core/test/J0/temp/solr.cloud.TestCryptoKeys_AE7E9E22798D439C-001/control-001/cores/collection1/], dataDir=[null]
   [junit4]   2> 218079 INFO  (coreLoadExecutor-912-thread-1-processing-n:127.0.0.1:36421_vj_xb%2Fcg) [n:127.0.0.1:36421_vj_xb%2Fcg c:control_collection s:shard1 r:core_node1 x:collection1] o.a.s.c.JmxMonitoredMap JMX monitoring is enabled. Adding Solr mbeans to JMX Server: com.sun.jmx.mbeanserver.JmxMBeanServer@36cd9b
   [junit4]   2> 218080 INFO  (coreLoadExecutor-912-thread-1-processing-n:127.0.0.1:36421_vj_xb%2Fcg) [n:127.0.0.1:36421_vj_xb%2Fcg c:control_collection s:shard1 r:core_node1 x:collection1] o.a.s.c.CachingDirectoryFactory return new directory for /home/jenkins/workspace/Lucene-Solr-trunk-Linux/solr/build/solr-core/test/J0/temp/solr.cloud.TestCryptoKeys_AE7E9E22798D439C-001/control-001/cores/collection1/data
   [junit4]   2> 218080 INFO  (coreLoadExecutor-912-thread-1-processing-n:127.0.0.1:36421_vj_xb%2Fcg) [n:127.0.0.1:36421_vj_xb%2Fcg c:control_collection s:shard1 r:core_node1 x:collection1] o.a.s.c.SolrCore New index directory detected: old=null new=/home/jenkins/workspace/Lucene-Solr-trunk-Linux/solr/build/solr-core/test/J0/temp/solr.cloud.TestCryptoKeys_AE7E9E22798D439C-001/control-001/cores/collection1/data/index/
   [junit4]   2> 218080 WARN  (coreLoadExecutor-912-thread-1-processing-n:127.0.0.1:36421_vj_xb%2Fcg) [n:127.0.0.1:36421_vj_xb%2Fcg c:control_collection s:shard1 r:core_node1 x:collection1] o.a.s.c.SolrCore [collection1] Solr index directory '/home/jenkins/workspace/Lucene-Solr-trunk-Linux/solr/build/solr-core/test/J0/temp/solr.cloud.TestCryptoKeys_AE7E9E22798D439C-001/control-001/cores/collection1/data/index' doesn't exist. Creating new index...
   [junit4]   2> 218080 INFO  (coreLoadExecutor-912-thread-1-processing-n:127.0.0.1:36421_vj_xb%2Fcg) [n:127.0.0.1:36421_vj_xb%2Fcg c:control_collection s:shard1 r:core_node1 x:collection1] o.a.s.c.CachingDirectoryFactory return new directory for /home/jenkins/workspace/Lucene-Solr-trunk-Linux/solr/build/solr-core/test/J0/temp/solr.cloud.TestCryptoKeys_AE7E9E22798D439C-001/control-001/cores/collection1/data/index
   [junit4]   2> 218080 INFO  (coreLoadExecutor-912-thread-1-processing-n:127.0.0.1:36421_vj_xb%2Fcg) [n:127.0.0.1:36421_vj_xb%2Fcg c:control_collection s:shard1 r:core_node1 x:collection1] o.a.s.u.RandomMergePolicy RandomMergePolicy wrapping class org.apache.lucene.index.TieredMergePolicy: [TieredMergePolicy: maxMergeAtOnce=11, maxMergeAtOnceExplicit=28, maxMergedSegmentMB=82.62890625, floorSegmentMB=1.3720703125, forceMergeDeletesPctAllowed=12.597071376994869, segmentsPerTier=42.0, maxCFSSegmentSizeMB=8.796093022207999E12, noCFSRatio=1.0
   [junit4]   2> 218081 INFO  (coreLoadExecutor-912-thread-1-processing-n:127.0.0.1:36421_vj_xb%2Fcg) [n:127.0.0.1:36421_vj_xb%2Fcg c:control_collection s:shard1 r:core_node1 x:collection1] o.a.s.c.SolrCore SolrDeletionPolicy.onCommit: commits: num=1
   [junit4]   2> 	commit{dir=MockDirectoryWrapper(RAMDirectory@111fe5 lockFactory=org.apache.lucene.store.SingleInstanceLockFactory@5391d1),segFN=segments_1,generation=1}
   [junit4]   2> 218081 INFO  (coreLoadExecutor-912-thread-1-processing-n:127.0.0.1:36421_vj_xb%2Fcg) [n:127.0.0.1:36421_vj_xb%2Fcg c:control_collection s:shard1 r:core_node1 x:collection1] o.a.s.c.SolrCore newest commit generation = 1
   [junit4]   2> 218081 INFO  (OldIndexDirectoryCleanupThreadForCore-collection1) [n:127.0.0.1:36421_vj_xb%2Fcg c:control_collection s:shard1 r:core_node1 x:collection1] o.a.s.c.SolrCore Looking for old index directories to cleanup for core collection1 in /home/jenkins/workspace/Lucene-Solr-trunk-Linux/solr/build/solr-core/test/J0/temp/solr.cloud.TestCryptoKeys_AE7E9E22798D439C-001/control-001/cores/collection1/data/
   [junit4]   2> 218081 WARN  (OldIndexDirectoryCleanupThreadForCore-collection1) [n:127.0.0.1:36421_vj_xb%2Fcg c:control_collection s:shard1 r:core_node1 x:collection1] o.a.s.c.DirectoryFactory /home/jenkins/workspace/Lucene-Solr-trunk-Linux/solr/build/solr-core/test/J0/temp/solr.cloud.TestCryptoKeys_AE7E9E22798D439C-001/control-001/cores/collection1/data/ does not point to a valid data directory; skipping clean-up of old index directories.
   [junit4]   2> 218083 INFO  (coreLoadExecutor-912-thread-1-processing-n:127.0.0.1:36421_vj_xb%2Fcg) [n:127.0.0.1:36421_vj_xb%2Fcg c:control_collection s:shard1 r:core_node1 x:collection1] o.a.s.u.p.UpdateRequestProcessorChain creating updateRequestProcessorChain "nodistrib"
   [junit4]   2> 218096 INFO  (coreLoadExecutor-912-thread-1-processing-n:127.0.0.1:36421_vj_xb%2Fcg) [n:127.0.0.1:36421_vj_xb%2Fcg c:control_collection s:shard1 r:core_node1 x:collection1] o.a.s.u.p.UpdateRequestProcessorChain creating updateRequestProcessorChain "dedupe"
   [junit4]   2> 218096 INFO  (coreLoadExecutor-912-thread-1-processing-n:127.0.0.1:36421_vj_xb%2Fcg) [n:127.0.0.1:36421_vj_xb%2Fcg c:control_collection s:shard1 r:core_node1 x:collection1] o.a.s.u.p.UpdateRequestProcessorChain inserting DistributedUpdateProcessorFactory into updateRequestProcessorChain "dedupe"
   [junit4]   2> 218096 INFO  (coreLoadExecutor-912-thread-1-processing-n:127.0.0.1:36421_vj_xb%2Fcg) [n:127.0.0.1:36421_vj_xb%2Fcg c:control_collection s:shard1 r:core_node1 x:collection1] o.a.s.u.p.UpdateRequestProcessorChain creating updateRequestProcessorChain "stored_sig"
   [junit4]   2> 218096 INFO  (coreLoadExecutor-912-thread-1-processing-n:127.0.0.1:36421_vj_xb%2Fcg) [n:127.0.0.1:36421_vj_xb%2Fcg c:control_collection s:shard1 r:core_node1 x:collection1] o.a.s.u.p.UpdateRequestProcessorChain inserting DistributedUpdateProcessorFactory into updateRequestProcessorChain "stored_sig"
   [junit4]   2> 218096 INFO  (coreLoadExecutor-912-thread-1-processing-n:127.0.0.1:36421_vj_xb%2Fcg) [n:127.0.0.1:36421_vj_xb%2Fcg c:control_collection s:shard1 r:core_node1 x:collection1] o.a.s.u.p.UpdateRequestProcessorChain creating updateRequestProcessorChain "distrib-dup-test-chain-explicit"
   [junit4]   2> 218096 INFO  (coreLoadExecutor-912-thread-1-processing-n:127.0.0.1:36421_vj_xb%2Fcg) [n:127.0.0.1:36421_vj_xb%2Fcg c:control_collection s:shard1 r:core_node1 x:collection1] o.a.s.u.p.UpdateRequestProcessorChain creating updateRequestProcessorChain "distrib-dup-test-chain-implicit"
   [junit4]   2> 218097 INFO  (coreLoadExecutor-912-thread-1-processing-n:127.0.0.1:36421_vj_xb%2Fcg) [n:127.0.0.1:36421_vj_xb%2Fcg c:control_collection s:shard1 r:core_node1 x:collection1] o.a.s.u.p.UpdateRequestProcessorChain inserting DistributedUpdateProcessorFactory into updateRequestProcessorChain "distrib-dup-test-chain-implicit"
   [junit4]   2> 218097 INFO  (coreLoadExecutor-912-thread-1-processing-n:127.0.0.1:36421_vj_xb%2Fcg) [n:127.0.0.1:36421_vj_xb%2Fcg c:control_collection s:shard1 r:core_node1 x:collection1] o.a.s.c.SolrCore no updateRequestProcessorChain defined as default, creating implicit default
   [junit4]   2> 218098 INFO  (coreLoadExecutor-912-thread-1-processing-n:127.0.0.1:36421_vj_xb%2Fcg) [n:127.0.0.1:36421_vj_xb%2Fcg c:control_collection s:shard1 r:core_node1 x:collection1] o.a.s.h.l.XMLLoader xsltCacheLifetimeSeconds=60
   [junit4]   2> 218098 INFO  (coreLoadExecutor-912-thread-1-processing-n:127.0.0.1:36421_vj_xb%2Fcg) [n:127.0.0.1:36421_vj_xb%2Fcg c:control_collection s:shard1 r:core_node1 x:collection1] o.a.s.h.l.XMLLoader xsltCacheLifetimeSeconds=60
   [junit4]   2> 218099 INFO  (coreLoadExecutor-912-thread-1-processing-n:127.0.0.1:36421_vj_xb%2Fcg) [n:127.0.0.1:36421_vj_xb%2Fcg c:control_collection s:shard1 r:core_node1 x:collection1] o.a.s.h.l.XMLLoader xsltCacheLifetimeSeconds=60
   [junit4]   2> 218099 INFO  (coreLoadExecutor-912-thread-1-processing-n:127.0.0.1:36421_vj_xb%2Fcg) [n:127.0.0.1:36421_vj_xb%2Fcg c:control_collection s:shard1 r:core_node1 x:collection1] o.a.s.h.l.XMLLoader xsltCacheLifetimeSeconds=60
   [junit4]   2> 218107 INFO  (coreLoadExecutor-912-thread-1-processing-n:127.0.0.1:36421_vj_xb%2Fcg) [n:127.0.0.1:36421_vj_xb%2Fcg c:control_collection s:shard1 r:core_node1 x:collection1] o.a.s.c.RequestHandlers Registered paths: /admin/mbeans,standard,/update/csv,/update/json/docs,/admin/luke,/admin/segments,/get,/admin/system,/replication,/admin/properties,/config,/schema,/admin/plugins,/admin/logging,/update/json,/admin/threads,/admin/ping,/update,/admin/file
   [junit4]   2> 218108 INFO  (coreLoadExecutor-912-thread-1-processing-n:127.0.0.1:36421_vj_xb%2Fcg) [n:127.0.0.1:36421_vj_xb%2Fcg c:control_collection s:shard1 r:core_node1 x:collection1] o.a.s.c.SolrCore Using default statsCache cache: org.apache.solr.search.stats.LocalStatsCache
   [junit4]   2> 218108 INFO  (coreLoadExecutor-912-thread-1-processing-n:127.0.0.1:36421_vj_xb%2Fcg) [n:127.0.0.1:36421_vj_xb%2Fcg c:control_collection s:shard1 r:core_node1 x:collection1] o.a.s.u.UpdateHandler Using UpdateLog implementation: org.apache.solr.update.UpdateLog
   [junit4]   2> 218108 INFO  (coreLoadExecutor-912-thread-1-processing-n:127.0.0.1:36421_vj_xb%2Fcg) [n:127.0.0.1:36421_vj_xb%2Fcg c:control_collection s:shard1 r:core_node1 x:collection1] o.a.s.u.UpdateLog Initializing UpdateLog: dataDir= defaultSyncLevel=FLUSH numRecordsToKeep=100 maxNumLogsToKeep=10 numVersionBuckets=65536
   [junit4]   2> 218109 INFO  (coreLoadExecutor-912-thread-1-processing-n:127.0.0.1:36421_vj_xb%2Fcg) [n:127.0.0.1:36421_vj_xb%2Fcg c:control_collection s:shard1 r:core_node1 x:collection1] o.a.s.c.SolrCore Hard AutoCommit: disabled
   [junit4]   2> 218109 INFO  (coreLoadExecutor-912-thread-1-processing-n:127.0.0.1:36421_vj_xb%2Fcg) [n:127.0.0.1:36421_vj_xb%2Fcg c:control_collection s:shard1 r:core_node1 x:collection1] o.a.s.c.SolrCore Soft AutoCommit: disabled
   [junit4]   2> 218109 INFO  (coreLoadExecutor-912-thread-1-processing-n:127.0.0.1:36421_vj_xb%2Fcg) [n:127.0.0.1:36421_vj_xb%2Fcg c:control_collection s:shard1 r:core_node1 x:collection1] o.a.s.u.RandomMergePolicy RandomMergePolicy wrapping class org.apache.lucene.index.TieredMergePolicy: [TieredMergePolicy: maxMergeAtOnce=33, maxMergeAtOnceExplicit=15, maxMergedSegmentMB=23.3134765625, floorSegmentMB=0.7626953125, forceMergeDeletesPctAllowed=3.8711084534833207, segmentsPerTier=49.0, maxCFSSegmentSizeMB=8.796093022207999E12, noCFSRatio=1.0
   [junit4]   2> 218109 INFO  (coreLoadExecutor-912-thread-1-processing-n:127.0.0.1:36421_vj_xb%2Fcg) [n:127.0.0.1:36421_vj_xb%2Fcg c:control_collection s:shard1 r:core_node1 x:collection1] o.a.s.c.SolrCore SolrDeletionPolicy.onInit: commits: num=1
   [junit4]   2> 	commit{dir=MockDirectoryWrapper(RAMDirectory@111fe5 lockFactory=org.apache.lucene.store.SingleInstanceLockFactory@5391d1),segFN=segments_1,generation=1}
   [junit4]   2> 218109 INFO  (coreLoadExecutor-912-thread-1-processing-n:127.0.0.1:36421_vj_xb%2Fcg) [n:127.0.0.1:36421_vj_xb%2Fcg c:control_collection s:shard1 r:core_node1 x:collection1] o.a.s.c.SolrCore newest commit generation = 1
   [junit4]   2> 218110 INFO  (coreLoadExecutor-912-thread-1-processing-n:127.0.0.1:36421_vj_xb%2Fcg) [n:127.0.0.1:36421_vj_xb%2Fcg c:control_collection s:shard1 r:core_node1 x:collection1] o.a.s.s.SolrIndexSearcher Opening Searcher@a53eca[collection1] main
   [junit4]   2> 218110 INFO  (coreLoadExecutor-912-thread-1-processing-n:127.0.0.1:36421_vj_xb%2Fcg) [n:127.0.0.1:36421_vj_xb%2Fcg c:control_collection s:shard1 r:core_node1 x:collection1] o.a.s.c.c.ZkStateReader Load collection config from:/collections/control_collection
   [junit4]   2> 218110 INFO  (coreLoadExecutor-912-thread-1-processing-n:127.0.0.1:36421_vj_xb%2Fcg) [n:127.0.0.1:36421_vj_xb%2Fcg c:control_collection s:shard1 r:core_node1 x:collection1] o.a.s.c.c.ZkStateReader path=/collections/control_collection configName=conf1 specified config exists in ZooKeeper
   [junit4]   2> 218123 INFO  (coreLoadExecutor-912-thread-1-processing-n:127.0.0.1:36421_vj_xb%2Fcg) [n:127.0.0.1:36421_vj_xb%2Fcg c:control_collection s:shard1 r:core_node1 x:collection1] o.a.s.r.ManagedResourceStorage Setting up ZooKeeper-based storage for the RestManager with znodeBase: /configs/conf1
   [junit4]   2> 218123 INFO  (coreLoadExecutor-912-thread-1-processing-n:127.0.0.1:36421_vj_xb%2Fcg) [n:127.0.0.1:36421_vj_xb%2Fcg c:control_collection s:shard1 r:core_node1 x:collection1] o.a.s.r.ManagedResourceStorage Configured ZooKeeperStorageIO with znodeBase: /configs/conf1
   [junit4]   2> 218123 INFO  (coreLoadExecutor-912-thread-1-processing-n:127.0.0.1:36421_vj_xb%2Fcg) [n:127.0.0.1:36421_vj_xb%2Fcg c:control_collection s:shard1 r:core_node1 x:collection1] o.a.s.r.RestManager Initializing RestManager with initArgs: {}
   [junit4]   2> 218123 INFO  (coreLoadExecutor-912-thread-1-processing-n:127.0.0.1:36421_vj_xb%2Fcg) [n:127.0.0.1:36421_vj_xb%2Fcg c:control_collection s:shard1 r:core_node1 x:collection1] o.a.s.r.ManagedResourceStorage Reading _rest_managed.json using ZooKeeperStorageIO:path=/configs/conf1
   [junit4]   2> 218124 INFO  (coreLoadExecutor-912-thread-1-processing-n:127.0.0.1:36421_vj_xb%2Fcg) [n:127.0.0.1:36421_vj_xb%2Fcg c:control_collection s:shard1 r:core_node1 x:collection1] o.a.s.r.ManagedResourceStorage No data found for znode /configs/conf1/_rest_managed.json
   [junit4]   2> 218124 INFO  (coreLoadExecutor-912-thread-1-processing-n:127.0.0.1:36421_vj_xb%2Fcg) [n:127.0.0.1:36421_vj_xb%2Fcg c:control_collection s:shard1 r:core_node1 x:collection1] o.a.s.r.ManagedResourceStorage Loaded null at path _rest_managed.json using ZooKeeperStorageIO:path=/configs/conf1
   [junit4]   2> 218124 INFO  (coreLoadExecutor-912-thread-1-processing-n:127.0.0.1:36421_vj_xb%2Fcg) [n:127.0.0.1:36421_vj_xb%2Fcg c:control_collection s:shard1 r:core_node1 x:collection1] o.a.s.r.RestManager Initializing 0 registered ManagedResources
   [junit4]   2> 218124 INFO  (coreLoadExecutor-912-thread-1-processing-n:127.0.0.1:36421_vj_xb%2Fcg) [n:127.0.0.1:36421_vj_xb%2Fcg c:control_collection s:shard1 r:core_node1 x:collection1] o.a.s.h.ReplicationHandler Commits will be reserved for  10000
   [junit4]   2> 218124 INFO  (searcherExecutor-913-thread-1-processing-n:127.0.0.1:36421_vj_xb%2Fcg x:collection1 s:shard1 c:control_collection r:core_node1) [n:127.0.0.1:36421_vj_xb%2Fcg c:control_collection s:shard1 r:core_node1 x:collection1] o.a.s.c.SolrCore [collection1] Registered new searcher Searcher@a53eca[collection1] main{ExitableDirectoryReader(UninvertingDirectoryReader())}
   [junit4]   2> 218124 INFO  (coreLoadExecutor-912-thread-1-processing-n:127.0.0.1:36421_vj_xb%2Fcg) [n:127.0.0.1:36421_vj_xb%2Fcg c:control_collection s:shard1 r:core_node1 x:collection1] o.a.s.u.UpdateLog Looking up max value of version field to seed version buckets
   [junit4]   2> 218124 INFO  (coreLoadExecutor-912-thread-1-processing-n:127.0.0.1:36421_vj_xb%2Fcg) [n:127.0.0.1:36421_vj_xb%2Fcg c:control_collection s:shard1 r:core_node1 x:collection1] o.a.s.u.VersionInfo Refreshing highest value of _version_ for 65536 version buckets from index
   [junit4]   2> 218125 INFO  (coreLoadExecutor-912-thread-1-processing-n:127.0.0.1:36421_vj_xb%2Fcg) [n:127.0.0.1:36421_vj_xb%2Fcg c:control_collection s:shard1 r:core_node1 x:collection1] o.a.s.u.VersionInfo No terms found for _version_, cannot seed version bucket highest value from index
   [junit4]   2> 218125 INFO  (coreLoadExecutor-912-thread-1-processing-n:127.0.0.1:36421_vj_xb%2Fcg) [n:127.0.0.1:36421_vj_xb%2Fcg c:control_collection s:shard1 r:core_node1 x:collection1] o.a.s.u.UpdateLog Could not find max version in index or recent updates, using new clock 1508708255095848960
   [junit4]   2> 218126 INFO  (coreLoadExecutor-912-thread-1-processing-n:127.0.0.1:36421_vj_xb%2Fcg) [n:127.0.0.1:36421_vj_xb%2Fcg c:control_collection s:shard1 r:core_node1 x:collection1] o.a.s.u.UpdateLog Took 2 ms to seed version buckets with highest version 1508708255095848960
   [junit4]   2> 218127 INFO  (coreLoadExecutor-912-thread-1-processing-n:127.0.0.1:36421_vj_xb%2Fcg) [n:127.0.0.1:36421_vj_xb%2Fcg c:control_collection s:shard1 r:core_node1 x:collection1] o.a.s.c.ZkController watch zkdir /configs/conf1
   [junit4]   2> 218127 INFO  (coreLoadExecutor-912-thread-1-processing-n:127.0.0.1:36421_vj_xb%2Fcg) [n:127.0.0.1:36421_vj_xb%2Fcg c:control_collection s:shard1 r:core_node1 x:collection1] o.a.s.c.CoreContainer registering core: collection1
   [junit4]   2> 218127 INFO  (coreZkRegister-906-thread-1-processing-n:127.0.0.1:36421_vj_xb%2Fcg x:collection1 s:shard1 c:control_collection r:core_node1) [n:127.0.0.1:36421_vj_xb%2Fcg c:control_collection s:shard1 r:core_node1 x:collection1] o.a.s.c.ZkController Register replica - core:collection1 address:http://127.0.0.1:36421/vj_xb/cg collection:control_collection shard:shard1
   [junit4]   2> 218128 INFO  (coreZkRegister-906-thread-1-processing-n:127.0.0.1:36421_vj_xb%2Fcg x:collection1 s:shard1 c:control_collection r:core_node1) [n:127.0.0.1:36421_vj_xb%2Fcg c:control_collection s:shard1 r:core_node1 x:collection1] o.a.s.c.c.SolrZkClient makePath: /collections/control_collection/leader_elect/shard1/election
   [junit4]   2> 218129 INFO  (coreZkRegister-906-thread-1-processing-n:127.0.0.1:36421_vj_xb%2Fcg x:collection1 s:shard1 c:control_collection r:core_node1) [n:127.0.0.1:36421_vj_xb%2Fcg c:control_collection s:shard1 r:core_node1 x:collection1] o.a.s.c.LeaderElector Joined leadership election with path: /collections/control_collection/leader_elect/shard1/election/94294265847414788-core_node1-n_0000000000
   [junit4]   2> 218130 INFO  (coreZkRegister-906-thread-1-processing-n:127.0.0.1:36421_vj_xb%2Fcg x:collection1 s:shard1 c:control_collection r:core_node1) [n:127.0.0.1:36421_vj_xb%2Fcg c:control_collection s:shard1 r:core_node1 x:collection1] o.a.s.c.ShardLeaderElectionContext Running the leader process for shard shard1
   [junit4]   2> 218130 INFO  (zkCallback-132-thread-1-processing-n:127.0.0.1:36421_vj_xb%2Fcg) [n:127.0.0.1:36421_vj_xb%2Fcg    ] o.a.s.c.DistributedQueue NodeChildrenChanged fired on path /overseer/queue state SyncConnected
   [junit4]   2> 218130 INFO  (coreZkRegister-906-thread-1-processing-n:127.0.0.1:36421_vj_xb%2Fcg x:collection1 s:shard1 c:control_collection r:core_node1) [n:127.0.0.1:36421_vj_xb%2Fcg c:control_collection s:shard1 r:core_node1 x:collection1] o.a.s.c.ShardLeaderElectionContext Enough replicas found to continue.
   [junit4]   2> 218130 INFO  (coreZkRegister-906-thread-1-processing-n:127.0.0.1:36421_vj_xb%2Fcg x:collection1 s:shard1 c:control_collection r:core_node1) [n:127.0.0.1:36421_vj_xb%2Fcg c:control_collection s:shard1 r:core_node1 x:collection1] o.a.s.c.ShardLeaderElectionContext I may be the new leader - try and sync
   [junit4]   2> 218130 INFO  (coreZkRegister-906-thread-1-processing-n:127.0.0.1:36421_vj_xb%2Fcg x:collection1 s:shard1 c:control_collection r:core_node1) [n:127.0.0.1:36421_vj_xb%2Fcg c:control_collection s:shard1 r:core_node1 x:collection1] o.a.s.c.SyncStrategy Sync replicas to http://127.0.0.1:36421/vj_xb/cg/collection1/
   [junit4]   2> 218130 INFO  (OverseerStateUpdate-94294265847414788-127.0.0.1:36421_vj_xb%2Fcg-n_0000000000) [n:127.0.0.1:36421_vj_xb%2Fcg    ] o.a.s.c.Overseer processMessage: queueSize: 1, message = {
   [junit4]   2>   "operation":"leader",
   [junit4]   2>   "shard":"shard1",
   [junit4]   2>   "collection":"control_collection"} current state version: 1
   [junit4]   2> 218130 INFO  (coreZkRegister-906-thread-1-processing-n:127.0.0.1:36421_vj_xb%2Fcg x:collection1 s:shard1 c:control_collection r:core_node1) [n:127.0.0.1:36421_vj_xb%2Fcg c:control_collection s:shard1 r:core_node1 x:collection1] o.a.s.c.SyncStrategy Sync Success - now sync replicas to me
   [junit4]   2> 218131 INFO  (coreZkRegister-906-thread-1-processing-n:127.0.0.1:36421_vj_xb%2Fcg x:collection1 s:shard1 c:control_collection r:core_node1) [n:127.0.0.1:36421_vj_xb%2Fcg c:control_collection s:shard1 r:core_node1 x:collection1] o.a.s.c.SyncStrategy http://127.0.0.1:36421/vj_xb/cg/collection1/ has no replicas
   [junit4]   2> 218131 INFO  (coreZkRegister-906-thread-1-processing-n:127.0.0.1:36421_vj_xb%2Fcg x:collection1 s:shard1 c:control_collection r:core_node1) [n:127.0.0.1:36421_vj_xb%2Fcg c:control_collection s:shard1 r:core_node1 x:collection1] o.a.s.c.ShardLeaderElectionContext I am the new leader: http://127.0.0.1:36421/vj_xb/cg/collection1/ shard1
   [junit4]   2> 218131 INFO  (coreZkRegister-906-thread-1-processing-n:127.0.0.1:36421_vj_xb%2Fcg x:collection1 s:shard1 c:control_collection r:core_node1) [n:127.0.0.1:36421_vj_xb%2Fcg c:control_collection s:shard1 r:core_node1 x:collection1] o.a.s.c.c.SolrZkClient makePath: /collections/control_collection/leaders/shard1
   [junit4]   2> 218132 INFO  (zkCallback-132-thread-1-processing-n:127.0.0.1:36421_vj_xb%2Fcg) [n:127.0.0.1:36421_vj_xb%2Fcg    ] o.a.s.c.DistributedQueue NodeChildrenChanged fired on path /overseer/queue state SyncConnected
   [junit4]   2> 218132 INFO  (OverseerStateUpdate-94294265847414788-127.0.0.1:36421_vj_xb%2Fcg-n_0000000000) [n:127.0.0.1:36421_vj_xb%2Fcg    ] o.a.s.c.Overseer processMessage: queueSize: 1, message = {
   [junit4]   2>   "operation":"leader",
   [junit4]   2>   "shard":"shard1",
   [junit4]   2>   "collection":"control_collection",
   [junit4]   2>   "base_url":"http://127.0.0.1:36421/vj_xb/cg",
   [junit4]   2>   "core":"collection1",
   [junit4]   2>   "state":"active"} current state version: 1
   [junit4]   2> 218234 INFO  (zkCallback-132-thread-1-processing-n:127.0.0.1:36421_vj_xb%2Fcg) [n:127.0.0.1:36421_vj_xb%2Fcg    ] o.a.s.c.c.ZkStateReader A cluster state change: WatchedEvent state:SyncConnected type:NodeDataChanged path:/clusterstate.json, has occurred - updating... (live nodes size: 1)
   [junit4]   2> 218235 INFO  (zkCallback-132-thread-1-processing-n:127.0.0.1:36421_vj_xb%2Fcg) [n:127.0.0.1:36421_vj_xb%2Fcg    ] o.a.s.c.c.ZkStateReader Updated cluster state version to 2
   [junit4]   2> 218282 INFO  (coreZkRegister-906-thread-1-processing-n:127.0.0.1:36421_vj_xb%2Fcg x:collection1 s:shard1 c:control_collection r:core_node1) [n:127.0.0.1:36421_vj_xb%2Fcg c:control_collection s:shard1 r:core_node1 x:collection1] o.a.s.c.ZkController We are http://127.0.0.1:36421/vj_xb/cg/collection1/ and leader is http://127.0.0.1:36421/vj_xb/cg/collection1/
   [junit4]   2> 218283 INFO  (coreZkRegister-906-thread-1-processing-n:127.0.0.1:36421_vj_xb%2Fcg x:collection1 s:shard1 c:control_collection r:core_node1) [n:127.0.0.1:36421_vj_xb%2Fcg c:control_collection s:shard1 r:core_node1 x:collection1] o.a.s.c.ZkController No LogReplay needed for core=collection1 baseURL=http://127.0.0.1:36421/vj_xb/cg
   [junit4]   2> 218283 INFO  (coreZkRegister-906-thread-1-processing-n:127.0.0.1:36421_vj_xb%2Fcg x:collection1 s:shard1 c:control_collection r:core_node1) [n:127.0.0.1:36421_vj_xb%2Fcg c:control_collection s:shard1 r:core_node1 x:collection1] o.a.s.c.ZkController I am the leader, no recovery necessary
   [junit4]   2> 218283 INFO  (coreZkRegister-906-thread-1-processing-n:127.0.0.1:36421_vj_xb%2Fcg x:collection1 s:shard1 c:control_collection r:core_node1) [n:127.0.0.1:36421_vj_xb%2Fcg c:control_collection s:shard1 r:core_node1 x:collection1] o.a.s.c.ZkController publishing state=active
   [junit4]   2> 218283 INFO  (coreZkRegister-906-thread-1-processing-n:127.0.0.1:36421_vj_xb%2Fcg x:collection1 s:shard1 c:control_collection r:core_node1) [n:127.0.0.1:36421_vj_xb%2Fcg c:control_collection s:shard1 r:core_node1 x:collection1] o.a.s.c.ZkController numShards not found on descriptor - reading it from system property
   [junit4]   2> 218287 INFO  (zkCallback-132-thread-1-processing-n:127.0.0.1:36421_vj_xb%2Fcg) [n:127.0.0.1:36421_vj_xb%2Fcg    ] o.a.s.c.DistributedQueue NodeChildrenChanged fired on path /overseer/queue state SyncConnected
   [junit4]   2> 218287 INFO  (OverseerStateUpdate-94294265847414788-127.0.0.1:36421_vj_xb%2Fcg-n_0000000000) [n:127.0.0.1:36421_vj_xb%2Fcg    ] o.a.s.c.Overseer processMessage: queueSize: 1, message = {
   [junit4]   2>   "core":"collection1",
   [junit4]   2>   "core_node_name":"core_node1",
   [junit4]   2>   "roles":null,
   [junit4]   2>   "base_url":"http://127.0.0.1:36421/vj_xb/cg",
   [junit4]   2>   "node_name":"127.0.0.1:36421_vj_xb%2Fcg",
   [junit4]   2>   "numShards":"1",
   [junit4]   2>   "state":"active",
   [junit4]   2>   "shard":"shard1",
   [junit4]   2>   "collection":"control_collection",
   [junit4]   2>   "operation":"state"} current state version: 2
   [junit4]   2> 218287 INFO  (OverseerStateUpdate-94294265847414788-127.0.0.1:36421_vj_xb%2Fcg-n_0000000000) [n:127.0.0.1:36421_vj_xb%2Fcg    ] o.a.s.c.o.ReplicaMutator Update state numShards=1 message={
   [junit4]   2>   "core":"collection1",
   [junit4]   2>   "core_node_name":"core_node1",
   [junit4]   2>   "roles":null,
   [junit4]   2>   "base_url":"http://127.0.0.1:36421/vj_xb/cg",
   [junit4]   2>   "node_name":"127.0.0.1:36421_vj_xb%2Fcg",
   [junit4]   2>   "numShards":"1",
   [junit4]   2>   "state":"active",
   [junit4]   2>   "shard":"shard1",
   [junit4]   2>   "collection":"control_collection",
   [junit4]   2>   "operation":"state"}
   [junit4]   2> 218389 INFO  (zkCallback-132-thread-1-processing-n:127.0.0.1:36421_vj_xb%2Fcg) [n:127.0.0.1:36421_vj_xb%2Fcg    ] o.a.s.c.c.ZkStateReader A cluster state change: WatchedEvent state:SyncConnected type:NodeDataChanged path:/clusterstate.json, has occurred - updating... (live nodes size: 1)
   [junit4]   2> 218389 INFO  (zkCallback-132-thread-1-processing-n:127.0.0.1:36421_vj_xb%2Fcg) [n:127.0.0.1:36421_vj_xb%2Fcg    ] o.a.s.c.c.ZkStateReader Updated cluster state version to 3
   [junit4]   2> 218477 INFO  (TEST-TestCryptoKeys.test-seed#[AE7E9E22798D439C]) [    ] o.a.s.c.c.SolrZkClient Using default ZkCredentialsProvider
   [junit4]   2> 218477 INFO  (TEST-TestCryptoKeys.test-seed#[AE7E9E22798D439C]) [    ] o.a.s.c.c.ConnectionManager Waiting for client to connect to ZooKeeper
   [junit4]   2> 218478 INFO  (zkCallback-134-thread-1) [    ] o.a.s.c.c.ConnectionManager Watcher org.apache.solr.common.cloud.ConnectionManager@102dcca name:ZooKeeperConnection Watcher:127.0.0.1:45421/solr got event WatchedEvent state:SyncConnected type:None path:null path:null type:None
   [junit4]   2> 218478 INFO  (TEST-TestCryptoKeys.test-seed#[AE7E9E22798D439C]) [    ] o.a.s.c.c.ConnectionManager Client is connected to ZooKeeper
   [junit4]   2> 218479 INFO  (TEST-TestCryptoKeys.test-seed#[AE7E9E22798D439C]) [    ] o.a.s.c.c.SolrZkClient Using default ZkACLProvider
   [junit4]   2> 218479 INFO  (TEST-TestCryptoKeys.test-seed#[AE7E9E22798D439C]) [    ] o.a.s.c.c.ZkStateReader Updating cluster state from ZooKeeper... 
   [junit4]   2> 218480 INFO  (TEST-TestCryptoKeys.test-seed#[AE7E9E22798D439C]) [    ] o.a.s.c.ChaosMonkey monkey: init - expire sessions:false cause connection loss:false
   [junit4]   2> 218480 INFO  (TEST-TestCryptoKeys.test-seed#[AE7E9E22798D439C]) [    ] o.a.s.c.AbstractFullDistribZkTestBase Creating collection1 with stateFormat=2
   [junit4]   2> 218480 INFO  (TEST-TestCryptoKeys.test-seed#[AE7E9E22798D439C]) [    ] o.a.s.c.c.SolrZkClient Using default ZkCredentialsProvider
   [junit4]   2> 218480 INFO  (TEST-TestCryptoKeys.test-seed#[AE7E9E22798D439C]) [    ] o.a.s.c.c.ConnectionManager Waiting for client to connect to ZooKeeper
   [junit4]   2> 218481 INFO  (zkCallback-135-thread-1) [    ] o.a.s.c.c.ConnectionManager Watcher org.apache.solr.common.cloud.ConnectionManager@ffaeb2 name:ZooKeeperConnection Watcher:127.0.0.1:45421/solr got event WatchedEvent state:SyncConnected type:None path:null path:null type:None
   [junit4]   2> 218482 INFO  (TEST-TestCryptoKeys.test-seed#[AE7E9E22798D439C]) [    ] o.a.s.c.c.ConnectionManager Client is connected to ZooKeeper
   [junit4]   2> 218482 INFO  (TEST-TestCryptoKeys.test-seed#[AE7E9E22798D439C]) [    ] o.a.s.c.c.SolrZkClient Using default ZkACLProvider
   [junit4]   2> 218483 INFO  (zkCallback-132-thread-1-processing-n:127.0.0.1:36421_vj_xb%2Fcg) [n:127.0.0.1:36421_vj_xb%2Fcg    ] o.a.s.c.DistributedQueue NodeChildrenChanged fired on path /overseer/queue state SyncConnected
   [junit4]   2> 218483 INFO  (OverseerStateUpdate-94294265847414788-127.0.0.1:36421_vj_xb%2Fcg-n_0000000000) [n:127.0.0.1:36421_vj_xb%2Fcg    ] o.a.s.c.Overseer processMessage: queueSize: 1, message = {
   [junit4]   2>   "operation":"create",
   [junit4]   2>   "name":"collection1",
   [junit4]   2>   "numShards":"1",
   [junit4]   2>   "stateFormat":"2"} current state version: 3
   [junit4]   2> 218483 INFO  (OverseerStateUpdate-94294265847414788-127.0.0.1:36421_vj_xb%2Fcg-n_0000000000) [n:127.0.0.1:36421_vj_xb%2Fcg    ] o.a.s.c.o.ClusterStateMutator building a new cName: collection1
   [junit4]   2> 218562 INFO  (TEST-TestCryptoKeys.test-seed#[AE7E9E22798D439C]) [    ] o.a.s.SolrTestCaseJ4 Writing core.properties file to /home/jenkins/workspace/Lucene-Solr-trunk-Linux/solr/build/solr-core/test/J0/temp/solr.cloud.TestCryptoKeys_AE7E9E22798D439C-001/shard-1-001/cores/collection1
   [junit4]   2> 218563 INFO  (TEST-TestCryptoKeys.test-seed#[AE7E9E22798D439C]) [    ] o.a.s.c.AbstractFullDistribZkTestBase create jetty 1 in directory /home/jenkins/workspace/Lucene-Solr-trunk-Linux/solr/build/solr-core/test/J0/temp/solr.cloud.TestCryptoKeys_AE7E9E22798D439C-001/shard-1-001
   [junit4]   2> 218563 INFO  (TEST-TestCryptoKeys.test-seed#[AE7E9E22798D439C]) [    ] o.e.j.s.Server jetty-9.2.11.v20150529
   [junit4]   2> 218564 INFO  (TEST-TestCryptoKeys.test-seed#[AE7E9E22798D439C]) [    ] o.e.j.s.h.ContextHandler Started o.e.j.s.ServletContextHandler@17cdd8c{/vj_xb/cg,null,AVAILABLE}
   [junit4]   2> 218564 INFO  (TEST-TestCryptoKeys.test-seed#[AE7E9E22798D439C]) [    ] o.e.j.s.ServerConnector Started ServerConnector@cda812{HTTP/1.1}{127.0.0.1:๔๓๐๓๑}
   [junit4]   2> 218565 INFO  (TEST-TestCryptoKeys.test-seed#[AE7E9E22798D439C]) [    ] o.e.j.s.Server Started @๒๒๐๓๙๓ms
   [junit4]   2> 218565 INFO  (TEST-TestCryptoKeys.test-seed#[AE7E9E22798D439C]) [    ] o.a.s.c.s.e.JettySolrRunner Jetty properties: {solr.data.dir=/home/jenkins/workspace/Lucene-Solr-trunk-Linux/solr/build/solr-core/test/J0/temp/solr.cloud.TestCryptoKeys_AE7E9E22798D439C-001/tempDir-001/jetty1, solrconfig=solrconfig.xml, hostContext=/vj_xb/cg, hostPort=43031, coreRootDirectory=/home/jenkins/workspace/Lucene-Solr-trunk-Linux/solr/build/solr-core/test/J0/../../../../../../../../../home/jenkins/workspace/Lucene-Solr-trunk-Linux/solr/build/solr-core/test/J0/temp/solr.cloud.TestCryptoKeys_AE7E9E22798D439C-001/shard-1-001/cores}
   [junit4]   2> 218565 INFO  (TEST-TestCryptoKeys.test-seed#[AE7E9E22798D439C]) [    ] o.a.s.s.SolrDispatchFilter SolrDispatchFilter.init(): sun.misc.Launcher$AppClassLoader@e2f2a
   [junit4]   2> 218565 INFO  (TEST-TestCryptoKeys.test-seed#[AE7E9E22798D439C]) [    ] o.a.s.c.SolrResourceLoader new SolrResourceLoader for directory: '/home/jenkins/workspace/Lucene-Solr-trunk-Linux/solr/build/solr-core/test/J0/../../../../../../../../../home/jenkins/workspace/Lucene-Solr-trunk-Linux/solr/build/solr-core/test/J0/temp/solr.cloud.TestCryptoKeys_AE7E9E22798D439C-001/shard-1-001/'
   [junit4]   2> 218573 INFO  (TEST-TestCryptoKeys.test-seed#[AE7E9E22798D439C]) [    ] o.a.s.c.c.SolrZkClient Using default ZkCredentialsProvider
   [junit4]   2> 218573 INFO  (TEST-TestCryptoKeys.test-seed#[AE7E9E22798D439C]) [    ] o.a.s.c.c.ConnectionManager Waiting for client to connect to ZooKeeper
   [junit4]   2> 218574 INFO  (zkCallback-136-thread-1) [    ] o.a.s.c.c.ConnectionManager Watcher org.apache.solr.common.cloud.ConnectionManager@120cc53 name:ZooKeeperConnection Watcher:127.0.0.1:45421/solr got event WatchedEvent state:SyncConnected type:None path:null path:null type:None
   [junit4]   2> 218574 INFO  (TEST-TestCryptoKeys.test-seed#[AE7E9E22798D439C]) [    ] o.a.s.c.c.ConnectionManager Client is connected to ZooKeeper
   [junit4]   2> 218574 INFO  (TEST-TestCryptoKeys.test-seed#[AE7E9E22798D439C]) [    ] o.a.s.c.c.SolrZkClient Using default ZkACLProvider
   [junit4]   2> 218575 INFO  (TEST-TestCryptoKeys.test-seed#[AE7E9E22798D439C]) [    ] o.a.s.s.SolrDispatchFilter Loading solr.xml from SolrHome (not found in ZooKeeper)
   [junit4]   2> 218575 INFO  (TEST-TestCryptoKeys.test-seed#[AE7E9E22798D439C]) [    ] o.a.s.c.SolrXmlConfig Loading container configuration from /home/jenkins/workspace/Lucene-Solr-trunk-Linux/solr/build/solr-core/test/J0/../../../../../../../../../home/jenkins/workspace/Lucene-Solr-trunk-Linux/solr/build/solr-core/test/J0/temp/solr.cloud.TestCryptoKeys_AE7E9E22798D439C-001/shard-1-001/solr.xml
   [junit4]   2> 218584 INFO  (TEST-TestCryptoKeys.test-seed#[AE7E9E22798D439C]) [    ] o.a.s.c.CoresLocator Config-defined core root directory: /home/jenkins/workspace/Lucene-Solr-trunk-Linux/solr/build/solr-core/test/J0/../../../../../../../../../home/jenkins/workspace/Lucene-Solr-trunk-Linux/solr/build/solr-core/test/J0/temp/solr.cloud.TestCryptoKeys_AE7E9E22798D439C-001/shard-1-001/cores
   [junit4]   2> 218584 INFO  (TEST-TestCryptoKeys.test-seed#[AE7E9E22798D439C]) [    ] o.a.s.c.CoreContainer New CoreContainer 31940808
   [junit4]   2> 218584 INFO  (TEST-TestCryptoKeys.test-seed#[AE7E9E22798D439C]) [    ] o.a.s.c.CoreContainer Loading cores into CoreContainer [instanceDir=/home/jenkins/workspace/Lucene-Solr-trunk-Linux/solr/build/solr-core/test/J0/../../../../../../../../../home/jenkins/workspace/Lucene-Solr-trunk-Linux/solr/build/solr-core/test/J0/temp/solr.cloud.TestCryptoKeys_AE7E9E22798D439C-001/shard-1-001/]
   [junit4]   2> 218585 INFO  (TEST-TestCryptoKeys.test-seed#[AE7E9E22798D439C]) [    ] o.a.s.c.CoreContainer loading shared library: /home/jenkins/workspace/Lucene-Solr-trunk-Linux/solr/build/solr-core/test/J0/../../../../../../../../../home/jenkins/workspace/Lucene-Solr-trunk-Linux/solr/build/solr-core/test/J0/temp/solr.cloud.TestCryptoKeys_AE7E9E22798D439C-001/shard-1-001/lib
   [junit4]   2> 218585 INFO  (OverseerStateUpdate-94294265847414788-127.0.0.1:36421_vj_xb%2Fcg-n_0000000000) [n:127.0.0.1:36421_vj_xb%2Fcg    ] o.a.s.c.o.ZkStateWriter going to create_collection /collections/collection1/state.json
   [junit4]   2> 218585 WARN  (TEST-TestCryptoKeys.test-seed#[AE7E9E22798D439C]) [    ] o.a.s.c.SolrResourceLoader Can't find (or read) directory to add to classloader: lib (resolved as: /home/jenkins/workspace/Lucene-Solr-trunk-Linux/solr/build/solr-core/test/J0/../../../../../../../../../home/jenkins/workspace/Lucene-Solr-trunk-Linux/solr/build/solr-core/test/J0/temp/solr.cloud.TestCryptoKeys_AE7E9E22798D439C-001/shard-1-001/lib).
   [junit4]   2> 218589 INFO  (TEST-TestCryptoKeys.test-seed#[AE7E9E22798D439C]) [    ] o.a.s.h.c.HttpShardHandlerFactory created with socketTimeout : 90000,urlScheme : ,connTimeout : 15000,maxConnectionsPerHost : 20,maxConnections : 10000,corePoolSize : 0,maximumPoolSize : 2147483647,maxThreadIdleTime : 5,sizeOfQueue : -1,fairnessPolicy : false,useRetries : false,
   [junit4]   2> 218590 INFO  (TEST-TestCryptoKeys.test-seed#[AE7E9E22798D439C]) [    ] o.a.s.u.UpdateShardHandler Creating UpdateShardHandler HTTP client with params: socketTimeout=340000&connTimeout=45000&retry=true
   [junit4]   2> 218590 INFO  (TEST-TestCryptoKeys.test-seed#[AE7E9E22798D439C]) [    ] o.a.s.l.LogWatcher SLF4J impl is org.slf4j.impl.Log4jLoggerFactory
   [junit4]   2> 218590 INFO  (TEST-TestCryptoKeys.test-seed#[AE7E9E22798D439C]) [    ] o.a.s.l.LogWatcher Registering Log Listener [Log4j (org.slf4j.impl.Log4jLoggerFactory)]
   [junit4]   2> 218590 INFO  (TEST-TestCryptoKeys.test-seed#[AE7E9E22798D439C]) [    ] o.a.s.c.ZkContainer Zookeeper client=127.0.0.1:45421/solr
   [junit4]   2> 218590 INFO  (TEST-TestCryptoKeys.test-seed#[AE7E9E22798D439C]) [    ] o.a.s.c.ZkController zkHost includes chroot
   [junit4]   2> 218590 INFO  (TEST-TestCryptoKeys.test-seed#[AE7E9E22798D439C]) [    ] o.a.s.c.c.SolrZkClient Using default ZkCredentialsProvider
   [junit4]   2> 218590 INFO  (TEST-TestCryptoKeys.test-seed#[AE7E9E22798D439C]) [    ] o.a.s.c.c.ConnectionManager Waiting for client to connect to ZooKeeper
   [junit4]   2> 218600 INFO  (zkCallback-132-thread-1-processing-n:127.0.0.1:36421_vj_xb%2Fcg) [n:127.0.0.1:36421_vj_xb%2Fcg    ] o.a.s.c.c.ZkStateReader A cluster state change: WatchedEvent state:SyncConnected type:NodeDataChanged path:/clusterstate.json, has occurred - updating... (live nodes size: 1)
   [junit4]   2> 218600 INFO  (zkCallback-134-thread-1) [    ] o.a.s.c.c.ZkStateReader A cluster state change: WatchedEvent state:SyncConnected type:NodeDataChanged path:/clusterstate.json, has occurred - updating... (live nodes size: 1)
   [junit4]   2> 218600 INFO  (zkCallback-138-thread-1) [    ] o.a.s.c.c.ConnectionManager Watcher org.apache.solr.common.cloud.ConnectionManager@ceca2b name:ZooKeeperConnection Watcher:127.0.0.1:45421 got event WatchedEvent state:SyncConnected type:None path:null path:null type:None
   [junit4]   2> 218601 INFO  (TEST-TestCryptoKeys.test-seed#[AE7E9E22798D439C]) [    ] o.a.s.c.c.ConnectionManager Client is connected to ZooKeeper
   [junit4]   2> 218601 INFO  (zkCallback-132-thread-1-processing-n:127.0.0.1:36421_vj_xb%2Fcg) [n:127.0.0.1:36421_vj_xb%2Fcg    ] o.a.s.c.c.ZkStateReader Updated cluster state version to 4
   [junit4]   2> 218601 INFO  (zkCallback-134-thread-1) [    ] o.a.s.c.c.ZkStateReader Updated cluster state version to 4
   [junit4]   2> 218601 INFO  (TEST-TestCryptoKeys.test-seed#[AE7E9E22798D439C]) [    ] o.a.s.c.c.SolrZkClient Using default ZkACLProvider
   [junit4]   2> 218602 INFO  (TEST-TestCryptoKeys.test-seed#[AE7E9E22798D439C]) [n:127.0.0.1:43031_vj_xb%2Fcg    ] o.a.s.c.c.ConnectionManager Waiting for client to connect to ZooKeeper
   [junit4]   2> 218603 INFO  (zkCallback-139-thread-1-processing-n:127.0.0.1:43031_vj_xb%2Fcg) [n:127.0.0.1:43031_vj_xb%2Fcg    ] o.a.s.c.c.ConnectionManager Watcher org.apache.solr.common.cloud.ConnectionManager@1da2553 name:ZooKeeperConnection Watcher:127.0.0.1:45421/solr got event WatchedEvent state:SyncConnected type:None path:null path:null type:None
   [junit4]   2> 218603 INFO  (TEST-TestCryptoKeys.test-seed#[AE7E9E22798D439C]) [n:127.0.0.1:43031_vj_xb%2Fcg    ] o.a.s.c.c.ConnectionManager Client is connected to ZooKeeper
   [junit4]   2> 218605 INFO  (TEST-TestCryptoKeys.test-seed#[AE7E9E22798D439C]) [n:127.0.0.1:43031_vj_xb%2Fcg    ] o.a.s.c.c.ZkStateReader Updating cluster state from ZooKeeper... 
   [junit4]   2> 219607 INFO  (TEST-TestCryptoKeys.test-seed#[AE7E9E22798D439C]) [n:127.0.0.1:43031_vj_xb%2Fcg    ] o.a.s.c.ZkController Register node as live in ZooKeeper:/live_nodes/127.0.0.1:43031_vj_xb%2Fcg
   [junit4]   2> 219607 INFO  (TEST-TestCryptoKeys.test-seed#[AE7E9E22798D439C]) [n:127.0.0.1:43031_vj_xb%2Fcg    ] o.a.s.c.c.SolrZkClient makePath: /live_nodes/127.0.0.1:43031_vj_xb%2Fcg
   [junit4]   2> 219608 INFO  (TEST-TestCryptoKeys.test-seed#[AE7E9E22798D439C]) [n:127.0.0.1:43031_vj_xb%2Fcg    ] o.a.s.c.Overseer Overseer (id=null) closing
   [junit4]   2> 219608 INFO  (TEST-TestCryptoKeys.test-seed#[AE7E9E22798D439C]) [n:127.0.0.1:43031_vj_xb%2Fcg    ] o.a.s.c.LeaderElector Joined leadership election with path: /overseer_elect/election/94294265847414793-127.0.0.1:43031_vj_xb%2Fcg-n_0000000001
   [junit4]   2> 219609 INFO  (TEST-TestCryptoKeys.test-seed#[AE7E9E22798D439C]) [n:127.0.0.1:43031_vj_xb%2Fcg    ] o.a.s.c.LeaderElector Watching path /overseer_elect/election/94294265847414788-127.0.0.1:36421_vj_xb%2Fcg-n_0000000000 to know if I could be the leader
   [junit4]   2> 219629 INFO  (TEST-TestCryptoKeys.test-seed#[AE7E9E22798D439C]) [n:127.0.0.1:43031_vj_xb%2Fcg    ] o.a.s.c.CoreContainer No authentication plugin used.
   [junit4]   2> 219629 INFO  (TEST-TestCryptoKeys.test-seed#[AE7E9E22798D439C]) [n:127.0.0.1:43031_vj_xb%2Fcg    ] o.a.s.c.CoreContainer Security conf doesn't exist. Skipping setup for authorization module.
   [junit4]   2> 219629 INFO  (TEST-TestCryptoKeys.test-seed#[AE7E9E22798D439C]) [n:127.0.0.1:43031_vj_xb%2Fcg    ] o.a.s.c.CoresLocator Looking for core definitions underneath /home/jenkins/workspace/Lucene-Solr-trunk-Linux/solr/build/solr-core/test/J0/../../../../../../../../../home/jenkins/workspace/Lucene-Solr-trunk-Linux/solr/build/solr-core/test/J0/temp/solr.cloud.TestCryptoKeys_AE7E9E22798D439C-001/shard-1-001/cores
   [junit4]   2> 219630 INFO  (TEST-TestCryptoKeys.test-seed#[AE7E9E22798D439C]) [n:127.0.0.1:43031_vj_xb%2Fcg    ] o.a.s.c.SolrCore Created CoreDescriptor: {name=collection1, config=solrconfig.xml, transient=false, schema=schema.xml, loadOnStartup=true, configSetProperties=configsetprops.json, instanceDir=/home/jenkins/workspace/Lucene-Solr-trunk-Linux/solr/build/solr-core/test/J0/../../../../../../../../../home/jenkins/workspace/Lucene-Solr-trunk-Linux/solr/build/solr-core/test/J0/temp/solr.cloud.TestCryptoKeys_AE7E9E22798D439C-001/shard-1-001/cores/collection1, collection=collection1, absoluteInstDir=/home/jenkins/workspace/Lucene-Solr-trunk-Linux/solr/build/solr-core/test/J0/../../../../../../../../../home/jenkins/workspace/Lucene-Solr-trunk-Linux/solr/build/solr-core/test/J0/temp/solr.cloud.TestCryptoKeys_AE7E9E22798D439C-001/shard-1-001/cores/collection1/, coreNodeName=, dataDir=data/, shard=}
   [junit4]   2> 219630 INFO  (TEST-TestCryptoKeys.test-seed#[AE7E9E22798D439C]) [n:127.0.0.1:43031_vj_xb%2Fcg    ] o.a.s.c.CoresLocator Found core collection1 in /home/jenkins/workspace/Lucene-Solr-trunk-Linux/solr/build/solr-core/test/J0/../../../../../../../../../home/jenkins/workspace/Lucene-Solr-trunk-Linux/solr/build/solr-core/test/J0/temp/solr.cloud.TestCryptoKeys_AE7E9E22798D439C-001/shard-1-001/cores/collection1/
   [junit4]   2> 219630 INFO  (TEST-TestCryptoKeys.test-seed#[AE7E9E22798D439C]) [n:127.0.0.1:43031_vj_xb%2Fcg    ] o.a.s.c.CoresLocator Found 1 core definitions
   [junit4]   2> 219631 INFO  (TEST-TestCryptoKeys.test-seed#[AE7E9E22798D439C]) [n:127.0.0.1:43031_vj_xb%2Fcg    ] o.a.s.s.SolrDispatchFilter user.dir=/home/jenkins/workspace/Lucene-Solr-trunk-Linux/solr/build/solr-core/test/J0
   [junit4]   2> 219631 INFO  (TEST-TestCryptoKeys.test-seed#[AE7E9E22798D439C]) [n:127.0.0.1:43031_vj_xb%2Fcg    ] o.a.s.s.SolrDispatchFilter SolrDispatchFilter.init() done
   [junit4]   2> 219631 INFO  (coreLoadExecutor-923-thread-1-processing-n:127.0.0.1:43031_vj_xb%2Fcg) [n:127.0.0.1:43031_vj_xb%2Fcg c:collection1   x:collection1] o.a.s.c.ZkController publishing state=down
   [junit4]   2> 219631 INFO  (coreLoadExecutor-923-thread-1-processing-n:127.0.0.1:43031_vj_xb%2Fcg) [n:127.0.0.1:43031_vj_xb%2Fcg c:collection1   x:collection1] o.a.s.c.ZkController numShards not found on descriptor - reading it from system property
   [junit4]   2> 219640 INFO  (zkCallback-132-thread-1-processing-n:127.0.0.1:36421_vj_xb%2Fcg) [n:127.0.0.1:36421_vj_xb%2Fcg    ] o.a.s.c.DistributedQueue NodeChildrenChanged fired on path /overseer/queue state SyncConnected
   [junit4]   2> 219640 INFO  (coreLoadExecutor-923-thread-1-processing-n:127.0.0.1:43031_vj_xb%2Fcg) [n:127.0.0.1:43031_vj_xb%2Fcg c:collection1   x:collection1] o.a.s.c.ZkController Registering watch for external collection collection1
   [junit4]   2> 219640 INFO  (coreLoadExecutor-923-thread-1-processing-n:127.0.0.1:43031_vj_xb%2Fcg) [n:127.0.0.1:43031_vj_xb%2Fcg c:collection1   x:collection1] o.a.s.c.c.ZkStateReader addZkWatch collection1
   [junit4]   2> 219640 INFO  (OverseerStateUpdate-94294265847414788-127.0.0.1:36421_vj_xb%2Fcg-n_0000000000) [n:127.0.0.1:36421_vj_xb%2Fcg    ] o.a.s.c.Overseer processMessage: queueSize: 1, message = {
   [junit4]   2>   "core":"collection1",
   [junit4]   2>   "roles":null,
   [junit4]   2>   "base_url":"http://127.0.0.1:43031/vj_xb/cg",
   [junit4]   2>   "node_name":"127.0.0.1:43031_vj_xb%2Fcg",
   [junit4]   2>   "numShards":"1",
   [junit4]   2>   "state":"down",
   [junit4]   2>   "shard":null,
   [junit4]   2>   "collection":"collection1",
   [junit4]   2>   "operation":"state"} current state version: 4
   [junit4]   2> 219640 INFO  (coreLoadExecutor-923-thread-1-processing-n:127.0.0.1:43031_vj_xb%2Fcg) [n:127.0.0.1:43031_vj_xb%2Fcg c:collection1   x:collection1] o.a.s.c.c.ZkStateReader Updating collection state at /collections/collection1/state.json from ZooKeeper... 
   [junit4]   2> 219641 INFO  (OverseerStateUpdate-94294265847414788-127.0.0.1:36421_vj_xb%2Fcg-n_0000000000) [n:127.0.0.1:36421_vj_xb%2Fcg    ] o.a.s.c.o.ReplicaMutator Update state numShards=1 message={
   [junit4]   2>   "core":"collection1",
   [junit4]   2>   "roles":null,
   [junit4]   2>   "base_url":"http://127.0.0.1:43031/vj_xb/cg",
   [junit4]   2>   "node_name":"127.0.0.1:43031_vj_xb%2Fcg",
   [junit4]   2>   "numShards":"1",
   [junit4]   2>   "state":"down",
   [junit4]   2>   "shard":null,
   [junit4]   2>   "collection":"collection1",
   [junit4]   2>   "operation":"state"}
   [junit4]   2> 219641 INFO  (OverseerStateUpdate-94294265847414788-127.0.0.1:36421_vj_xb%2Fcg-n_0000000000) [n:127.0.0.1:36421_vj_xb%2Fcg    ] o.a.s.c.o.ReplicaMutator Collection already exists with numShards=1
   [junit4]   2> 219641 INFO  (coreLoadExecutor-923-thread-1-processing-n:127.0.0.1:43031_vj_xb%2Fcg) [n:127.0.0.1:43031_vj_xb%2Fcg c:collection1   x:collection1] o.a.s.c.c.ZkStateReader Updating data for collection1 to ver 0 
   [junit4]   2> 219641 INFO  (OverseerStateUpdate-94294265847414788-127.0.0.1:36421_vj_xb%2Fcg-n_0000000000) [n:127.0.0.1:36421_vj_xb%2Fcg    ] o.a.s.c.o.ReplicaMutator Assigning new node to shard shard=shard1
   [junit4]   2> 219641 INFO  (coreLoadExecutor-923-thread-1-processing-n:127.0.0.1:43031_vj_xb%2Fcg) [n:127.0.0.1:43031_vj_xb%2Fcg c:collection1   x:collection1] o.a.s.c.ZkController look for our core node name
   [junit4]   2> 219742 INFO  (OverseerStateUpdate-94294265847414788-127.0.0.1:36421_vj_xb%2Fcg-n_0000000000) [n:127.0.0.1:36421_vj_xb%2Fcg    ] o.a.s.c.o.ZkStateWriter going to update_collection /collections/collection1/state.json version: 0
   [junit4]   2> 219742 INFO  (zkCallback-139-thread-1-processing-n:127.0.0.1:43031_vj_xb%2Fcg) [n:127.0.0.1:43031_vj_xb%2Fcg    ] o.a.s.c.c.ZkStateReader A cluster state change: WatchedEvent state:SyncConnected type:NodeDataChanged path:/collections/collection1/state.json for collection collection1 has occurred - updating... (live nodes size: 2)
   [junit4]   2> 219743 INFO  (zkCallback-139-thread-1-processing-n:127.0.0.1:43031_vj_xb%2Fcg) [n:127.0.0.1:43031_vj_xb%2Fcg    ] o.a.s.c.c.ZkStateReader Updating data for collection1 to ver 1 
   [junit4]   2> 220641 INFO  (coreLoadExecutor-923-thread-1-processing-n:127.0.0.1:43031_vj_xb%2Fcg) [n:127.0.0.1:43031_vj_xb%2Fcg c:collection1   x:collection1] o.a.s.c.ZkController waiting to find shard id in clusterstate for collection1
   [junit4]   2> 220641 INFO  (coreLoadExecutor-923-thread-1-processing-n:127.0.0.1:43031_vj_xb%2Fcg) [n:127.0.0.1:43031_vj_xb%2Fcg c:collection1   x:collection1] o.a.s.c.ZkController Check for collection zkNode:collection1
   [junit4]   2> 220642 INFO  (coreLoadExecutor-923-thread-1-processing-n:127.0.0.1:43031_vj_xb%2Fcg) [n:127.0.0.1:43031_vj_xb%2Fcg c:collection1   x:collection1] o.a.s.c.ZkController Collection zkNode exists
   [junit4]   2> 220642 INFO  (coreLoadExecutor-923-thread-1-processing-n:127.0.0.1:43031_vj_xb%2Fcg) [n:127.0.0.1:43031_vj_xb%2Fcg c:collection1   x:collection1] o.a.s.c.c.ZkStateReader Load collection config from:/collections/collection1
   [junit4]   2> 220642 INFO  (coreLoadExecutor-923-thread-1-processing-n:127.0.0.1:43031_vj_xb%2Fcg) [n:127.0.0.1:43031_vj_xb%2Fcg c:collection1   x:collection1] o.a.s.c.c.ZkStateReader path=/collections/collection1 configName=conf1 specified config exists in ZooKeeper
   [junit4]   2> 220642 INFO  (coreLoadExecutor-923-thread-1-processing-n:127.0.0.1:43031_vj_xb%2Fcg) [n:127.0.0.1:43031_vj_xb%2Fcg c:collection1   x:collection1] o.a.s.c.SolrResourceLoader new SolrResourceLoader for directory: '/home/jenkins/workspace/Lucene-Solr-trunk-Linux/solr/build/solr-core/test/J0/../../../../../../../../../home/jenkins/workspace/Lucene-Solr-trunk-Linux/solr/build/solr-core/test/J0/temp/solr.cloud.TestCryptoKeys_AE7E9E22798D439C-001/shard-1-001/cores/collection1/'
   [junit4]   2> 220650 INFO  (coreLoadExecutor-923-thread-1-processing-n:127.0.0.1:43031_vj_xb%2Fcg) [n:127.0.0.1:43031_vj_xb%2Fcg c:collection1   x:collection1] o.a.s.c.Config loaded config solrconfig.xml with version 0 
   [junit4]   2> 220653 INFO  (coreLoadExecutor-923-thread-1-processing-n:127.0.0.1:43031_vj_xb%2Fcg) [n:127.0.0.1:43031_vj_xb%2Fcg c:collection1   x:collection1] o.a.s.c.SolrConfig current version of requestparams : -1
   [junit4]   2> 220661 INFO  (coreLoadExecutor-923-thread-1-processing-n:127.0.0.1:43031_vj_xb%2Fcg) [n:127.0.0.1:43031_vj_xb%2Fcg c:collection1   x:collection1] o.a.s.c.SolrConfig Using Lucene MatchVersion: 6.0.0
   [junit4]   2> 220668 INFO  (coreLoadExecutor-923-thread-1-processing-n:127.0.0.1:43031_vj_xb%2Fcg) [n:127.0.0.1:43031_vj_xb%2Fcg c:collection1   x:collection1] o.a.s.c.Config Loaded SolrConfig: solrconfig.xml
   [junit4]   2> 220668 INFO  (coreLoadExecutor-923-thread-1-processing-n:127.0.0.1:43031_vj_xb%2Fcg) [n:127.0.0.1:43031_vj_xb%2Fcg c:collection1   x:collection1] o.a.s.s.IndexSchema Reading Solr Schema from /configs/conf1/schema.xml
   [junit4]   2> 220672 INFO  (coreLoadExecutor-923-thread-1-processing-n:127.0.0.1:43031_vj_xb%2Fcg) [n:127.0.0.1:43031_vj_xb%2Fcg c:collection1   x:collection1] o.a.s.s.IndexSchema [collection1] Schema name=test
   [junit4]   2> 220743 INFO  (coreLoadExecutor-923-thread-1-processing-n:127.0.0.1:43031_vj_xb%2Fcg) [n:127.0.0.1:43031_vj_xb%2Fcg c:collection1   x:collection1] o.a.s.s.OpenExchangeRatesOrgProvider Initialized with rates=open-exchange-rates.json, refreshInterval=1440.
   [junit4]   2> 220747 INFO  (coreLoadExecutor-923-thread-1-processing-n:127.0.0.1:43031_vj_xb%2Fcg) [n:127.0.0.1:43031_vj_xb%2Fcg c:collection1   x:collection1] o.a.s.s.IndexSchema default search field in schema is text
   [junit4]   2> 220748 INFO  (coreLoadExecutor-923-thread-1-processing-n:127.0.0.1:43031_vj_xb%2Fcg) [n:127.0.0.1:43031_vj_xb%2Fcg c:collection1   x:collection1] o.a.s.s.IndexSchema unique key field: id
   [junit4]   2> 220754 INFO  (coreLoadExecutor-923-thread-1-processing-n:127.0.0.1:43031_vj_xb%2Fcg) [n:127.0.0.1:43031_vj_xb%2Fcg c:collection1   x:collection1] o.a.s.s.FileExchangeRateProvider Reloading exchange rates from file currency.xml
   [junit4]   2> 220755 INFO  (coreLoadExecutor-923-thread-1-processing-n:127.0.0.1:43031_vj_xb%2Fcg) [n:127.0.0.1:43031_vj_xb%2Fcg c:collection1   x:collection1] o.a.s.s.FileExchangeRateProvider Reloading exchange rates from file currency.xml
   [junit4]   2> 220757 INFO  (coreLoadExecutor-923-thread-1-processing-n:127.0.0.1:43031_vj_xb%2Fcg) [n:127.0.0.1:43031_vj_xb%2Fcg c:collection1   x:collection1] o.a.s.s.OpenExchangeRatesOrgProvider Reloading exchange rates from open-exchange-rates.json
   [junit4]   2> 220757 WARN  (coreLoadExecutor-923-thread-1-processing-n:127.0.0.1:43031_vj_xb%2Fcg) [n:127.0.0.1:43031_vj_xb%2Fcg c:collection1   x:collection1] o.a.s.s.OpenExchangeRatesOrgProvider Unknown key IMPORTANT NOTE
   [junit4]   2> 220757 WARN  (coreLoadExecutor-923-thread-1-processing-n:127.0.0.1:43031_vj_xb%2Fcg) [n:127.0.0.1:43031_vj_xb%2Fcg c:collection1   x:collection1] o.a.s.s.OpenExchangeRatesOrgProvider Expected key, got STRING
   [junit4]   2> 220757 INFO  (coreLoadExecutor-923-thread-1-processing-n:127.0.0.1:43031_vj_xb%2Fcg) [n:127.0.0.1:43031_vj_xb%2Fcg c:collection1   x:collection1] o.a.s.s.OpenExchangeRatesOrgProvider Reloading exchange rates from open-exchange-rates.json
   [junit4]   2> 220757 WARN  (coreLoadExecutor-923-thread-1-processing-n:127.0.0.1:43031_vj_xb%2Fcg) [n:127.0.0.1:43031_vj_xb%2Fcg c:collection1   x:collection1] o.a.s.s.OpenExchangeRatesOrgProvider Unknown key IMPORTANT NOTE
   [junit4]   2> 220758 WARN  (coreLoadExecutor-923-thread-1-processing-n:127.0.0.1:43031_vj_xb%2Fcg) [n:127.0.0.1:43031_vj_xb%2Fcg c:collection1   x:collection1] o.a.s.s.OpenExchangeRatesOrgProvider Expected key, got STRING
   [junit4]   2> 220758 INFO  (coreLoadExecutor-923-thread-1-processing-n:127.0.0.1:43031_vj_xb%2Fcg) [n:127.0.0.1:43031_vj_xb%2Fcg c:collection1   x:collection1] o.a.s.c.ConfigSetProperties Did not find ConfigSet properties, assuming default properties: Can't find resource 'configsetprops.json' in classpath or '/configs/conf1', cwd=/home/jenkins/workspace/Lucene-Solr-trunk-Linux/solr/build/solr-core/test/J0
   [junit4]   2> 220758 INFO  (coreLoadExecutor-923-thread-1-processing-n:127.0.0.1:43031_vj_xb%2Fcg) [n:127.0.0.1:43031_vj_xb%2Fcg c:collection1   x:collection1] o.a.s.c.CoreContainer Creating SolrCore 'collection1' using configuration from collection collection1
   [junit4]   2> 220758 INFO  (coreLoadExecutor-923-thread-1-processing-n:127.0.0.1:43031_vj_xb%2Fcg) [n:127.0.0.1:43031_vj_xb%2Fcg c:collection1 s:shard1 r:core_node1 x:collection1] o.a.s.c.SolrCore org.apache.solr.core.MockDirectoryFactory
   [junit4]   2> 220758 INFO  (coreLoadExecutor-923-thread-1-processing-n:127.0.0.1:43031_vj_xb%2Fcg) [n:127.0.0.1:43031_vj_xb%2Fcg c:collection1 s:shard1 r:core_node1 x:collection1] o.a.s.c.SolrCore [[collection1] ] Opening new SolrCore at [/home/jenkins/workspace/Lucene-Solr-trunk-Linux/solr/build/solr-core/test/J0/../../../../../../../../../home/jenkins/workspace/Lucene-Solr-trunk-Linux/solr/build/solr-core/test/J0/temp/solr.cloud.TestCryptoKeys_AE7E9E22798D439C-001/shard-1-001/cores/collection1/], dataDir=[null]
   [junit4]   2> 220758 INFO  (coreLoadExecutor-923-thread-1-processing-n:127.0.0.1:43031_vj_xb%2Fcg) [n:127.0.0.1:43031_vj_xb%2Fcg c:collection1 s:shard1 r:core_node1 x:collection1] o.a.s.c.JmxMonitoredMap JMX monitoring is enabled. Adding Solr mbeans to JMX Server: com.sun.jmx.mbeanserver.JmxMBeanServer@36cd9b
   [junit4]   2> 220759 INFO  (coreLoadExecutor-923-thread-1-processing-n:127.0.0.1:43031_vj_xb%2Fcg) [n:127.0.0.1:43031_vj_xb%2Fcg c:collection1 s:shard1 r:core_node1 x:collection1] o.a.s.c.CachingDirectoryFactory return new directory for /home/jenkins/workspace/Lucene-Solr-trunk-Linux/solr/build/solr-core/test/J0/../../../../../../../../../home/jenkins/workspace/Lucene-Solr-trunk-Linux/solr/build/solr-core/test/J0/temp/solr.cloud.TestCryptoKeys_AE7E9E22798D439C-001/shard-1-001/cores/collection1/data
   [junit4]   2> 220759 INFO  (coreLoadExecutor-923-thread-1-processing-n:127.0.0.1:43031_vj_xb%2Fcg) [n:127.0.0.1:43031_vj_xb%2Fcg c:collection1 s:shard1 r:core_node1 x:collection1] o.a.s.c.SolrCore New index directory detected: old=null new=/home/jenkins/workspace/Lucene-Solr-trunk-Linux/solr/build/solr-core/test/J0/../../../../../../../../../home/jenkins/workspace/Lucene-Solr-trunk-Linux/solr/build/solr-core/test/J0/temp/solr.cloud.TestCryptoKeys_AE7E9E22798D439C-001/shard-1-001/cores/collection1/data/index/
   [junit4]   2> 220759 WARN  (coreLoadExecutor-923-thread-1-processing-n:127.0.0.1:43031_vj_xb%2Fcg) [n:127.0.0.1:43031_vj_xb%2Fcg c:collection1 s:shard1 r:core_node1 x:collection1] o.a.s.c.SolrCore [collection1] Solr index directory '/home/jenkins/workspace/Lucene-Solr-trunk-Linux/solr/build/solr-core/test/J0/../../../../../../../../../home/jenkins/workspace/Lucene-Solr-trunk-Linux/solr/build/solr-core/test/J0/temp/solr.cloud.TestCryptoKeys_AE7E9E22798D439C-001/shard-1-001/cores/collection1/data/index' doesn't exist. Creating new index...
   [junit4]   2> 220759 INFO  (coreLoadExecutor-923-thread-1-processing-n:127.0.0.1:43031_vj_xb%2Fcg) [n:127.0.0.1:43031_vj_xb%2Fcg c:collection1 s:shard1 r:core_node1 x:collection1] o.a.s.c.CachingDirectoryFactory return new directory for /home/jenkins/workspace/Lucene-Solr-trunk-Linux/solr/build/solr-core/test/J0/../../../../../../../../../home/jenkins/workspace/Lucene-Solr-trunk-Linux/solr/build/solr-core/test/J0/temp/solr.cloud.TestCryptoKeys_AE7E9E22798D439C-001/shard-1-001/cores/collection1/data/index
   [junit4]   2> 220760 INFO  (coreLoadExecutor-923-thread-1-processing-n:127.0.0.1:43031_vj_xb%2Fcg) [n:127.0.0.1:43031_vj_xb%2Fcg c:collection1 s:shard1 r:core_node1 x:collection1] o.a.s.u.RandomMergePolicy RandomMergePolicy wrapping class org.apache.lucene.index.TieredMergePolicy: [TieredMergePolicy: maxMergeAtOnce=11, maxMergeAtOnceExplicit=28, maxMergedSegmentMB=82.62890625, floorSegmentMB=1.3720703125, forceMergeDeletesPctAllowed=12.597071376994869, segmentsPerTier=42.0, maxCFSSegmentSizeMB=8.796093022207999E12, noCFSRatio=1.0
   [junit4]   2> 220760 INFO  (coreLoadExecutor-923-thread-1-processing-n:127.0.0.1:43031_vj_xb%2Fcg) [n:127.0.0.1:43031_vj_xb%2Fcg c:collection1 s:shard1 r:core_node1 x:collection1] o.a.s.c.SolrCore SolrDeletionPolicy.onCommit: commits: num=1
   [junit4]   2> 	commit{dir=MockDirectoryWrapper(RAMDirectory@739b98 lockFactory=org.apache.lucene.store.SingleInstanceLockFactory@69626b),segFN=segments_1,generation=1}
   [junit4]   2> 220760 INFO  (coreLoadExecutor-923-thread-1-processing-n:127.0.0.1:43031_vj_xb%2Fcg) [n:127.0.0.1:43031_vj_xb%2Fcg c:collection1 s:shard1 r:core_node1 x:collection1] o.a.s.c.SolrCore newest commit generation = 1
   [junit4]   2> 220760 INFO  (OldIndexDirectoryCleanupThreadForCore-collection1) [n:127.0.0.1:43031_vj_xb%2Fcg c:collection1 s:shard1 r:core_node1 x:collection1] o.a.s.c.SolrCore Looking for old in

[...truncated too long message...]

od)
   [junit4]   2>         at sun.nio.ch.EPollArrayWrapper.interrupt(EPollArrayWrapper.java:317)
   [junit4]   2>         at sun.nio.ch.EPollSelectorImpl.wakeup(EPollSelectorImpl.java:193)
   [junit4]   2>         at java.nio.channels.spi.AbstractSelector$1.interrupt(AbstractSelector.java:213)
   [junit4]   2>         at java.nio.channels.spi.AbstractSelector.begin(AbstractSelector.java:219)
   [junit4]   2>         at sun.nio.ch.EPollSelectorImpl.doSelect(EPollSelectorImpl.java:78)
   [junit4]   2>         at sun.nio.ch.SelectorImpl.lockAndDoSelect(SelectorImpl.java:86)
   [junit4]   2>         at sun.nio.ch.SelectorImpl.select(SelectorImpl.java:97)
   [junit4]   2>         at sun.nio.ch.SelectorImpl.select(SelectorImpl.java:101)
   [junit4]   2>         at org.eclipse.jetty.io.SelectorManager$ManagedSelector.select(SelectorManager.java:600)
   [junit4]   2>         at org.eclipse.jetty.io.SelectorManager$ManagedSelector.run(SelectorManager.java:549)
   [junit4]   2>         at org.eclipse.jetty.util.thread.NonBlockingThread.run(NonBlockingThread.java:52)
   [junit4]   2>         at org.eclipse.jetty.util.thread.QueuedThreadPool.runJob(QueuedThreadPool.java:635)
   [junit4]   2>         at org.eclipse.jetty.util.thread.QueuedThreadPool$3.run(QueuedThreadPool.java:555)
   [junit4]   2>         at java.lang.Thread.run(Thread.java:745)
   [junit4]   2>   54) Thread[id=1489, name=qtp14103348-1489-selector-ServerConnectorManager@2b8c62/๓, state=RUNNABLE, group=TGRP-TestCryptoKeys]
   [junit4]   2>         at sun.nio.ch.IOUtil.drain(Native Method)
   [junit4]   2>         at sun.nio.ch.EPollSelectorImpl.doSelect(EPollSelectorImpl.java:90)
   [junit4]   2>         at sun.nio.ch.SelectorImpl.lockAndDoSelect(SelectorImpl.java:86)
   [junit4]   2>         at sun.nio.ch.SelectorImpl.select(SelectorImpl.java:97)
   [junit4]   2>         at sun.nio.ch.SelectorImpl.select(SelectorImpl.java:101)
   [junit4]   2>         at org.eclipse.jetty.io.SelectorManager$ManagedSelector.select(SelectorManager.java:600)
   [junit4]   2>         at org.eclipse.jetty.io.SelectorManager$ManagedSelector.run(SelectorManager.java:549)
   [junit4]   2>         at org.eclipse.jetty.util.thread.NonBlockingThread.run(NonBlockingThread.java:52)
   [junit4]   2>         at org.eclipse.jetty.util.thread.QueuedThreadPool.runJob(QueuedThreadPool.java:635)
   [junit4]   2>         at org.eclipse.jetty.util.thread.QueuedThreadPool$3.run(QueuedThreadPool.java:555)
   [junit4]   2>         at java.lang.Thread.run(Thread.java:745)
   [junit4]   2>   55) Thread[id=1398, name=Scheduler-22641142, state=TIMED_WAITING, group=TGRP-TestCryptoKeys]
   [junit4]   2>         at sun.misc.Unsafe.park(Native Method)
   [junit4]   2>         at java.util.concurrent.locks.LockSupport.parkNanos(LockSupport.java:215)
   [junit4]   2>         at java.util.concurrent.locks.AbstractQueuedSynchronizer$ConditionObject.awaitNanos(AbstractQueuedSynchronizer.java:2078)
   [junit4]   2>         at java.util.concurrent.ScheduledThreadPoolExecutor$DelayedWorkQueue.take(ScheduledThreadPoolExecutor.java:1093)
   [junit4]   2>         at java.util.concurrent.ScheduledThreadPoolExecutor$DelayedWorkQueue.take(ScheduledThreadPoolExecutor.java:809)
   [junit4]   2>         at java.util.concurrent.ThreadPoolExecutor.getTask(ThreadPoolExecutor.java:1067)
   [junit4]   2>         at java.util.concurrent.ThreadPoolExecutor.runWorker(ThreadPoolExecutor.java:1127)
   [junit4]   2>         at java.util.concurrent.ThreadPoolExecutor$Worker.run(ThreadPoolExecutor.java:617)
   [junit4]   2>         at java.lang.Thread.run(Thread.java:745)
   [junit4]   2>   56) Thread[id=1877, name=searcherExecutor-1120-thread-1, state=WAITING, group=TGRP-TestCryptoKeys]
   [junit4]   2>         at sun.misc.Unsafe.park(Native Method)
   [junit4]   2>         at java.util.concurrent.locks.LockSupport.park(LockSupport.java:175)
   [junit4]   2>         at java.util.concurrent.locks.AbstractQueuedSynchronizer$ConditionObject.await(AbstractQueuedSynchronizer.java:2039)
   [junit4]   2>         at java.util.concurrent.LinkedBlockingQueue.take(LinkedBlockingQueue.java:442)
   [junit4]   2>         at java.util.concurrent.ThreadPoolExecutor.getTask(ThreadPoolExecutor.java:1067)
   [junit4]   2>         at java.util.concurrent.ThreadPoolExecutor.runWorker(ThreadPoolExecutor.java:1127)
   [junit4]   2>         at java.util.concurrent.ThreadPoolExecutor$Worker.run(ThreadPoolExecutor.java:617)
   [junit4]   2>         at java.lang.Thread.run(Thread.java:745)
   [junit4]   2>   57) Thread[id=1524, name=Scheduler-18597517, state=TIMED_WAITING, group=TGRP-TestCryptoKeys]
   [junit4]   2>         at sun.misc.Unsafe.park(Native Method)
   [junit4]   2>         at java.util.concurrent.locks.LockSupport.parkNanos(LockSupport.java:215)
   [junit4]   2>         at java.util.concurrent.locks.AbstractQueuedSynchronizer$ConditionObject.awaitNanos(AbstractQueuedSynchronizer.java:2078)
   [junit4]   2>         at java.util.concurrent.ScheduledThreadPoolExecutor$DelayedWorkQueue.take(ScheduledThreadPoolExecutor.java:1093)
   [junit4]   2>         at java.util.concurrent.ScheduledThreadPoolExecutor$DelayedWorkQueue.take(ScheduledThreadPoolExecutor.java:809)
   [junit4]   2>         at java.util.concurrent.ThreadPoolExecutor.getTask(ThreadPoolExecutor.java:1067)
   [junit4]   2>         at java.util.concurrent.ThreadPoolExecutor.runWorker(ThreadPoolExecutor.java:1127)
   [junit4]   2>         at java.util.concurrent.ThreadPoolExecutor$Worker.run(ThreadPoolExecutor.java:617)
   [junit4]   2>         at java.lang.Thread.run(Thread.java:745)
   [junit4]   2>   58) Thread[id=1494, name=Scheduler-29350735, state=TIMED_WAITING, group=TGRP-TestCryptoKeys]
   [junit4]   2>         at sun.misc.Unsafe.park(Native Method)
   [junit4]   2>         at java.util.concurrent.locks.LockSupport.parkNanos(LockSupport.java:215)
   [junit4]   2>         at java.util.concurrent.locks.AbstractQueuedSynchronizer$ConditionObject.awaitNanos(AbstractQueuedSynchronizer.java:2078)
   [junit4]   2>         at java.util.concurrent.ScheduledThreadPoolExecutor$DelayedWorkQueue.take(ScheduledThreadPoolExecutor.java:1093)
   [junit4]   2>         at java.util.concurrent.ScheduledThreadPoolExecutor$DelayedWorkQueue.take(ScheduledThreadPoolExecutor.java:809)
   [junit4]   2>         at java.util.concurrent.ThreadPoolExecutor.getTask(ThreadPoolExecutor.java:1067)
   [junit4]   2>         at java.util.concurrent.ThreadPoolExecutor.runWorker(ThreadPoolExecutor.java:1127)
   [junit4]   2>         at java.util.concurrent.ThreadPoolExecutor$Worker.run(ThreadPoolExecutor.java:617)
   [junit4]   2>         at java.lang.Thread.run(Thread.java:745)
   [junit4]   2> NOTE: test params are: codec=Asserting(Lucene53): {blobName=PostingsFormat(name=Memory doPackFST= true), size=PostingsFormat(name=Direct), _version_=Lucene50(blocksize=128), id=Lucene50(blocksize=128), version=Lucene50(blocksize=128), md5=PostingsFormat(name=Memory doPackFST= true), timestamp=PostingsFormat(name=Memory doPackFST= true)}, docValues:{}, sim=RandomSimilarityProvider(queryNorm=false,coord=crazy): {}, locale=th_TH_TH_#u-nu-thai, timezone=America/Argentina/Tucuman
   [junit4]   2> NOTE: Linux 3.16.0-44-generic i386/Oracle Corporation 1.8.0_51 (32-bit)/cpus=12,threads=80,free=140030568,total=230469632
   [junit4]   2> NOTE: All tests run in this JVM: [TestBadConfig, TestFieldResource, TestConfig, TestUpdate, CSVRequestHandlerTest, TestPhraseSuggestions, DateMathParserTest, TestJoin, RequestLoggingTest, HdfsBasicDistributedZkTest, MBeansHandlerTest, ClusterStateTest, TestLazyCores, DistributedSpellCheckComponentTest, TestHashQParserPlugin, TestManagedResourceStorage, TestDynamicFieldCollectionResource, SimpleMLTQParserTest, SimplePostToolTest, TestUniqueKeyFieldResource, TestExceedMaxTermLength, DistributedDebugComponentTest, BasicDistributedZkTest, TestConfigOverlay, UUIDFieldTest, TestOrdValues, TestManagedResource, HdfsRecoveryZkTest, DebugComponentTest, BlockCacheTest, TestSchemaNameResource, TestBinaryField, DateFieldTest, RecoveryAfterSoftCommitTest, TestMacros, FullHLLTest, TestRandomFaceting, CoreMergeIndexesAdminHandlerTest, BasicZkTest, ExternalFileFieldSortTest, TestCryptoKeys]
   [junit4]   2> NOTE: reproduce with: ant test  -Dtestcase=TestCryptoKeys -Dtests.seed=AE7E9E22798D439C -Dtests.multiplier=3 -Dtests.slow=true -Dtests.locale=th_TH_TH_#u-nu-thai -Dtests.timezone=America/Argentina/Tucuman -Dtests.asserts=true -Dtests.file.encoding=UTF-8
   [junit4] ERROR   0.00s J0 | TestCryptoKeys (suite) <<<
   [junit4]    > Throwable #1: java.lang.Exception: Suite timeout exceeded (>= 7200000 msec).
   [junit4]    > 	at __randomizedtesting.SeedInfo.seed([AE7E9E22798D439C]:0)
   [junit4] Completed [489/534] on J0 in 7224.06s, 1 test, 2 errors <<< FAILURES!

[...truncated 149 lines...]
BUILD FAILED
/home/jenkins/workspace/Lucene-Solr-trunk-Linux/build.xml:716: The following error occurred while executing this line:
/home/jenkins/workspace/Lucene-Solr-trunk-Linux/build.xml:660: The following error occurred while executing this line:
/home/jenkins/workspace/Lucene-Solr-trunk-Linux/build.xml:59: The following error occurred while executing this line:
/home/jenkins/workspace/Lucene-Solr-trunk-Linux/solr/build.xml:230: The following error occurred while executing this line:
/home/jenkins/workspace/Lucene-Solr-trunk-Linux/solr/common-build.xml:514: The following error occurred while executing this line:
/home/jenkins/workspace/Lucene-Solr-trunk-Linux/lucene/common-build.xml:1429: The following error occurred while executing this line:
/home/jenkins/workspace/Lucene-Solr-trunk-Linux/lucene/common-build.xml:984: There were test failures: 534 suites, 2111 tests, 1 suite-level error, 1 error, 193 ignored (26 assumptions)

Total time: 142 minutes 18 seconds
Build step 'Invoke Ant' marked build as failure
Archiving artifacts
Recording test results
Email was triggered for: Failure - Any
Sending email for trigger: Failure - Any