You are viewing a plain text version of this content. The canonical link for it is here.
Posted to builds@solr.apache.org by Apache Jenkins Server <je...@builds.apache.org> on 2026/08/01 19:50:53 UTC
[JENKINS] Solr » Solr-Test-main - Build # 14413 - Still Unstable!
Build: https://ci-builds.apache.org/job/Solr/job/Solr-Test-main/14413/
2 tests failed.
FAILED: org.apache.solr.TestDistributedGrouping.test
Error Message:
java.lang.AssertionError: header: {partialResults=true, partialResultsDetails=Limits exceeded! ([handleResponses next stage:EXECUTE_QUERY] Limit(s) exceeded prior to delayingSearchComponent in [delayingSearchComponent, query, facet, facet_module, mlt, highlight, stats, expand, terms, debug]): Query limits: [TimeAllowedLimit:LIMIT EXCEEDED], status=0, QTime=283}
Stack Trace:
java.lang.AssertionError: header: {partialResults=true, partialResultsDetails=Limits exceeded! ([handleResponses next stage:EXECUTE_QUERY] Limit(s) exceeded prior to delayingSearchComponent in [delayingSearchComponent, query, facet, facet_module, mlt, highlight, stats, expand, terms, debug]): Query limits: [TimeAllowedLimit:LIMIT EXCEEDED], status=0, QTime=283}
at __randomizedtesting.SeedInfo.seed([9FC7351F4FBF964C:17930AC5E143FBB4]:0)
at org.junit.Assert.fail(Assert.java:89)
at org.junit.Assert.assertTrue(Assert.java:42)
at org.junit.Assert.assertFalse(Assert.java:65)
at org.apache.solr.TestDistributedGrouping.test(TestDistributedGrouping.java:1306)
at java.base/jdk.internal.reflect.DirectMethodHandleAccessor.invoke(DirectMethodHandleAccessor.java:103)
at java.base/java.lang.reflect.Method.invoke(Method.java:580)
at com.carrotsearch.randomizedtesting.RandomizedRunner.invoke(RandomizedRunner.java:1780)
at com.carrotsearch.randomizedtesting.RandomizedRunner$8.evaluate(RandomizedRunner.java:959)
at com.carrotsearch.randomizedtesting.RandomizedRunner$9.evaluate(RandomizedRunner.java:995)
at com.carrotsearch.randomizedtesting.RandomizedRunner$10.evaluate(RandomizedRunner.java:1009)
at org.apache.solr.BaseDistributedSearchTestCase$ShardsRepeatRule$ShardsFixedStatement.callStatement(BaseDistributedSearchTestCase.java:1071)
at org.apache.solr.BaseDistributedSearchTestCase$ShardsRepeatRule$ShardsStatement.evaluate(BaseDistributedSearchTestCase.java:1042)
at com.carrotsearch.randomizedtesting.rules.SystemPropertiesRestoreRule$1.evaluate(SystemPropertiesRestoreRule.java:80)
at org.junit.rules.RunRules.evaluate(RunRules.java:20)
at org.apache.lucene.tests.util.TestRuleSetupTeardownChained$1.evaluate(TestRuleSetupTeardownChained.java:48)
at org.apache.lucene.tests.util.AbstractBeforeAfterRule$1.evaluate(AbstractBeforeAfterRule.java:43)
at org.apache.lucene.tests.util.TestRuleThreadAndTestName$1.evaluate(TestRuleThreadAndTestName.java:45)
at org.apache.lucene.tests.util.TestRuleIgnoreAfterMaxFailures$1.evaluate(TestRuleIgnoreAfterMaxFailures.java:60)
at org.apache.lucene.tests.util.TestRuleMarkFailure$1.evaluate(TestRuleMarkFailure.java:44)
at org.junit.rules.RunRules.evaluate(RunRules.java:20)
at com.carrotsearch.randomizedtesting.rules.StatementAdapter.evaluate(StatementAdapter.java:36)
at com.carrotsearch.randomizedtesting.ThreadLeakControl$StatementRunner.run(ThreadLeakControl.java:390)
at com.carrotsearch.randomizedtesting.ThreadLeakControl.forkTimeoutingTask(ThreadLeakControl.java:843)
at com.carrotsearch.randomizedtesting.ThreadLeakControl$3.evaluate(ThreadLeakControl.java:490)
at com.carrotsearch.randomizedtesting.RandomizedRunner.runSingleTest(RandomizedRunner.java:968)
at com.carrotsearch.randomizedtesting.RandomizedRunner$5.evaluate(RandomizedRunner.java:853)
at com.carrotsearch.randomizedtesting.RandomizedRunner$6.evaluate(RandomizedRunner.java:904)
at com.carrotsearch.randomizedtesting.RandomizedRunner$7.evaluate(RandomizedRunner.java:915)
at com.carrotsearch.randomizedtesting.rules.StatementAdapter.evaluate(StatementAdapter.java:36)
at com.carrotsearch.randomizedtesting.rules.StatementAdapter.evaluate(StatementAdapter.java:36)
at org.apache.lucene.tests.util.AbstractBeforeAfterRule$1.evaluate(AbstractBeforeAfterRule.java:43)
at com.carrotsearch.randomizedtesting.rules.SystemPropertiesRestoreRule$1.evaluate(SystemPropertiesRestoreRule.java:80)
at org.junit.rules.RunRules.evaluate(RunRules.java:20)
at org.apache.lucene.tests.util.AbstractBeforeAfterRule$1.evaluate(AbstractBeforeAfterRule.java:43)
at com.carrotsearch.randomizedtesting.rules.StatementAdapter.evaluate(StatementAdapter.java:36)
at org.apache.lucene.tests.util.TestRuleStoreClassName$1.evaluate(TestRuleStoreClassName.java:38)
at com.carrotsearch.randomizedtesting.rules.NoShadowingOrOverridesOnMethodsRule$1.evaluate(NoShadowingOrOverridesOnMethodsRule.java:40)
at com.carrotsearch.randomizedtesting.rules.NoShadowingOrOverridesOnMethodsRule$1.evaluate(NoShadowingOrOverridesOnMethodsRule.java:40)
at com.carrotsearch.randomizedtesting.rules.StatementAdapter.evaluate(StatementAdapter.java:36)
at com.carrotsearch.randomizedtesting.rules.StatementAdapter.evaluate(StatementAdapter.java:36)
at org.apache.lucene.tests.util.TestRuleAssertionsRequired$1.evaluate(TestRuleAssertionsRequired.java:53)
at org.apache.lucene.tests.util.AbstractBeforeAfterRule$1.evaluate(AbstractBeforeAfterRule.java:43)
at org.apache.lucene.tests.util.TestRuleMarkFailure$1.evaluate(TestRuleMarkFailure.java:44)
at org.apache.lucene.tests.util.TestRuleIgnoreAfterMaxFailures$1.evaluate(TestRuleIgnoreAfterMaxFailures.java:60)
at org.apache.lucene.tests.util.TestRuleIgnoreTestSuites$1.evaluate(TestRuleIgnoreTestSuites.java:47)
at org.junit.rules.RunRules.evaluate(RunRules.java:20)
at com.carrotsearch.randomizedtesting.rules.StatementAdapter.evaluate(StatementAdapter.java:36)
at com.carrotsearch.randomizedtesting.ThreadLeakControl$StatementRunner.run(ThreadLeakControl.java:390)
at com.carrotsearch.randomizedtesting.ThreadLeakControl.lambda$forkTimeoutingTask$0(ThreadLeakControl.java:850)
at java.base/java.lang.Thread.run(Thread.java:1583)
FAILED: org.apache.solr.cloud.RecoveryAfterSoftCommitTest.test
Error Message:
org.apache.solr.client.solrj.SolrServerException: java.nio.channels.ClosedChannelException
Stack Trace:
org.apache.solr.client.solrj.SolrServerException: java.nio.channels.ClosedChannelException
at __randomizedtesting.SeedInfo.seed([9FC7351F4FBF964C:17930AC5E143FBB4]:0)
at org.apache.solr.client.solrj.impl.LBSolrClient.doRequest(LBSolrClient.java:680)
at org.apache.solr.client.solrj.impl.LBSolrClient.request(LBSolrClient.java:582)
at org.apache.solr.client.solrj.impl.CloudSolrClient.sendRequest(CloudSolrClient.java:1088)
at org.apache.solr.client.solrj.impl.CloudSolrClient.requestWithRetryOnStaleState(CloudSolrClient.java:723)
at org.apache.solr.client.solrj.impl.CloudSolrClient.request(CloudSolrClient.java:645)
at org.apache.solr.client.solrj.SolrRequest.process(SolrRequest.java:314)
at org.apache.solr.client.solrj.SolrClient.add(SolrClient.java:167)
at org.apache.solr.client.solrj.SolrClient.add(SolrClient.java:132)
at org.apache.solr.client.solrj.SolrClient.add(SolrClient.java:148)
at org.apache.solr.cloud.RecoveryAfterSoftCommitTest.test(RecoveryAfterSoftCommitTest.java:106)
at java.base/jdk.internal.reflect.DirectMethodHandleAccessor.invoke(DirectMethodHandleAccessor.java:103)
at java.base/java.lang.reflect.Method.invoke(Method.java:580)
at com.carrotsearch.randomizedtesting.RandomizedRunner.invoke(RandomizedRunner.java:1780)
at com.carrotsearch.randomizedtesting.RandomizedRunner$8.evaluate(RandomizedRunner.java:959)
at com.carrotsearch.randomizedtesting.RandomizedRunner$9.evaluate(RandomizedRunner.java:995)
at com.carrotsearch.randomizedtesting.RandomizedRunner$10.evaluate(RandomizedRunner.java:1009)
at org.apache.solr.BaseDistributedSearchTestCase$ShardsRepeatRule$ShardsFixedStatement.callStatement(BaseDistributedSearchTestCase.java:1071)
at org.apache.solr.BaseDistributedSearchTestCase$ShardsRepeatRule$ShardsStatement.evaluate(BaseDistributedSearchTestCase.java:1042)
at com.carrotsearch.randomizedtesting.rules.SystemPropertiesRestoreRule$1.evaluate(SystemPropertiesRestoreRule.java:80)
at org.junit.rules.RunRules.evaluate(RunRules.java:20)
at org.apache.lucene.tests.util.TestRuleSetupTeardownChained$1.evaluate(TestRuleSetupTeardownChained.java:48)
at org.apache.lucene.tests.util.AbstractBeforeAfterRule$1.evaluate(AbstractBeforeAfterRule.java:43)
at org.apache.lucene.tests.util.TestRuleThreadAndTestName$1.evaluate(TestRuleThreadAndTestName.java:45)
at org.apache.lucene.tests.util.TestRuleIgnoreAfterMaxFailures$1.evaluate(TestRuleIgnoreAfterMaxFailures.java:60)
at org.apache.lucene.tests.util.TestRuleMarkFailure$1.evaluate(TestRuleMarkFailure.java:44)
at org.junit.rules.RunRules.evaluate(RunRules.java:20)
at com.carrotsearch.randomizedtesting.rules.StatementAdapter.evaluate(StatementAdapter.java:36)
at com.carrotsearch.randomizedtesting.ThreadLeakControl$StatementRunner.run(ThreadLeakControl.java:390)
at com.carrotsearch.randomizedtesting.ThreadLeakControl.forkTimeoutingTask(ThreadLeakControl.java:843)
at com.carrotsearch.randomizedtesting.ThreadLeakControl$3.evaluate(ThreadLeakControl.java:490)
at com.carrotsearch.randomizedtesting.RandomizedRunner.runSingleTest(RandomizedRunner.java:968)
at com.carrotsearch.randomizedtesting.RandomizedRunner$5.evaluate(RandomizedRunner.java:853)
at com.carrotsearch.randomizedtesting.RandomizedRunner$6.evaluate(RandomizedRunner.java:904)
at com.carrotsearch.randomizedtesting.RandomizedRunner$7.evaluate(RandomizedRunner.java:915)
at com.carrotsearch.randomizedtesting.rules.StatementAdapter.evaluate(StatementAdapter.java:36)
at com.carrotsearch.randomizedtesting.rules.StatementAdapter.evaluate(StatementAdapter.java:36)
at org.apache.lucene.tests.util.AbstractBeforeAfterRule$1.evaluate(AbstractBeforeAfterRule.java:43)
at com.carrotsearch.randomizedtesting.rules.SystemPropertiesRestoreRule$1.evaluate(SystemPropertiesRestoreRule.java:80)
at org.junit.rules.RunRules.evaluate(RunRules.java:20)
at org.apache.lucene.tests.util.AbstractBeforeAfterRule$1.evaluate(AbstractBeforeAfterRule.java:43)
at com.carrotsearch.randomizedtesting.rules.StatementAdapter.evaluate(StatementAdapter.java:36)
at org.apache.lucene.tests.util.TestRuleStoreClassName$1.evaluate(TestRuleStoreClassName.java:38)
at com.carrotsearch.randomizedtesting.rules.NoShadowingOrOverridesOnMethodsRule$1.evaluate(NoShadowingOrOverridesOnMethodsRule.java:40)
at com.carrotsearch.randomizedtesting.rules.NoShadowingOrOverridesOnMethodsRule$1.evaluate(NoShadowingOrOverridesOnMethodsRule.java:40)
at com.carrotsearch.randomizedtesting.rules.StatementAdapter.evaluate(StatementAdapter.java:36)
at com.carrotsearch.randomizedtesting.rules.StatementAdapter.evaluate(StatementAdapter.java:36)
at org.apache.lucene.tests.util.TestRuleAssertionsRequired$1.evaluate(TestRuleAssertionsRequired.java:53)
at org.apache.lucene.tests.util.AbstractBeforeAfterRule$1.evaluate(AbstractBeforeAfterRule.java:43)
at org.apache.lucene.tests.util.TestRuleMarkFailure$1.evaluate(TestRuleMarkFailure.java:44)
at org.apache.lucene.tests.util.TestRuleIgnoreAfterMaxFailures$1.evaluate(TestRuleIgnoreAfterMaxFailures.java:60)
at org.apache.lucene.tests.util.TestRuleIgnoreTestSuites$1.evaluate(TestRuleIgnoreTestSuites.java:47)
at org.junit.rules.RunRules.evaluate(RunRules.java:20)
at com.carrotsearch.randomizedtesting.rules.StatementAdapter.evaluate(StatementAdapter.java:36)
at com.carrotsearch.randomizedtesting.ThreadLeakControl$StatementRunner.run(ThreadLeakControl.java:390)
at com.carrotsearch.randomizedtesting.ThreadLeakControl.lambda$forkTimeoutingTask$0(ThreadLeakControl.java:850)
at java.base/java.lang.Thread.run(Thread.java:1583)
Caused by: java.nio.channels.ClosedChannelException
at org.eclipse.jetty.http2.HTTP2Session$StreamsState.onShutdown(HTTP2Session.java:2173)
at org.eclipse.jetty.http2.HTTP2Session.onShutdown(HTTP2Session.java:1206)
at org.eclipse.jetty.http2.HTTP2Connection$HTTP2Producer.produce(HTTP2Connection.java:441)
at org.eclipse.jetty.util.thread.strategy.AdaptiveExecutionStrategy.produceTask(AdaptiveExecutionStrategy.java:509)
at org.eclipse.jetty.util.thread.strategy.AdaptiveExecutionStrategy.tryProduce(AdaptiveExecutionStrategy.java:251)
at org.eclipse.jetty.util.thread.strategy.AdaptiveExecutionStrategy.produce(AdaptiveExecutionStrategy.java:196)
at org.eclipse.jetty.http2.HTTP2Connection.produce(HTTP2Connection.java:237)
at org.eclipse.jetty.http2.HTTP2Connection.onFillable(HTTP2Connection.java:165)
at org.eclipse.jetty.http2.HTTP2Connection$FillableCallback.succeeded(HTTP2Connection.java:592)
at org.eclipse.jetty.io.FillInterest.fillable(FillInterest.java:105)
at org.eclipse.jetty.io.SelectableChannelEndPoint$1.run(SelectableChannelEndPoint.java:54)
at org.eclipse.jetty.util.thread.Invocable.invokeNonBlocking(Invocable.java:225)
at org.eclipse.jetty.util.thread.strategy.AdaptiveExecutionStrategy.picRunTask(AdaptiveExecutionStrategy.java:473)
at org.eclipse.jetty.util.thread.strategy.AdaptiveExecutionStrategy.consumeTask(AdaptiveExecutionStrategy.java:399)
at org.eclipse.jetty.util.thread.strategy.AdaptiveExecutionStrategy.tryProduce(AdaptiveExecutionStrategy.java:255)
at org.eclipse.jetty.util.thread.strategy.AdaptiveExecutionStrategy.produce(AdaptiveExecutionStrategy.java:196)
at org.apache.solr.common.util.ExecutorUtil$MDCAwareThreadPoolExecutor.lambda$execute$0(ExecutorUtil.java:390)
at java.base/java.util.concurrent.ThreadPoolExecutor.runWorker(ThreadPoolExecutor.java:1144)
at java.base/java.util.concurrent.ThreadPoolExecutor$Worker.run(ThreadPoolExecutor.java:642)
... 1 more
Build Log:
[...truncated 22 lines...]
ERROR: Workspace has a .git repository, but it appears to be corrupt.
hudson.plugins.git.GitException: Command "git rev-parse --resolve-git-dir /home/jenkins/jenkins-agent/workspace/Solr/Solr-Test-main/.git" returned status code 128:
stdout:
stderr: fatal: not a gitdir '/home/jenkins/jenkins-agent/workspace/Solr/Solr-Test-main/.git'
at PluginClassLoader for git-client//org.jenkinsci.plugins.gitclient.CliGitAPIImpl.launchCommandIn(CliGitAPIImpl.java:2848)
at PluginClassLoader for git-client//org.jenkinsci.plugins.gitclient.CliGitAPIImpl.launchCommandIn(CliGitAPIImpl.java:2768)
at PluginClassLoader for git-client//org.jenkinsci.plugins.gitclient.CliGitAPIImpl.launchCommandIn(CliGitAPIImpl.java:2763)
at PluginClassLoader for git-client//org.jenkinsci.plugins.gitclient.CliGitAPIImpl.launchCommand(CliGitAPIImpl.java:2052)
at PluginClassLoader for git-client//org.jenkinsci.plugins.gitclient.CliGitAPIImpl.launchCommand(CliGitAPIImpl.java:2064)
at PluginClassLoader for git-client//org.jenkinsci.plugins.gitclient.CliGitAPIImpl.hasGitRepo(CliGitAPIImpl.java:404)
at PluginClassLoader for git-client//hudson.plugins.git.GitAPI.hasGitRepo(GitAPI.java:281)
at java.base/jdk.internal.reflect.NativeMethodAccessorImpl.invoke0(Native Method)
at java.base/jdk.internal.reflect.NativeMethodAccessorImpl.invoke(NativeMethodAccessorImpl.java:77)
at java.base/jdk.internal.reflect.DelegatingMethodAccessorImpl.invoke(DelegatingMethodAccessorImpl.java:43)
at java.base/java.lang.reflect.Method.invoke(Method.java:569)
at hudson.remoting.RemoteInvocationHandler$RPCRequest.perform(RemoteInvocationHandler.java:986)
at hudson.remoting.RemoteInvocationHandler$RPCRequest.call(RemoteInvocationHandler.java:961)
at hudson.remoting.RemoteInvocationHandler$RPCRequest.call(RemoteInvocationHandler.java:907)
at hudson.remoting.UserRequest.perform(UserRequest.java:225)
at hudson.remoting.UserRequest.perform(UserRequest.java:50)
at hudson.remoting.Request$2.run(Request.java:391)
at hudson.remoting.InterceptingExecutorService.lambda$wrap$0(InterceptingExecutorService.java:81)
at java.base/java.util.concurrent.FutureTask.run(FutureTask.java:264)
at java.base/java.util.concurrent.ThreadPoolExecutor.runWorker(ThreadPoolExecutor.java:1136)
at java.base/java.util.concurrent.ThreadPoolExecutor$Worker.run(ThreadPoolExecutor.java:635)
at java.base/java.lang.Thread.run(Thread.java:840)
Cloning the remote Git repository
Cloning repository https://gitbox.apache.org/repos/asf/solr.git
> git init /home/jenkins/jenkins-agent/workspace/Solr/Solr-Test-main # timeout=10
Fetching upstream changes from https://gitbox.apache.org/repos/asf/solr.git
> git --version # timeout=10
> git --version # 'git version 2.43.0'
> git fetch --tags --force --progress -- https://gitbox.apache.org/repos/asf/solr.git +refs/heads/*:refs/remotes/origin/* # timeout=10
> git config remote.origin.url https://gitbox.apache.org/repos/asf/solr.git # timeout=10
> git config --add remote.origin.fetch +refs/heads/*:refs/remotes/origin/* # timeout=10
Avoid second fetch
> git rev-parse refs/remotes/origin/main^{commit} # timeout=10
Checking out Revision b47aacaec82be9bef6e97643503dff45122321ba (refs/remotes/origin/main)
> git config core.sparsecheckout # timeout=10
> git checkout -f b47aacaec82be9bef6e97643503dff45122321ba # timeout=10
> git branch -a -v --no-abbrev # timeout=10
> git checkout -b main b47aacaec82be9bef6e97643503dff45122321ba # timeout=10
Commit message: "Simplify SolrRequest path usage: prefer ctor not setPath (#4689)"
> git rev-list --no-walk bb52661e60749aa92588ab772d02febe585af4a1 # timeout=10
No emails were triggered.
provisioning config files...
copy managed file [gradle.properties] to file:/home/jenkins/jenkins-agent/workspace/Solr/Solr-Test-main/gradle.properties
[Gradle] - Launching build.
[Solr-Test-main] $ /home/jenkins/jenkins-agent/workspace/Solr/Solr-Test-main/gradlew -Dtests.haltonfailure=false -Dtests.badapples=false --continue test
Downloading gradle-wrapper.jar from https://raw.githubusercontent.com/gradle/gradle/v8.10.2/gradle/wrapper/gradle-wrapper.jar
To honour the JVM settings for this build a single-use Daemon process will be forked. For more on this, please refer to https://docs.gradle.org/9.6.0/userguide/gradle_daemon.html#sec:disabling_the_daemon in the Gradle documentation.
Daemon will be stopped at the end of the build
> Task :build-infra:compileJava
Note: /home/jenkins/jenkins-agent/workspace/Solr/Solr-Test-main/build-tools/build-infra/src/main/java/org/apache/lucene/gradle/Checksum.java uses or overrides a deprecated API.
Note: Recompile with -Xlint:deprecation for details.
> Task :build-infra:pluginDescriptors
> Task :build-infra:processResources
> Task :build-infra:classes
> Task :build-infra:jar
> Task :gitStatus
> Task :checkJdkInternalsExportedToGradle
> Task :solr:api:compileJava
Note: Some input files use or override a deprecated API.
Note: Recompile with -Xlint:deprecation for details.
> Task :solr:api:processResources NO-SOURCE
> Task :solr:api:classes
> Task :solr:api:jar
> Task :randomizationInfo
Running tests with randomization seed: tests.seed=9FC7351F4FBF964C
> Task :solr:api:resolve
SLF4J(W): No SLF4J providers were found.
SLF4J(W): Defaulting to no-operation (NOP) logger implementation
SLF4J(W): See https://www.slf4j.org/codes.html#noProviders for further details.
> Task :solr:api:processTestResources
> Task :solr:core:processResources
> Task :solr:solrj:processResources
> Task :solr:solrj-jetty:processResources NO-SOURCE
> Task :solr:solrj-streaming:processResources
> Task :solr:solrj-zookeeper:processResources NO-SOURCE
> Task :solr:test-framework:processResources
> Task :solr:benchmark:processResources
> Task :solr:benchmark:processTestResources
> Task :solr:core:processTestResources
> Task :solr:modules:analysis-extras:processResources NO-SOURCE
> Task :solr:cross-dc-manager:processResources NO-SOURCE
> Task :solr:cross-dc-manager:processTestResources
> Task :solr:modules:cross-dc:processResources NO-SOURCE
> Task :solr:modules:opentelemetry:processResources NO-SOURCE
> Task :solr:server:compileJava SKIPPED
> Task :solr:server:processResources NO-SOURCE
> Task :solr:server:classes UP-TO-DATE
> Task :solr:server:compileTestJava NO-SOURCE
> Task :solr:server:processTestResources NO-SOURCE
> Task :solr:server:testClasses UP-TO-DATE
> Task :solr:server:test NO-SOURCE
> Task :solr:server:wipeTaskTemp
> Task :solr:solr-ref-guide:compileJava NO-SOURCE
> Task :solr:solr-ref-guide:processResources NO-SOURCE
> Task :solr:solr-ref-guide:classes UP-TO-DATE
> Task :solr:solr-ref-guide:copySolrjTestResources
> Task :solr:solr-ref-guide:processTestResources NO-SOURCE
> Task :solr:modules:sql:processResources
> Task :solr:solrj:processTestResources
> Task :solr:solrj-jetty:processTestResources
> Task :solr:solrj-streaming:processTestResources
> Task :solr:solrj-zookeeper:processTestResources
> Task :solr:test-framework:processTestResources
> Task :solr:webapp:processResources NO-SOURCE
> Task :solr:webapp:processTestResources NO-SOURCE
> Task :solr:modules:analysis-extras:processTestResources
> Task :solr:modules:clustering:processResources NO-SOURCE
> Task :solr:modules:clustering:processTestResources
> Task :solr:modules:cross-dc:processTestResources
> Task :solr:modules:cuvs:processResources NO-SOURCE
> Task :solr:modules:cuvs:processTestResources
> Task :solr:modules:extraction:processResources
> Task :solr:modules:extraction:processTestResources
> Task :solr:modules:gcs-repository:processResources NO-SOURCE
> Task :solr:modules:gcs-repository:processTestResources
> Task :solr:modules:jwt-auth:processResources NO-SOURCE
> Task :solr:modules:jwt-auth:processTestResources
> Task :solr:modules:langid:processResources NO-SOURCE
> Task :solr:modules:langid:processTestResources
> Task :solr:modules:language-models:processResources NO-SOURCE
> Task :solr:modules:language-models:processTestResources
> Task :solr:modules:ltr:processResources NO-SOURCE
> Task :solr:modules:ltr:processTestResources
> Task :solr:modules:opentelemetry:processTestResources
> Task :solr:modules:s3-repository:processResources NO-SOURCE
> Task :solr:modules:s3-repository:processTestResources
> Task :solr:modules:scripting:processResources NO-SOURCE
> Task :solr:modules:scripting:processTestResources
> Task :solr:modules:sql:copySolrCoreTestResources
> Task :solr:modules:sql:processTestResources
> Task :solr:solrj:openApiGenerate
Cleaned up output directory /home/jenkins/jenkins-agent/workspace/Solr/Solr-Test-main/solr/solrj/build/generated before code generation.
[openApiGenerate] Worker isolation: classloader (fast startup, but generator classes accumulate in Gradle daemon Metaspace - consider workerIsolation = "process" if you hit metaspace pressure)
No application/json content media type found in response. Response examples can currently only be generated for application/json media type.
############################################################################################
# Thanks for using OpenAPI Generator. #
# We appreciate your support! Please consider donation to help us maintain this project. #
# https://opencollective.com/openapi_generator/donate #
############################################################################################
Successfully generated code to /home/jenkins/jenkins-agent/workspace/Solr/Solr-Test-main/solr/solrj/build/generated
> Task :solr:solrj:generatedSpotlessHelper
> Task :solr:solrj:generatedSpotless
> Task :solr:solrj:compileJava
Note: Some input files use or override a deprecated API.
Note: Recompile with -Xlint:deprecation for details.
> Task :solr:solrj-jetty:compileJava
Note: /home/jenkins/jenkins-agent/workspace/Solr/Solr-Test-main/solr/solrj-jetty/src/java/org/apache/solr/client/solrj/jetty/HttpJettySolrClient.java uses or overrides a deprecated API.
Note: Recompile with -Xlint:deprecation for details.
> Task :solr:solrj-streaming:compileJava
Note: Some input files use or override a deprecated API.
Note: Recompile with -Xlint:deprecation for details.
> Task :solr:solrj-zookeeper:compileJava
Note: Some input files use or override a deprecated API.
Note: Recompile with -Xlint:deprecation for details.
> Task :solr:core:compileJava
Note: Some input files use or override a deprecated API.
Note: Recompile with -Xlint:deprecation for details.
> Task :solr:test-framework:compileJava
Note: Some input files use or override a deprecated API.
Note: Recompile with -Xlint:deprecation for details.
> Task :solr:api:compileTestJava
> Task :solr:api:testClasses
> Task :solr:core:classes
> Task :solr:core:jar
> Task :solr:solrj:classes
> Task :solr:solrj:jar
> Task :solr:solrj-jetty:classes
> Task :solr:solrj-jetty:jar
> Task :solr:solrj-streaming:classes
> Task :solr:solrj-streaming:jar
> Task :solr:solrj-zookeeper:classes
> Task :solr:solrj-zookeeper:jar
> Task :solr:test-framework:classes
> Task :solr:test-framework:jar
> Task :solr:api:test
WARNING: Using incubator modules: jdk.incubator.vector
WARNING: Using incubator modules: jdk.incubator.vector
WARNING: A command line option has enabled the Security Manager
WARNING: The Security Manager is deprecated and will be removed in a future release
WARNING: A command line option has enabled the Security Manager
WARNING: The Security Manager is deprecated and will be removed in a future release
java.security.policy: error adding Permission, java.net.URLPermission:
java.util.ServiceConfigurationError: Locale provider adapter "CLDR"cannot be instantiated.
java.security.policy: error adding Permission, java.net.URLPermission:
java.util.ServiceConfigurationError: Locale provider adapter "CLDR"cannot be instantiated.
java.security.policy: error adding Permission, java.net.URLPermission:
java.util.ServiceConfigurationError: Locale provider adapter "CLDR"cannot be instantiated.
java.security.policy: error adding Permission, java.net.URLPermission:
java.util.ServiceConfigurationError: Locale provider adapter "CLDR"cannot be instantiated.
java.security.policy: error adding Permission, java.net.URLPermission:
java.util.ServiceConfigurationError: Locale provider adapter "CLDR"cannot be instantiated.
java.security.policy: error adding Permission, java.net.URLPermission:
java.util.ServiceConfigurationError: Locale provider adapter "CLDR"cannot be instantiated.
java.security.policy: error adding Permission, java.net.URLPermission:
java.util.ServiceConfigurationError: Locale provider adapter "CLDR"cannot be instantiated.
java.security.policy: error adding Permission, java.net.URLPermission:
java.util.ServiceConfigurationError: Locale provider adapter "CLDR"cannot be instantiated.
java.security.policy: error adding Permission, java.net.URLPermission:
java.util.ServiceConfigurationError: Locale provider adapter "CLDR"cannot be instantiated.
java.security.policy: error adding Permission, java.net.URLPermission:
java.util.ServiceConfigurationError: Locale provider adapter "CLDR"cannot be instantiated.
:solr:api:test (SUCCESS): 19 test(s)
> Task :solr:api:wipeTaskTemp
> Task :solr:benchmark:compileJava
Note: /home/jenkins/jenkins-agent/workspace/Solr/Solr-Test-main/solr/benchmark/src/java/org/apache/solr/bench/lifecycle/SolrStartup.java uses or overrides a deprecated API.
Note: Recompile with -Xlint:deprecation for details.
> Task :solr:benchmark:classes
> Task :solr:benchmark:compileTestJava
> Task :solr:benchmark:testClasses
> Task :solr:benchmark:test
WARNING: Using incubator modules: jdk.incubator.vector
WARNING: Using incubator modules: jdk.incubator.vector
WARNING: Using incubator modules: jdk.incubator.vector
WARNING: A command line option has enabled the Security Manager
WARNING: The Security Manager is deprecated and will be removed in a future release
WARNING: A command line option has enabled the Security Manager
WARNING: The Security Manager is deprecated and will be removed in a future release
WARNING: A command line option has enabled the Security Manager
WARNING: The Security Manager is deprecated and will be removed in a future release
java.security.policy: error adding Permission, java.net.URLPermission:
java.util.ServiceConfigurationError: Locale provider adapter "CLDR"cannot be instantiated.
java.security.policy: error adding Permission, java.net.URLPermission:
java.util.ServiceConfigurationError: Locale provider adapter "CLDR"cannot be instantiated.
java.security.policy: error adding Permission, java.net.URLPermission:
java.util.ServiceConfigurationError: Locale provider adapter "CLDR"cannot be instantiated.
java.security.policy: error adding Permission, java.net.URLPermission:
java.util.ServiceConfigurationError: Locale provider adapter "CLDR"cannot be instantiated.
java.security.policy: error adding Permission, java.net.URLPermission:
java.util.ServiceConfigurationError: Locale provider adapter "CLDR"cannot be instantiated.
java.security.policy: error adding Permission, java.net.URLPermission:
java.util.ServiceConfigurationError: Locale provider adapter "CLDR"cannot be instantiated.
java.security.policy: error adding Permission, java.net.URLPermission:
java.util.ServiceConfigurationError: Locale provider adapter "CLDR"cannot be instantiated.
java.security.policy: error adding Permission, java.net.URLPermission:
java.util.ServiceConfigurationError: Locale provider adapter "CLDR"cannot be instantiated.
java.security.policy: error adding Permission, java.net.URLPermission:
java.util.ServiceConfigurationError: Locale provider adapter "CLDR"cannot be instantiated.
java.security.policy: error adding Permission, java.net.URLPermission:
java.util.ServiceConfigurationError: Locale provider adapter "CLDR"cannot be instantiated.
java.security.policy: error adding Permission, java.net.URLPermission:
java.util.ServiceConfigurationError: Locale provider adapter "CLDR"cannot be instantiated.
java.security.policy: error adding Permission, java.net.URLPermission:
java.util.ServiceConfigurationError: Locale provider adapter "CLDR"cannot be instantiated.
java.security.policy: error adding Permission, java.net.URLPermission:
java.util.ServiceConfigurationError: Locale provider adapter "CLDR"cannot be instantiated.
java.security.policy: error adding Permission, java.net.URLPermission:
java.util.ServiceConfigurationError: Locale provider adapter "CLDR"cannot be instantiated.
java.security.policy: error adding Permission, java.net.URLPermission:
java.util.ServiceConfigurationError: Locale provider adapter "CLDR"cannot be instantiated.
:solr:benchmark:test (SUCCESS): 10 test(s)
> Task :solr:benchmark:wipeTaskTemp
> Task :solr:core:compileTestJava
Note: Some input files use or override a deprecated API.
Note: Recompile with -Xlint:deprecation for details.
> Task :solr:core:testClasses
> Task :solr:modules:analysis-extras:compileJava
Note: /home/jenkins/jenkins-agent/workspace/Solr/Solr-Test-main/solr/modules/analysis-extras/src/java/org/apache/solr/schema/ICUCollationField.java uses or overrides a deprecated API.
Note: Recompile with -Xlint:deprecation for details.
> Task :solr:modules:analysis-extras:classes
> Task :solr:modules:analysis-extras:jar
> Task :solr:core:test
WARNING: Using incubator modules: jdk.incubator.vector
WARNING: Using incubator modules: jdk.incubator.vector
WARNING: Using incubator modules: jdk.incubator.vector
WARNING: Using incubator modules: jdk.incubator.vector
WARNING: A command line option has enabled the Security Manager
WARNING: The Security Manager is deprecated and will be removed in a future release
WARNING: A command line option has enabled the Security Manager
WARNING: The Security Manager is deprecated and will be removed in a future release
WARNING: A command line option has enabled the Security Manager
WARNING: The Security Manager is deprecated and will be removed in a future release
WARNING: A command line option has enabled the Security Manager
WARNING: The Security Manager is deprecated and will be removed in a future release
java.security.policy: error adding Permission, java.net.URLPermission:
java.util.ServiceConfigurationError: Locale provider adapter "CLDR"cannot be instantiated.
java.security.policy: error adding Permission, java.net.URLPermission:
java.util.ServiceConfigurationError: Locale provider adapter "CLDR"cannot be instantiated.
java.security.policy: error adding Permission, java.net.URLPermission:
java.util.ServiceConfigurationError: Locale provider adapter "CLDR"cannot be instantiated.
java.security.policy: error adding Permission, java.net.URLPermission:
java.util.ServiceConfigurationError: Locale provider adapter "CLDR"cannot be instantiated.
java.security.policy: error adding Permission, java.net.URLPermission:
java.util.ServiceConfigurationError: Locale provider adapter "CLDR"cannot be instantiated.
java.security.policy: error adding Permission, java.net.URLPermission:
java.util.ServiceConfigurationError: Locale provider adapter "CLDR"cannot be instantiated.
java.security.policy: error adding Permission, java.net.URLPermission:
java.util.ServiceConfigurationError: Locale provider adapter "CLDR"cannot be instantiated.
java.security.policy: error adding Permission, java.net.URLPermission:
java.util.ServiceConfigurationError: Locale provider adapter "CLDR"cannot be instantiated.
java.security.policy: error adding Permission, java.net.URLPermission:
java.util.ServiceConfigurationError: Locale provider adapter "CLDR"cannot be instantiated.
java.security.policy: error adding Permission, java.net.URLPermission:
java.util.ServiceConfigurationError: Locale provider adapter "CLDR"cannot be instantiated.
java.security.policy: error adding Permission, java.net.URLPermission:
java.util.ServiceConfigurationError: Locale provider adapter "CLDR"cannot be instantiated.
java.security.policy: error adding Permission, java.net.URLPermission:
java.util.ServiceConfigurationError: Locale provider adapter "CLDR"cannot be instantiated.
java.security.policy: error adding Permission, java.net.URLPermission:
java.util.ServiceConfigurationError: Locale provider adapter "CLDR"cannot be instantiated.
java.security.policy: error adding Permission, java.net.URLPermission:
java.util.ServiceConfigurationError: Locale provider adapter "CLDR"cannot be instantiated.
java.security.policy: error adding Permission, java.net.URLPermission:
java.util.ServiceConfigurationError: Locale provider adapter "CLDR"cannot be instantiated.
java.security.policy: error adding Permission, java.net.URLPermission:
java.util.ServiceConfigurationError: Locale provider adapter "CLDR"cannot be instantiated.
java.security.policy: error adding Permission, java.net.URLPermission:
java.util.ServiceConfigurationError: Locale provider adapter "CLDR"cannot be instantiated.
java.security.policy: error adding Permission, java.net.URLPermission:
java.util.ServiceConfigurationError: Locale provider adapter "CLDR"cannot be instantiated.
java.security.policy: error adding Permission, java.net.URLPermission:
java.util.ServiceConfigurationError: Locale provider adapter "CLDR"cannot be instantiated.
java.security.policy: error adding Permission, java.net.URLPermission:
java.util.ServiceConfigurationError: Locale provider adapter "CLDR"cannot be instantiated.
TestDistributedGrouping > test FAILED
java.lang.AssertionError: header: {partialResults=true, partialResultsDetails=Limits exceeded! ([handleResponses next stage:EXECUTE_QUERY] Limit(s) exceeded prior to delayingSearchComponent in [delayingSearchComponent, query, facet, facet_module, mlt, highlight, stats, expand, terms, debug]): Query limits: [TimeAllowedLimit:LIMIT EXCEEDED], status=0, QTime=283}
at __randomizedtesting.SeedInfo.seed([9FC7351F4FBF964C:17930AC5E143FBB4]:0)
at org.junit.Assert.fail(Assert.java:89)
at org.junit.Assert.assertTrue(Assert.java:42)
at org.junit.Assert.assertFalse(Assert.java:65)
at org.apache.solr.TestDistributedGrouping.test(TestDistributedGrouping.java:1306)
at java.base/jdk.internal.reflect.DirectMethodHandleAccessor.invoke(DirectMethodHandleAccessor.java:103)
at java.base/java.lang.reflect.Method.invoke(Method.java:580)
at com.carrotsearch.randomizedtesting.RandomizedRunner.invoke(RandomizedRunner.java:1780)
at com.carrotsearch.randomizedtesting.RandomizedRunner$8.evaluate(RandomizedRunner.java:959)
at com.carrotsearch.randomizedtesting.RandomizedRunner$9.evaluate(RandomizedRunner.java:995)
at com.carrotsearch.randomizedtesting.RandomizedRunner$10.evaluate(RandomizedRunner.java:1009)
at org.apache.solr.BaseDistributedSearchTestCase$ShardsRepeatRule$ShardsFixedStatement.callStatement(BaseDistributedSearchTestCase.java:1071)
at org.apache.solr.BaseDistributedSearchTestCase$ShardsRepeatRule$ShardsStatement.evaluate(BaseDistributedSearchTestCase.java:1042)
at com.carrotsearch.randomizedtesting.rules.SystemPropertiesRestoreRule$1.evaluate(SystemPropertiesRestoreRule.java:80)
at org.junit.rules.RunRules.evaluate(RunRules.java:20)
at org.apache.lucene.tests.util.TestRuleSetupTeardownChained$1.evaluate(TestRuleSetupTeardownChained.java:48)
at org.apache.lucene.tests.util.AbstractBeforeAfterRule$1.evaluate(AbstractBeforeAfterRule.java:43)
at org.apache.lucene.tests.util.TestRuleThreadAndTestName$1.evaluate(TestRuleThreadAndTestName.java:45)
at org.apache.lucene.tests.util.TestRuleIgnoreAfterMaxFailures$1.evaluate(TestRuleIgnoreAfterMaxFailures.java:60)
at org.apache.lucene.tests.util.TestRuleMarkFailure$1.evaluate(TestRuleMarkFailure.java:44)
at org.junit.rules.RunRules.evaluate(RunRules.java:20)
at com.carrotsearch.randomizedtesting.rules.StatementAdapter.evaluate(StatementAdapter.java:36)
at com.carrotsearch.randomizedtesting.ThreadLeakControl$StatementRunner.run(ThreadLeakControl.java:390)
at com.carrotsearch.randomizedtesting.ThreadLeakControl.forkTimeoutingTask(ThreadLeakControl.java:843)
at com.carrotsearch.randomizedtesting.ThreadLeakControl$3.evaluate(ThreadLeakControl.java:490)
at com.carrotsearch.randomizedtesting.RandomizedRunner.runSingleTest(RandomizedRunner.java:968)
at com.carrotsearch.randomizedtesting.RandomizedRunner$5.evaluate(RandomizedRunner.java:853)
at com.carrotsearch.randomizedtesting.RandomizedRunner$6.evaluate(RandomizedRunner.java:904)
at com.carrotsearch.randomizedtesting.RandomizedRunner$7.evaluate(RandomizedRunner.java:915)
at com.carrotsearch.randomizedtesting.rules.StatementAdapter.evaluate(StatementAdapter.java:36)
at com.carrotsearch.randomizedtesting.rules.StatementAdapter.evaluate(StatementAdapter.java:36)
at org.apache.lucene.tests.util.AbstractBeforeAfterRule$1.evaluate(AbstractBeforeAfterRule.java:43)
at com.carrotsearch.randomizedtesting.rules.SystemPropertiesRestoreRule$1.evaluate(SystemPropertiesRestoreRule.java:80)
at org.junit.rules.RunRules.evaluate(RunRules.java:20)
at org.apache.lucene.tests.util.AbstractBeforeAfterRule$1.evaluate(AbstractBeforeAfterRule.java:43)
at com.carrotsearch.randomizedtesting.rules.StatementAdapter.evaluate(StatementAdapter.java:36)
at org.apache.lucene.tests.util.TestRuleStoreClassName$1.evaluate(TestRuleStoreClassName.java:38)
at com.carrotsearch.randomizedtesting.rules.NoShadowingOrOverridesOnMethodsRule$1.evaluate(NoShadowingOrOverridesOnMethodsRule.java:40)
at com.carrotsearch.randomizedtesting.rules.NoShadowingOrOverridesOnMethodsRule$1.evaluate(NoShadowingOrOverridesOnMethodsRule.java:40)
at com.carrotsearch.randomizedtesting.rules.StatementAdapter.evaluate(StatementAdapter.java:36)
at com.carrotsearch.randomizedtesting.rules.StatementAdapter.evaluate(StatementAdapter.java:36)
at org.apache.lucene.tests.util.TestRuleAssertionsRequired$1.evaluate(TestRuleAssertionsRequired.java:53)
at org.apache.lucene.tests.util.AbstractBeforeAfterRule$1.evaluate(AbstractBeforeAfterRule.java:43)
at org.apache.lucene.tests.util.TestRuleMarkFailure$1.evaluate(TestRuleMarkFailure.java:44)
at org.apache.lucene.tests.util.TestRuleIgnoreAfterMaxFailures$1.evaluate(TestRuleIgnoreAfterMaxFailures.java:60)
at org.apache.lucene.tests.util.TestRuleIgnoreTestSuites$1.evaluate(TestRuleIgnoreTestSuites.java:47)
at org.junit.rules.RunRules.evaluate(RunRules.java:20)
at com.carrotsearch.randomizedtesting.rules.StatementAdapter.evaluate(StatementAdapter.java:36)
at com.carrotsearch.randomizedtesting.ThreadLeakControl$StatementRunner.run(ThreadLeakControl.java:390)
at com.carrotsearch.randomizedtesting.ThreadLeakControl.lambda$forkTimeoutingTask$0(ThreadLeakControl.java:850)
at java.base/java.lang.Thread.run(Thread.java:1583)
org.apache.solr.TestDistributedGrouping > test suite's output saved to /home/jenkins/jenkins-agent/workspace/Solr/Solr-Test-main/solr/core/build/test-results/test/outputs/OUTPUT-org.apache.solr.TestDistributedGrouping.txt, copied below:
2> 11678 INFO (SUITE-TestDistributedGrouping-seed#[9FC7351F4FBF964C]-worker) [] o.a.s.SolrTestCase Setting 'solr.configset.default.confdir' system property to test-framework derived value of '/home/jenkins/jenkins-agent/workspace/Solr/Solr-Test-main/solr/server/solr/configsets/_default/conf'
2> 11679 INFO (SUITE-TestDistributedGrouping-seed#[9FC7351F4FBF964C]-worker) [] o.a.s.SolrTestCaseJ4 SecureRandom sanity checks: test.solr.allowed.securerandom=null & java.security.egd=file:/dev/./urandom
2> 11679 INFO (SUITE-TestDistributedGrouping-seed#[9FC7351F4FBF964C]-worker) [] o.a.s.u.ErrorLogMuter Closing ErrorLogMuter-regex-16 after muting 0 log messages
2> 11679 INFO (SUITE-TestDistributedGrouping-seed#[9FC7351F4FBF964C]-worker) [] o.a.s.u.ErrorLogMuter Creating ErrorLogMuter-regex-17 for ERROR logs matching regex: ignore_exception
2> 11680 INFO (SUITE-TestDistributedGrouping-seed#[9FC7351F4FBF964C]-worker) [] o.a.s.SolrTestCaseJ4 Created dataDir: /home/jenkins/jenkins-agent/workspace/Solr/Solr-Test-main/solr/core/build/tmp/tests-tmp/org.apache.solr.TestDistributedGrouping_9FC7351F4FBF964C-001/data-dir-5-001
2> 11680 WARN (SUITE-TestDistributedGrouping-seed#[9FC7351F4FBF964C]-worker) [] o.a.s.SolrTestCaseJ4 startTrackingSearchers: numOpens=4 numCloses=4
2> 11680 INFO (SUITE-TestDistributedGrouping-seed#[9FC7351F4FBF964C]-worker) [] o.a.s.SolrTestCaseJ4 Using TrieFields (NUMERIC_POINTS_SYSPROP=false) w/NUMERIC_DOCVALUES_SYSPROP=false
2> 11682 WARN (SUITE-TestDistributedGrouping-seed#[9FC7351F4FBF964C]-worker) [] o.e.j.u.r.ResourceFactory Leaked /home/jenkins/jenkins-agent/workspace/Solr/Solr-Test-main/solr/test-framework/build/libs/solr-test-framework-11.0.0-SNAPSHOT.jar for jar:file:///home/jenkins/jenkins-agent/workspace/Solr/Solr-Test-main/solr/test-framework/build/libs/solr-test-framework-11.0.0-SNAPSHOT.jar!/SSLTestConfig.hostname-and-ip-missmatch.keystore
2> 11682 INFO (SUITE-TestDistributedGrouping-seed#[9FC7351F4FBF964C]-worker) [] o.a.s.SolrTestCaseJ4 Randomized ssl (false) and clientAuth (false) via: @org.apache.solr.util.RandomizeSSL(reason="", value=0.0/0.0, ssl=0.0/0.0, clientAuth=0.0/0.0)
2> 11682 INFO (SUITE-TestDistributedGrouping-seed#[9FC7351F4FBF964C]-worker) [] o.a.s.SolrTestCaseJ4 ####initCore
2> 11686 INFO (SUITE-TestDistributedGrouping-seed#[9FC7351F4FBF964C]-worker) [] o.a.s.c.SolrResourceLoader Added 2 libs to classloader, from paths: [/home/jenkins/jenkins-agent/workspace/Solr/Solr-Test-main/solr/core/build/resources/test/solr/collection1/lib, /home/jenkins/jenkins-agent/workspace/Solr/Solr-Test-main/solr/core/build/resources/test/solr/collection1/lib/classes]
2> 11723 INFO (SUITE-TestDistributedGrouping-seed#[9FC7351F4FBF964C]-worker) [] o.a.s.c.SolrConfig Using Lucene MatchVersion: 10.4.0
2> 11728 INFO (SUITE-TestDistributedGrouping-seed#[9FC7351F4FBF964C]-worker) [] o.a.s.s.IndexSchema Schema name=test
2> 11731 WARN (SUITE-TestDistributedGrouping-seed#[9FC7351F4FBF964C]-worker) [] o.a.s.D.s.TrieIntField Solr loaded a deprecated plugin/analysis class [solr.TrieIntField]. Please consult documentation how to replace it accordingly.
2> 11732 WARN (SUITE-TestDistributedGrouping-seed#[9FC7351F4FBF964C]-worker) [] o.a.s.D.s.TrieFloatField Solr loaded a deprecated plugin/analysis class [solr.TrieFloatField]. Please consult documentation how to replace it accordingly.
2> 11733 WARN (SUITE-TestDistributedGrouping-seed#[9FC7351F4FBF964C]-worker) [] o.a.s.D.s.TrieLongField Solr loaded a deprecated plugin/analysis class [solr.TrieLongField]. Please consult documentation how to replace it accordingly.
2> 11734 WARN (SUITE-TestDistributedGrouping-seed#[9FC7351F4FBF964C]-worker) [] o.a.s.D.s.TrieDoubleField Solr loaded a deprecated plugin/analysis class [solr.TrieDoubleField]. Please consult documentation how to replace it accordingly.
2> 11736 WARN (SUITE-TestDistributedGrouping-seed#[9FC7351F4FBF964C]-worker) [] o.a.s.D.s.TrieDateField Solr loaded a deprecated plugin/analysis class [solr.TrieDateField]. Please consult documentation how to replace it accordingly.
2> 11753 INFO (SUITE-TestDistributedGrouping-seed#[9FC7351F4FBF964C]-worker) [] o.a.s.s.IndexSchema Loaded schema test/1.0 with uniqueid field id
2> 12374 INFO (SUITE-TestDistributedGrouping-seed#[9FC7351F4FBF964C]-worker) [] o.a.s.c.OpenTelemetryConfigurator OpenTelemetry tracer enabled with simple propagation only.
2> 12386 WARN (SUITE-TestDistributedGrouping-seed#[9FC7351F4FBF964C]-worker) [] o.a.s.c.CoreContainer Not all security plugins configured! authentication=disabled authorization=disabled. Solr is only as secure as you make it. Consider configuring authentication/authorization before exposing Solr to users internal or external. See https://s.apache.org/solrsecurity for more info
2> 12394 INFO (coreLoadExecutor-141-thread-1) [ x:collection1] o.a.s.c.SolrResourceLoader Added 2 libs to classloader, from paths: [/home/jenkins/jenkins-agent/workspace/Solr/Solr-Test-main/solr/core/build/resources/test/solr/collection1/lib, /home/jenkins/jenkins-agent/workspace/Solr/Solr-Test-main/solr/core/build/resources/test/solr/collection1/lib/classes]
2> 12410 INFO (coreLoadExecutor-141-thread-1) [ x:collection1] o.a.s.c.SolrConfig Using Lucene MatchVersion: 10.4.0
2> 12415 INFO (coreLoadExecutor-141-thread-1) [ x:collection1] o.a.s.s.IndexSchema Schema name=test
2> 12433 INFO (coreLoadExecutor-141-thread-1) [ x:collection1] o.a.s.s.IndexSchema Loaded schema test/1.0 with uniqueid field id
2> 12444 INFO (coreLoadExecutor-141-thread-1) [ x:collection1] o.a.s.c.CoreContainer Creating SolrCore 'collection1' using configuration from instancedir /home/jenkins/jenkins-agent/workspace/Solr/Solr-Test-main/solr/core/build/resources/test/solr/collection1
2> 12444 INFO (coreLoadExecutor-141-thread-1) [ x:collection1] o.a.s.c.SolrCore Opening new SolrCore at [/home/jenkins/jenkins-agent/workspace/Solr/Solr-Test-main/solr/core/build/resources/test/solr/collection1], dataDir=[/home/jenkins/jenkins-agent/workspace/Solr/Solr-Test-main/solr/core/build/tmp/tests-tmp/org.apache.solr.TestDistributedGrouping_9FC7351F4FBF964C-001/data-dir-5-001/]
2> 12445 INFO (coreLoadExecutor-141-thread-1) [ x:collection1] o.a.s.u.RandomMergePolicy RandomMergePolicy wrapping class org.apache.lucene.index.LogDocMergePolicy: [LogDocMergePolicy: minMergeSize=1000, mergeFactor=16, maxMergeSize=9223372036854775807, maxMergeSizeForForcedMerge=9223372036854775807, calibrateSizeByDeletes=false, maxMergeDocs=2147483647, maxCFSSegmentSizeMB=8.796093022208E12, noCFSRatio=0.25036991981108403]
2> 12476 INFO (coreLoadExecutor-141-thread-1) [ x:collection1] o.a.s.j.SolrRequestAuthorizer Creating a new SolrRequestAuthorizer
2> 12483 INFO (coreLoadExecutor-141-thread-1) [ x:collection1] o.a.s.u.CommitTracker Hard AutoCommit: disabled
2> 12483 INFO (coreLoadExecutor-141-thread-1) [ x:collection1] o.a.s.u.CommitTracker Soft AutoCommit: disabled
2> 12484 INFO (coreLoadExecutor-141-thread-1) [ x:collection1] o.a.s.u.RandomMergePolicy RandomMergePolicy wrapping class org.apache.lucene.index.LogByteSizeMergePolicy: [LogByteSizeMergePolicy: minMergeSize=16777216, mergeFactor=40, maxMergeSize=2147483648, maxMergeSizeForForcedMerge=9223372036854775807, calibrateSizeByDeletes=true, maxMergeDocs=2147483647, maxCFSSegmentSizeMB=8.796093022208E12, noCFSRatio=0.0]
2> 12485 WARN (coreLoadExecutor-141-thread-1) [ x:collection1] o.a.s.r.ManagedResourceStorage Cannot write to config directory /home/jenkins/jenkins-agent/workspace/Solr/Solr-Test-main/solr/core/build/resources/test/solr/collection1/conf ; switching to use InMemory storage instead.
2> 12485 INFO (coreLoadExecutor-141-thread-1) [ x:collection1] o.a.s.h.ReplicationHandler Commits will be reserved for 10000 ms
2> 12486 INFO (searcherExecutor-143-thread-1-processing-collection1) [ x:collection1] o.a.s.c.SolrCore Registered new searcher autowarm time: 0 ms
2> 12523 INFO (SUITE-TestDistributedGrouping-seed#[9FC7351F4FBF964C]-worker) [] o.a.s.j.SolrRequestAuthorizer Creating a new SolrRequestAuthorizer
2> 12538 INFO (SUITE-TestDistributedGrouping-seed#[9FC7351F4FBF964C]-worker) [] o.a.s.SolrTestCaseJ4 ####initCore end
2> 12549 INFO (TEST-TestDistributedGrouping.test-seed#[9FC7351F4FBF964C]) [] o.a.s.u.ErrorLogMuter Closing ErrorLogMuter-regex-17 after muting 0 log messages
2> 12549 INFO (TEST-TestDistributedGrouping.test-seed#[9FC7351F4FBF964C]) [] o.a.s.u.ErrorLogMuter Creating ErrorLogMuter-regex-18 for ERROR logs matching regex: ignore_exception
2> 12736 INFO (TEST-TestDistributedGrouping.test-seed#[9FC7351F4FBF964C]) [] o.a.s.SolrTestCaseJ4 Writing core.properties file to /home/jenkins/jenkins-agent/workspace/Solr/Solr-Test-main/solr/core/build/tmp/tests-tmp/org.apache.solr.TestDistributedGrouping_9FC7351F4FBF964C-001/tempDir-001/control/cores/collection1
2> 12738 INFO (TEST-TestDistributedGrouping.test-seed#[9FC7351F4FBF964C]) [] o.a.s.e.JettySolrRunner Start Jetty (configured port=0, binding port=0)
2> 12738 INFO (TEST-TestDistributedGrouping.test-seed#[9FC7351F4FBF964C]) [] o.a.s.e.JettySolrRunner Trying to start Jetty on port 0 try number 2 ...
2> 12738 INFO (TEST-TestDistributedGrouping.test-seed#[9FC7351F4FBF964C]) [] o.e.j.s.Server jetty-12.1.10; built: 2026-05-31T04:45:52.925Z; git: 986024525891c2c20ff08c58ba300dc3b9847586; jvm 21.0.4+7-LTS
2> 12740 INFO (TEST-TestDistributedGrouping.test-seed#[9FC7351F4FBF964C]) [] o.e.j.s.DefaultSessionIdManager Session workerName=node0
2> 12740 WARN (TEST-TestDistributedGrouping.test-seed#[9FC7351F4FBF964C]) [] o.e.j.e.s.ServletContextHandler BaseResource file:///home/jenkins/jenkins-agent/workspace/Solr/Solr-Test-main/solr/core/build/tmp/tests-cwd/./ is aliased to file:///home/jenkins/jenkins-agent/workspace/Solr/Solr-Test-main/solr/core/build/tmp/tests-cwd/ in oeje10s.ServletContextHandler@3d956bbf{/solr,/solr,b=file:///home/jenkins/jenkins-agent/workspace/Solr/Solr-Test-main/solr/core/build/tmp/tests-cwd/./,a=STOPPED,h=oeje10s.ServletHandler@76ee4677{STOPPED}}. May not be supported in future releases.
2> 12742 INFO (TEST-TestDistributedGrouping.test-seed#[9FC7351F4FBF964C]) [] o.e.j.s.h.ContextHandler /solr Base Resource is an alias: file:///home/jenkins/jenkins-agent/workspace/Solr/Solr-Test-main/solr/core/build/tmp/tests-cwd/./ -> file:///home/jenkins/jenkins-agent/workspace/Solr/Solr-Test-main/solr/core/build/tmp/tests-cwd/
2> 12742 INFO (TEST-TestDistributedGrouping.test-seed#[9FC7351F4FBF964C]) [] o.e.j.s.h.ContextHandler Started oeje10s.ServletContextHandler@3d956bbf{/solr,/solr,b=file:///home/jenkins/jenkins-agent/workspace/Solr/Solr-Test-main/solr/core/build/tmp/tests-cwd/,a=AVAILABLE,h=oeje10s.ServletHandler@76ee4677{STARTED}}
2> 12742 INFO (TEST-TestDistributedGrouping.test-seed#[9FC7351F4FBF964C]) [] o.a.s.e.JettySolrRunner Jetty properties: {schema=schema.xml, solrconfig=solrconfig-delaying-component.xml, hostPort=38375, coreRootDirectory=/home/jenkins/jenkins-agent/workspace/Solr/Solr-Test-main/solr/core/build/tmp/tests-tmp/org.apache.solr.TestDistributedGrouping_9FC7351F4FBF964C-001/tempDir-001/control/cores}
2> 12742 ERROR (TEST-TestDistributedGrouping.test-seed#[9FC7351F4FBF964C]) [] o.a.s.u.StartupLoggingUtils Missing Java Option solr.logs.dir. Logging may be missing or incomplete.
2> 12743 INFO (TEST-TestDistributedGrouping.test-seed#[9FC7351F4FBF964C]) [] o.a.s.s.CoreContainerProvider Using logger factory org.apache.logging.slf4j.Log4jLoggerFactory
2> 12743 INFO (TEST-TestDistributedGrouping.test-seed#[9FC7351F4FBF964C]) [] o.a.s.s.CoreContainerProvider ___ _ Welcome to Apache Solr™ version 11.0.0
2> 12743 INFO (TEST-TestDistributedGrouping.test-seed#[9FC7351F4FBF964C]) [] o.a.s.s.CoreContainerProvider / __| ___| |_ _ Starting in standalone mode on port null
2> 12743 INFO (TEST-TestDistributedGrouping.test-seed#[9FC7351F4FBF964C]) [] o.a.s.s.CoreContainerProvider \__ \/ _ \ | '_| Install dir: /home/jenkins/jenkins-agent/workspace/Solr/Solr-Test-main/solr
2> 12743 INFO (TEST-TestDistributedGrouping.test-seed#[9FC7351F4FBF964C]) [] o.a.s.s.CoreContainerProvider |___/\___/_|_| Start time: 2026-08-01T18:59:59.547423295Z
2> 12743 INFO (TEST-TestDistributedGrouping.test-seed#[9FC7351F4FBF964C]) [] o.a.s.s.CoreContainerProvider Solr Home: /home/jenkins/jenkins-agent/workspace/Solr/Solr-Test-main/solr/core/build/tmp/tests-tmp/org.apache.solr.TestDistributedGrouping_9FC7351F4FBF964C-001/tempDir-001/control (source: servlet config: solr.solr.home)
2> 12744 INFO (TEST-TestDistributedGrouping.test-seed#[9FC7351F4FBF964C]) [] o.a.s.c.SolrXmlConfig Loading solr.xml from /home/jenkins/jenkins-agent/workspace/Solr/Solr-Test-main/solr/core/build/tmp/tests-tmp/org.apache.solr.TestDistributedGrouping_9FC7351F4FBF964C-001/tempDir-001/control/solr.xml
2> 13099 WARN (TEST-TestDistributedGrouping.test-seed#[9FC7351F4FBF964C]) [] o.a.s.c.CoreContainer Not all security plugins configured! authentication=disabled authorization=disabled. Solr is only as secure as you make it. Consider configuring authentication/authorization before exposing Solr to users internal or external. See https://s.apache.org/solrsecurity for more info
2> 13104 INFO (TEST-TestDistributedGrouping.test-seed#[9FC7351F4FBF964C]) [] o.a.s.c.CorePropertiesLocator Found 1 core definitions underneath /home/jenkins/jenkins-agent/workspace/Solr/Solr-Test-main/solr/core/build/tmp/tests-tmp/org.apache.solr.TestDistributedGrouping_9FC7351F4FBF964C-001/tempDir-001/control/cores
2> 13104 INFO (TEST-TestDistributedGrouping.test-seed#[9FC7351F4FBF964C]) [] o.a.s.c.CorePropertiesLocator Cores are: [collection1]
2> 13109 INFO (coreLoadExecutor-161-thread-1) [ x:collection1] o.a.s.c.SolrResourceLoader Added 2 libs to classloader, from paths: [/home/jenkins/jenkins-agent/workspace/Solr/Solr-Test-main/solr/core/build/resources/test/solr/collection1/lib, /home/jenkins/jenkins-agent/workspace/Solr/Solr-Test-main/solr/core/build/resources/test/solr/collection1/lib/classes]
2> 13127 INFO (coreLoadExecutor-161-thread-1) [ x:collection1] o.a.s.c.SolrConfig Using Lucene MatchVersion: 10.4.0
2> 13133 INFO (coreLoadExecutor-161-thread-1) [ x:collection1] o.a.s.s.IndexSchema Schema name=test
2> 13143 INFO (TEST-TestDistributedGrouping.test-seed#[9FC7351F4FBF964C]) [] o.a.s.j.SolrRequestAuthorizer Creating a new SolrRequestAuthorizer
2> 13151 INFO (coreLoadExecutor-161-thread-1) [ x:collection1] o.a.s.s.IndexSchema Loaded schema test/1.0 with uniqueid field id
2> 13158 INFO (TEST-TestDistributedGrouping.test-seed#[9FC7351F4FBF964C]) [] o.e.j.e.s.ServletContextHandler Started oeje10s.ServletContextHandler@3d956bbf{/solr,/solr,b=file:///home/jenkins/jenkins-agent/workspace/Solr/Solr-Test-main/solr/core/build/tmp/tests-cwd/,a=AVAILABLE,h=oeje10s.ServletHandler@76ee4677{STARTED}}
2> 13158 INFO (TEST-TestDistributedGrouping.test-seed#[9FC7351F4FBF964C]) [] o.e.j.s.AbstractConnector Started oejs.ServerConnector@3c94ba12{HTTP/1.1, (http/1.1, h2c)}{127.0.0.1:38375}
2> 13159 INFO (TEST-TestDistributedGrouping.test-seed#[9FC7351F4FBF964C]) [] o.e.j.s.Server Started oejs.Server@3e4f79f{STARTING}[12.1.10,sto=0] @420ms
2> 13163 INFO (coreLoadExecutor-161-thread-1) [ x:collection1] o.a.s.c.CoreContainer Creating SolrCore 'collection1' using configuration from configset /home/jenkins/jenkins-agent/workspace/Solr/Solr-Test-main/solr/core/build/resources/test/solr/collection1
2> 13163 INFO (coreLoadExecutor-161-thread-1) [ x:collection1] o.a.s.c.SolrCore Opening new SolrCore at [/home/jenkins/jenkins-agent/workspace/Solr/Solr-Test-main/solr/core/build/tmp/tests-tmp/org.apache.solr.TestDistributedGrouping_9FC7351F4FBF964C-001/tempDir-001/control/cores/collection1], dataDir=[/home/jenkins/jenkins-agent/workspace/Solr/Solr-Test-main/solr/core/build/tmp/tests-tmp/org.apache.solr.TestDistributedGrouping_9FC7351F4FBF964C-001/tempDir-001/control/cores/collection1/data/]
2> 13164 INFO (coreLoadExecutor-161-thread-1) [ x:collection1] o.a.s.u.RandomMergePolicy RandomMergePolicy wrapping class org.apache.lucene.index.LogDocMergePolicy: [LogDocMergePolicy: minMergeSize=1000, mergeFactor=16, maxMergeSize=9223372036854775807, maxMergeSizeForForcedMerge=9223372036854775807, calibrateSizeByDeletes=false, maxMergeDocs=2147483647, maxCFSSegmentSizeMB=8.796093022208E12, noCFSRatio=0.25036991981108403]
2> 13192 INFO (coreLoadExecutor-161-thread-1) [ x:collection1] o.a.s.j.SolrRequestAuthorizer Creating a new SolrRequestAuthorizer
2> 13198 INFO (coreLoadExecutor-161-thread-1) [ x:collection1] o.a.s.u.CommitTracker Hard AutoCommit: disabled
2> 13198 INFO (coreLoadExecutor-161-thread-1) [ x:collection1] o.a.s.u.CommitTracker Soft AutoCommit: disabled
2> 13198 INFO (coreLoadExecutor-161-thread-1) [ x:collection1] o.a.s.u.RandomMergePolicy RandomMergePolicy wrapping class org.apache.lucene.index.LogByteSizeMergePolicy: [LogByteSizeMergePolicy: minMergeSize=16777216, mergeFactor=40, maxMergeSize=2147483648, maxMergeSizeForForcedMerge=9223372036854775807, calibrateSizeByDeletes=true, maxMergeDocs=2147483647, maxCFSSegmentSizeMB=8.796093022208E12, noCFSRatio=0.0]
2> 13200 WARN (coreLoadExecutor-161-thread-1) [ x:collection1] o.a.s.r.ManagedResourceStorage Cannot write to config directory /home/jenkins/jenkins-agent/workspace/Solr/Solr-Test-main/solr/core/build/resources/test/solr/collection1/conf ; switching to use InMemory storage instead.
2> 13200 INFO (coreLoadExecutor-161-thread-1) [ x:collection1] o.a.s.h.ReplicationHandler Commits will be reserved for 10000 ms
2> 13201 INFO (searcherExecutor-163-thread-1-processing-collection1) [ x:collection1] o.a.s.c.SolrCore Registered new searcher autowarm time: 0 ms
2> 13376 INFO (TEST-TestDistributedGrouping.test-seed#[9FC7351F4FBF964C]) [] o.a.s.SolrTestCaseJ4 Writing core.properties file to /home/jenkins/jenkins-agent/workspace/Solr/Solr-Test-main/solr/core/build/tmp/tests-tmp/org.apache.solr.TestDistributedGrouping_9FC7351F4FBF964C-001/tempDir-001/shard0/cores/collection1
2> 13377 INFO (TEST-TestDistributedGrouping.test-seed#[9FC7351F4FBF964C]) [] o.a.s.e.JettySolrRunner Start Jetty (configured port=0, binding port=0)
2> 13377 INFO (TEST-TestDistributedGrouping.test-seed#[9FC7351F4FBF964C]) [] o.a.s.e.JettySolrRunner Trying to start Jetty on port 0 try number 2 ...
2> 13378 INFO (TEST-TestDistributedGrouping.test-seed#[9FC7351F4FBF964C]) [] o.e.j.s.Server jetty-12.1.10; built: 2026-05-31T04:45:52.925Z; git: 986024525891c2c20ff08c58ba300dc3b9847586; jvm 21.0.4+7-LTS
2> 13379 INFO (TEST-TestDistributedGrouping.test-seed#[9FC7351F4FBF964C]) [] o.e.j.s.DefaultSessionIdManager Session workerName=node0
2> 13379 WARN (TEST-TestDistributedGrouping.test-seed#[9FC7351F4FBF964C]) [] o.e.j.e.s.ServletContextHandler BaseResource file:///home/jenkins/jenkins-agent/workspace/Solr/Solr-Test-main/solr/core/build/tmp/tests-cwd/./ is aliased to file:///home/jenkins/jenkins-agent/workspace/Solr/Solr-Test-main/solr/core/build/tmp/tests-cwd/ in oeje10s.ServletContextHandler@696dd1b2{/solr,/solr,b=file:///home/jenkins/jenkins-agent/workspace/Solr/Solr-Test-main/solr/core/build/tmp/tests-cwd/./,a=STOPPED,h=oeje10s.ServletHandler@6852d70d{STOPPED}}. May not be supported in future releases.
2> 13380 INFO (TEST-TestDistributedGrouping.test-seed#[9FC7351F4FBF964C]) [] o.e.j.s.h.ContextHandler /solr Base Resource is an alias: file:///home/jenkins/jenkins-agent/workspace/Solr/Solr-Test-main/solr/core/build/tmp/tests-cwd/./ -> file:///home/jenkins/jenkins-agent/workspace/Solr/Solr-Test-main/solr/core/build/tmp/tests-cwd/
2> 13380 INFO (TEST-TestDistributedGrouping.test-seed#[9FC7351F4FBF964C]) [] o.e.j.s.h.ContextHandler Started oeje10s.ServletContextHandler@696dd1b2{/solr,/solr,b=file:///home/jenkins/jenkins-agent/workspace/Solr/Solr-Test-main/solr/core/build/tmp/tests-cwd/,a=AVAILABLE,h=oeje10s.ServletHandler@6852d70d{STARTED}}
2> 13381 INFO (TEST-TestDistributedGrouping.test-seed#[9FC7351F4FBF964C]) [] o.a.s.e.JettySolrRunner Jetty properties: {schema=schema.xml, solrconfig=solrconfig-delaying-component.xml, hostPort=42357, coreRootDirectory=/home/jenkins/jenkins-agent/workspace/Solr/Solr-Test-main/solr/core/build/tmp/tests-tmp/org.apache.solr.TestDistributedGrouping_9FC7351F4FBF964C-001/tempDir-001/shard0/cores}
2> 13381 ERROR (TEST-TestDistributedGrouping.test-seed#[9FC7351F4FBF964C]) [] o.a.s.u.StartupLoggingUtils Missing Java Option solr.logs.dir. Logging may be missing or incomplete.
2> 13381 INFO (TEST-TestDistributedGrouping.test-seed#[9FC7351F4FBF964C]) [] o.a.s.s.CoreContainerProvider Using logger factory org.apache.logging.slf4j.Log4jLoggerFactory
2> 13381 INFO (TEST-TestDistributedGrouping.test-seed#[9FC7351F4FBF964C]) [] o.a.s.s.CoreContainerProvider ___ _ Welcome to Apache Solr™ version 11.0.0
2> 13381 INFO (TEST-TestDistributedGrouping.test-seed#[9FC7351F4FBF964C]) [] o.a.s.s.CoreContainerProvider / __| ___| |_ _ Starting in standalone mode on port null
2> 13381 INFO (TEST-TestDistributedGrouping.test-seed#[9FC7351F4FBF964C]) [] o.a.s.s.CoreContainerProvider \__ \/ _ \ | '_| Install dir: /home/jenkins/jenkins-agent/workspace/Solr/Solr-Test-main/solr
2> 13381 INFO (TEST-TestDistributedGrouping.test-seed#[9FC7351F4FBF964C]) [] o.a.s.s.CoreContainerProvider |___/\___/_|_| Start time: 2026-08-01T19:00:00.185499593Z
2> 13381 INFO (TEST-TestDistributedGrouping.test-seed#[9FC7351F4FBF964C]) [] o.a.s.s.CoreContainerProvider Solr Home: /home/jenkins/jenkins-agent/workspace/Solr/Solr-Test-main/solr/core/build/tmp/tests-tmp/org.apache.solr.TestDistributedGrouping_9FC7351F4FBF964C-001/tempDir-001/shard0 (source: servlet config: solr.solr.home)
2> 13381 INFO (TEST-TestDistributedGrouping.test-seed#[9FC7351F4FBF964C]) [] o.a.s.c.SolrXmlConfig Loading solr.xml from /home/jenkins/jenkins-agent/workspace/Solr/Solr-Test-main/solr/core/build/tmp/tests-tmp/org.apache.solr.TestDistributedGrouping_9FC7351F4FBF964C-001/tempDir-001/shard0/solr.xml
2> 13549 WARN (TEST-TestDistributedGrouping.test-seed#[9FC7351F4FBF964C]) [] o.a.s.c.CoreContainer Not all security plugins configured! authentication=disabled authorization=disabled. Solr is only as secure as you make it. Consider configuring authentication/authorization before exposing Solr to users internal or external. See https://s.apache.org/solrsecurity for more info
2> 13554 INFO (TEST-TestDistributedGrouping.test-seed#[9FC7351F4FBF964C]) [] o.a.s.c.CorePropertiesLocator Found 1 core definitions underneath /home/jenkins/jenkins-agent/workspace/Solr/Solr-Test-main/solr/core/build/tmp/tests-tmp/org.apache.solr.TestDistributedGrouping_9FC7351F4FBF964C-001/tempDir-001/shard0/cores
2> 13554 INFO (TEST-TestDistributedGrouping.test-seed#[9FC7351F4FBF964C]) [] o.a.s.c.CorePropertiesLocator Cores are: [collection1]
2> 13559 INFO (coreLoadExecutor-181-thread-1) [ x:collection1] o.a.s.c.SolrResourceLoader Added 2 libs to classloader, from paths: [/home/jenkins/jenkins-agent/workspace/Solr/Solr-Test-main/solr/core/build/resources/test/solr/collection1/lib, /home/jenkins/jenkins-agent/workspace/Solr/Solr-Test-main/solr/core/build/resources/test/solr/collection1/lib/classes]
2> 13577 INFO (coreLoadExecutor-181-thread-1) [ x:collection1] o.a.s.c.SolrConfig Using Lucene MatchVersion: 10.4.0
2> 13582 INFO (coreLoadExecutor-181-thread-1) [ x:collection1] o.a.s.s.IndexSchema Schema name=test
2> 13591 INFO (TEST-TestDistributedGrouping.test-seed#[9FC7351F4FBF964C]) [] o.a.s.j.SolrRequestAuthorizer Creating a new SolrRequestAuthorizer
2> 13599 INFO (coreLoadExecutor-181-thread-1) [ x:collection1] o.a.s.s.IndexSchema Loaded schema test/1.0 with uniqueid field id
2> 13605 INFO (TEST-TestDistributedGrouping.test-seed#[9FC7351F4FBF964C]) [] o.e.j.e.s.ServletContextHandler Started oeje10s.ServletContextHandler@696dd1b2{/solr,/solr,b=file:///home/jenkins/jenkins-agent/workspace/Solr/Solr-Test-main/solr/core/build/tmp/tests-cwd/,a=AVAILABLE,h=oeje10s.ServletHandler@6852d70d{STARTED}}
2> 13606 INFO (TEST-TestDistributedGrouping.test-seed#[9FC7351F4FBF964C]) [] o.e.j.s.AbstractConnector Started oejs.ServerConnector@1e94c61b{HTTP/1.1, (http/1.1, h2c)}{127.0.0.1:42357}
2> 13606 INFO (TEST-TestDistributedGrouping.test-seed#[9FC7351F4FBF964C]) [] o.e.j.s.Server Started oejs.Server@66db12b9{STARTING}[12.1.10,sto=0] @228ms
2> 13610 INFO (coreLoadExecutor-181-thread-1) [ x:collection1] o.a.s.c.CoreContainer Creating SolrCore 'collection1' using configuration from configset /home/jenkins/jenkins-agent/workspace/Solr/Solr-Test-main/solr/core/build/resources/test/solr/collection1
2> 13610 INFO (coreLoadExecutor-181-thread-1) [ x:collection1] o.a.s.c.SolrCore Opening new SolrCore at [/home/jenkins/jenkins-agent/workspace/Solr/Solr-Test-main/solr/core/build/tmp/tests-tmp/org.apache.solr.TestDistributedGrouping_9FC7351F4FBF964C-001/tempDir-001/shard0/cores/collection1], dataDir=[/home/jenkins/jenkins-agent/workspace/Solr/Solr-Test-main/solr/core/build/tmp/tests-tmp/org.apache.solr.TestDistributedGrouping_9FC7351F4FBF964C-001/tempDir-001/shard0/cores/collection1/data/]
2> 13611 INFO (coreLoadExecutor-181-thread-1) [ x:collection1] o.a.s.u.RandomMergePolicy RandomMergePolicy wrapping class org.apache.lucene.index.LogDocMergePolicy: [LogDocMergePolicy: minMergeSize=1000, mergeFactor=16, maxMergeSize=9223372036854775807, maxMergeSizeForForcedMerge=9223372036854775807, calibrateSizeByDeletes=false, maxMergeDocs=2147483647, maxCFSSegmentSizeMB=8.796093022208E12, noCFSRatio=0.25036991981108403]
2> 13660 INFO (coreLoadExecutor-181-thread-1) [ x:collection1] o.a.s.j.SolrRequestAuthorizer Creating a new SolrRequestAuthorizer
2> 13665 INFO (coreLoadExecutor-181-thread-1) [ x:collection1] o.a.s.u.CommitTracker Hard AutoCommit: disabled
2> 13665 INFO (coreLoadExecutor-181-thread-1) [ x:collection1] o.a.s.u.CommitTracker Soft AutoCommit: disabled
2> 13666 INFO (coreLoadExecutor-181-thread-1) [ x:collection1] o.a.s.u.RandomMergePolicy RandomMergePolicy wrapping class org.apache.lucene.index.LogByteSizeMergePolicy: [LogByteSizeMergePolicy: minMergeSize=16777216, mergeFactor=40, maxMergeSize=2147483648, maxMergeSizeForForcedMerge=9223372036854775807, calibrateSizeByDeletes=true, maxMergeDocs=2147483647, maxCFSSegmentSizeMB=8.796093022208E12, noCFSRatio=0.0]
2> 13667 WARN (coreLoadExecutor-181-thread-1) [ x:collection1] o.a.s.r.ManagedResourceStorage Cannot write to config directory /home/jenkins/jenkins-agent/workspace/Solr/Solr-Test-main/solr/core/build/resources/test/solr/collection1/conf ; switching to use InMemory storage instead.
2> 13667 INFO (coreLoadExecutor-181-thread-1) [ x:collection1] o.a.s.h.ReplicationHandler Commits will be reserved for 10000 ms
2> 13668 INFO (searcherExecutor-183-thread-1-processing-collection1) [ x:collection1] o.a.s.c.SolrCore Registered new searcher autowarm time: 0 ms
2> 13818 INFO (TEST-TestDistributedGrouping.test-seed#[9FC7351F4FBF964C]) [] o.a.s.SolrTestCaseJ4 Writing core.properties file to /home/jenkins/jenkins-agent/workspace/Solr/Solr-Test-main/solr/core/build/tmp/tests-tmp/org.apache.solr.TestDistributedGrouping_9FC7351F4FBF964C-001/tempDir-001/shard1/cores/collection1
2> 13819 INFO (TEST-TestDistributedGrouping.test-seed#[9FC7351F4FBF964C]) [] o.a.s.e.JettySolrRunner Start Jetty (configured port=0, binding port=0)
2> 13819 INFO (TEST-TestDistributedGrouping.test-seed#[9FC7351F4FBF964C]) [] o.a.s.e.JettySolrRunner Trying to start Jetty on port 0 try number 2 ...
2> 13819 INFO (TEST-TestDistributedGrouping.test-seed#[9FC7351F4FBF964C]) [] o.e.j.s.Server jetty-12.1.10; built: 2026-05-31T04:45:52.925Z; git: 986024525891c2c20ff08c58ba300dc3b9847586; jvm 21.0.4+7-LTS
2> 13821 INFO (TEST-TestDistributedGrouping.test-seed#[9FC7351F4FBF964C]) [] o.e.j.s.DefaultSessionIdManager Session workerName=node0
2> 13821 WARN (TEST-TestDistributedGrouping.test-seed#[9FC7351F4FBF964C]) [] o.e.j.e.s.ServletContextHandler BaseResource file:///home/jenkins/jenkins-agent/workspace/Solr/Solr-Test-main/solr/core/build/tmp/tests-cwd/./ is aliased to file:///home/jenkins/jenkins-agent/workspace/Solr/Solr-Test-main/solr/core/build/tmp/tests-cwd/ in oeje10s.ServletContextHandler@4230fbb6{/solr,/solr,b=file:///home/jenkins/jenkins-agent/workspace/Solr/Solr-Test-main/solr/core/build/tmp/tests-cwd/./,a=STOPPED,h=oeje10s.ServletHandler@6dcd4ef8{STOPPED}}. May not be supported in future releases.
2> 13822 INFO (TEST-TestDistributedGrouping.test-seed#[9FC7351F4FBF964C]) [] o.e.j.s.h.ContextHandler /solr Base Resource is an alias: file:///home/jenkins/jenkins-agent/workspace/Solr/Solr-Test-main/solr/core/build/tmp/tests-cwd/./ -> file:///home/jenkins/jenkins-agent/workspace/Solr/Solr-Test-main/solr/core/build/tmp/tests-cwd/
2> 13822 INFO (TEST-TestDistributedGrouping.test-seed#[9FC7351F4FBF964C]) [] o.e.j.s.h.ContextHandler Started oeje10s.ServletContextHandler@4230fbb6{/solr,/solr,b=file:///home/jenkins/jenkins-agent/workspace/Solr/Solr-Test-main/solr/core/build/tmp/tests-cwd/,a=AVAILABLE,h=oeje10s.ServletHandler@6dcd4ef8{STARTED}}
2> 13822 INFO (TEST-TestDistributedGrouping.test-seed#[9FC7351F4FBF964C]) [] o.a.s.e.JettySolrRunner Jetty properties: {schema=schema.xml, solrconfig=solrconfig-delaying-component.xml, hostPort=43221, coreRootDirectory=/home/jenkins/jenkins-agent/workspace/Solr/Solr-Test-main/solr/core/build/tmp/tests-tmp/org.apache.solr.TestDistributedGrouping_9FC7351F4FBF964C-001/tempDir-001/shard1/cores}
2> 13822 ERROR (TEST-TestDistributedGrouping.test-seed#[9FC7351F4FBF964C]) [] o.a.s.u.StartupLoggingUtils Missing Java Option solr.logs.dir. Logging may be missing or incomplete.
2> 13823 INFO (TEST-TestDistributedGrouping.test-seed#[9FC7351F4FBF964C]) [] o.a.s.s.CoreContainerProvider Using logger factory org.apache.logging.slf4j.Log4jLoggerFactory
2> 13823 INFO (TEST-TestDistributedGrouping.test-seed#[9FC7351F4FBF964C]) [] o.a.s.s.CoreContainerProvider ___ _ Welcome to Apache Solr™ version 11.0.0
2> 13823 INFO (TEST-TestDistributedGrouping.test-seed#[9FC7351F4FBF964C]) [] o.a.s.s.CoreContainerProvider / __| ___| |_ _ Starting in standalone mode on port null
2> 13823 INFO (TEST-TestDistributedGrouping.test-seed#[9FC7351F4FBF964C]) [] o.a.s.s.CoreContainerProvider \__ \/ _ \ | '_| Install dir: /home/jenkins/jenkins-agent/workspace/Solr/Solr-Test-main/solr
2> 13823 INFO (TEST-TestDistributedGrouping.test-seed#[9FC7351F4FBF964C]) [] o.a.s.s.CoreContainerProvider |___/\___/_|_| Start time: 2026-08-01T19:00:00.627220377Z
2> 13823 INFO (TEST-TestDistributedGrouping.test-seed#[9FC7351F4FBF964C]) [] o.a.s.s.CoreContainerProvider Solr Home: /home/jenkins/jenkins-agent/workspace/Solr/Solr-Test-main/solr/core/build/tmp/tests-tmp/org.apache.solr.TestDistributedGrouping_9FC7351F4FBF964C-001/tempDir-001/shard1 (source: servlet config: solr.solr.home)
2> 13823 INFO (TEST-TestDistributedGrouping.test-seed#[9FC7351F4FBF964C]) [] o.a.s.c.SolrXmlConfig Loading solr.xml from /home/jenkins/jenkins-agent/workspace/Solr/Solr-Test-main/solr/core/build/tmp/tests-tmp/org.apache.solr.TestDistributedGrouping_9FC7351F4FBF964C-001/tempDir-001/shard1/solr.xml
2> 15094 WARN (TEST-TestDistributedGrouping.test-seed#[9FC7351F4FBF964C]) [] o.a.s.c.CoreContainer Not all security plugins configured! authentication=disabled authorization=disabled. Solr is only as secure as you make it. Consider configuring authentication/authorization before exposing Solr to users internal or external. See https://s.apache.org/solrsecurity for more info
2> 15099 INFO (TEST-TestDistributedGrouping.test-seed#[9FC7351F4FBF964C]) [] o.a.s.c.CorePropertiesLocator Found 1 core definitions underneath /home/jenkins/jenkins-agent/workspace/Solr/Solr-Test-main/solr/core/build/tmp/tests-tmp/org.apache.solr.TestDistributedGrouping_9FC7351F4FBF964C-001/tempDir-001/shard1/cores
2> 15099 INFO (TEST-TestDistributedGrouping.test-seed#[9FC7351F4FBF964C]) [] o.a.s.c.CorePropertiesLocator Cores are: [collection1]
2> 15105 INFO (coreLoadExecutor-201-thread-1) [ x:collection1] o.a.s.c.SolrResourceLoader Added 2 libs to classloader, from paths: [/home/jenkins/jenkins-agent/workspace/Solr/Solr-Test-main/solr/core/build/resources/test/solr/collection1/lib, /home/jenkins/jenkins-agent/workspace/Solr/Solr-Test-main/solr/core/build/resources/test/solr/collection1/lib/classes]
2> 15147 INFO (coreLoadExecutor-201-thread-1) [ x:collection1] o.a.s.c.SolrConfig Using Lucene MatchVersion: 10.4.0
2> 15151 INFO (coreLoadExecutor-201-thread-1) [ x:collection1] o.a.s.s.IndexSchema Schema name=test
2> 15155 INFO (TEST-TestDistributedGrouping.test-seed#[9FC7351F4FBF964C]) [] o.a.s.j.SolrRequestAuthorizer Creating a new SolrRequestAuthorizer
2> 15169 INFO (coreLoadExecutor-201-thread-1) [ x:collection1] o.a.s.s.IndexSchema Loaded schema test/1.0 with uniqueid field id
2> 15172 INFO (TEST-TestDistributedGrouping.test-seed#[9FC7351F4FBF964C]) [] o.e.j.e.s.ServletContextHandler Started oeje10s.ServletContextHandler@4230fbb6{/solr,/solr,b=file:///home/jenkins/jenkins-agent/workspace/Solr/Solr-Test-main/solr/core/build/tmp/tests-cwd/,a=AVAILABLE,h=oeje10s.ServletHandler@6dcd4ef8{STARTED}}
2> 15173 INFO (TEST-TestDistributedGrouping.test-seed#[9FC7351F4FBF964C]) [] o.e.j.s.AbstractConnector Started oejs.ServerConnector@24cc8f8{HTTP/1.1, (http/1.1, h2c)}{127.0.0.1:43221}
2> 15173 INFO (TEST-TestDistributedGrouping.test-seed#[9FC7351F4FBF964C]) [] o.e.j.s.Server Started oejs.Server@4b55eae6{STARTING}[12.1.10,sto=0] @1353ms
2> 15180 INFO (coreLoadExecutor-201-thread-1) [ x:collection1] o.a.s.c.CoreContainer Creating SolrCore 'collection1' using configuration from configset /home/jenkins/jenkins-agent/workspace/Solr/Solr-Test-main/solr/core/build/resources/test/solr/collection1
2> 15180 INFO (coreLoadExecutor-201-thread-1) [ x:collection1] o.a.s.c.SolrCore Opening new SolrCore at [/home/jenkins/jenkins-agent/workspace/Solr/Solr-Test-main/solr/core/build/tmp/tests-tmp/org.apache.solr.TestDistributedGrouping_9FC7351F4FBF964C-001/tempDir-001/shard1/cores/collection1], dataDir=[/home/jenkins/jenkins-agent/workspace/Solr/Solr-Test-main/solr/core/build/tmp/tests-tmp/org.apache.solr.TestDistributedGrouping_9FC7351F4FBF964C-001/tempDir-001/shard1/cores/collection1/data/]
2> 15181 INFO (coreLoadExecutor-201-thread-1) [ x:collection1] o.a.s.u.RandomMergePolicy RandomMergePolicy wrapping class org.apache.lucene.index.LogDocMergePolicy: [LogDocMergePolicy: minMergeSize=1000, mergeFactor=16, maxMergeSize=9223372036854775807, maxMergeSizeForForcedMerge=9223372036854775807, calibrateSizeByDeletes=false, maxMergeDocs=2147483647, maxCFSSegmentSizeMB=8.796093022208E12, noCFSRatio=0.25036991981108403]
2> 15211 INFO (coreLoadExecutor-201-thread-1) [ x:collection1] o.a.s.j.SolrRequestAuthorizer Creating a new SolrRequestAuthorizer
2> 15216 INFO (coreLoadExecutor-201-thread-1) [ x:collection1] o.a.s.u.CommitTracker Hard AutoCommit: disabled
2> 15216 INFO (coreLoadExecutor-201-thread-1) [ x:collection1] o.a.s.u.CommitTracker Soft AutoCommit: disabled
2> 15217 INFO (coreLoadExecutor-201-thread-1) [ x:collection1] o.a.s.u.RandomMergePolicy RandomMergePolicy wrapping class org.apache.lucene.index.LogByteSizeMergePolicy: [LogByteSizeMergePolicy: minMergeSize=16777216, mergeFactor=40, maxMergeSize=2147483648, maxMergeSizeForForcedMerge=9223372036854775807, calibrateSizeByDeletes=true, maxMergeDocs=2147483647, maxCFSSegmentSizeMB=8.796093022208E12, noCFSRatio=0.0]
2> 15218 WARN (coreLoadExecutor-201-thread-1) [ x:collection1] o.a.s.r.ManagedResourceStorage Cannot write to config directory /home/jenkins/jenkins-agent/workspace/Solr/Solr-Test-main/solr/core/build/resources/test/solr/collection1/conf ; switching to use InMemory storage instead.
2> 15218 INFO (coreLoadExecutor-201-thread-1) [ x:collection1] o.a.s.h.ReplicationHandler Commits will be reserved for 10000 ms
2> 15220 INFO (searcherExecutor-203-thread-1-processing-collection1) [ x:collection1] o.a.s.c.SolrCore Registered new searcher autowarm time: 0 ms
2> 15221 INFO (TEST-TestDistributedGrouping.test-seed#[9FC7351F4FBF964C]) [] o.a.s.SolrTestCaseJ4 ###Starting test
2> 15227 INFO (qtp2053781097-228-null-12) [ x:collection1 t:null-12] o.a.s.u.DirectUpdateHandler2 REMOVING ALL DOCUMENTS FROM INDEX
2> 15228 INFO (qtp2053781097-228-null-12) [ x:collection1 t:null-12] o.a.s.u.p.LogUpdateProcessorFactory path=/update params={wt=javabin}{deleteByQuery=*:*} 0 2
2> 15235 INFO (qtp1255519943-250-null-13) [ x:collection1 t:null-13] o.a.s.u.DirectUpdateHandler2 REMOVING ALL DOCUMENTS FROM INDEX
2> 15235 INFO (qtp1255519943-250-null-13) [ x:collection1 t:null-13] o.a.s.u.p.LogUpdateProcessorFactory path=/update params={wt=javabin}{deleteByQuery=*:*} 0 0
2> 15241 INFO (qtp1466210008-272-null-14) [ x:collection1 t:null-14] o.a.s.u.DirectUpdateHandler2 REMOVING ALL DOCUMENTS FROM INDEX
2> 15242 INFO (qtp1466210008-272-null-14) [ x:collection1 t:null-14] o.a.s.u.p.LogUpdateProcessorFactory path=/update params={wt=javabin}{deleteByQuery=*:*} 0 1
2> 15248 INFO (searcherExecutor-163-thread-1-processing-collection1 null-15) [ x:collection1 t:null-15] o.a.s.c.SolrCore Registered new searcher autowarm time: 0 ms
2> 15248 INFO (qtp2053781097-229-null-15) [ x:collection1 t:null-15] o.a.s.u.p.LogUpdateProcessorFactory path=/update params={waitSearcher=true&commit=true&softCommit=false&wt=javabin}{commit=} 0 2
2> 15253 INFO (searcherExecutor-183-thread-1-processing-collection1 null-16) [ x:collection1 t:null-16] o.a.s.c.SolrCore Registered new searcher autowarm time: 0 ms
2> 15253 INFO (qtp1255519943-251-null-16) [ x:collection1 t:null-16] o.a.s.u.p.LogUpdateProcessorFactory path=/update params={waitSearcher=true&commit=true&softCommit=false&wt=javabin}{commit=} 0 2
2> 15258 INFO (searcherExecutor-203-thread-1-processing-collection1 null-17) [ x:collection1 t:null-17] o.a.s.c.SolrCore Registered new searcher autowarm time: 0 ms
2> 15258 INFO (qtp1466210008-274-null-17) [ x:collection1 t:null-17] o.a.s.u.p.LogUpdateProcessorFactory path=/update params={waitSearcher=true&commit=true&softCommit=false&wt=javabin}{commit=} 0 2
2> 15268 INFO (qtp2053781097-230-null-18) [ x:collection1 t:null-18] o.a.s.c.S.Request path=/select params={q=*:*&fl=id,a_i1&group.limit=-1&sort=a_i1+asc,+id+asc&rows=100&wt=javabin&group.field=a_i1&group=true} hits=0 status=0 QTime=7
2> 15285 INFO (qtp1466210008-271-null-19) [ x:collection1 t:null-19] o.a.s.c.S.Request path=/select params={group.distributed.first=true&distrib=false&fl=id&group.limit=-1&shards.purpose=2048&start=0&sort=a_i1+asc,+id+asc&rows=100&q=*:*&omitHeader=false&NOW=1785610802078&isShard=true&wt=javabin&group.field=a_i1&group=true} status=0 QTime=1
2> 15285 INFO (qtp1255519943-249-null-19) [ x:collection1 t:null-19] o.a.s.c.S.Request path=/select params={group.distributed.first=true&distrib=false&fl=id&group.limit=-1&shards.purpose=2048&start=0&sort=a_i1+asc,+id+asc&rows=100&q=*:*&omitHeader=false&NOW=1785610802078&isShard=true&wt=javabin&group.field=a_i1&group=true} status=0 QTime=5
2> 15291 INFO (qtp1255519943-252-null-19) [ x:collection1 t:null-19] o.a.s.c.S.Request path=/select params={q=*:*&shards=http://127.0.0.1:42357/solr/collection1,127.0.0.1:4/solr|127.0.0.1:8/solr|http://127.0.0.1:43221/solr/collection1|127.0.0.1:6/solr&fl=id,a_i1&group.limit=-1&sort=a_i1+asc,+id+asc&rows=100&wt=javabin&group.field=a_i1&group=true} status=0 QTime=17
2> 15315 INFO (qtp2053781097-231-null-20) [ x:collection1 t:null-20] o.a.s.c.S.Request path=/select params={q=*:*&hl=true&fl=id,a_i1&group.limit=-1&sort=a_i1+asc,+id+asc&hl.fl=a_t&rows=100&wt=javabin&group.field=a_i1&group=true} hits=0 status=0 QTime=21
2> 15322 INFO (qtp1255519943-251-null-21) [ x:collection1 t:null-21] o.a.s.c.S.Request path=/select params={group.distributed.first=true&distrib=false&hl=false&fl=id&group.limit=-1&shards.purpose=2048&start=0&sort=a_i1+asc,+id+asc&rows=100&q=*:*&omitHeader=false&NOW=1785610802123&isShard=true&hl.fl=a_t&wt=javabin&group.field=a_i1&group=true} status=0 QTime=0
2> 15323 INFO (qtp1466210008-273-null-21) [ x:collection1 t:null-21] o.a.s.c.S.Request path=/select params={group.distributed.first=true&distrib=false&hl=false&fl=id&group.limit=-1&shards.purpose=2048&start=0&sort=a_i1+asc,+id+asc&rows=100&q=*:*&omitHeader=false&NOW=1785610802123&isShard=true&hl.fl=a_t&wt=javabin&group.field=a_i1&group=true} status=0 QTime=0
2> 15325 INFO (qtp1255519943-250-null-21) [ x:collection1 t:null-21] o.a.s.c.S.Request path=/select params={q=*:*&shards=http://127.0.0.1:42357/solr/collection1,127.0.0.1:6/solr|http://127.0.0.1:43221/solr/collection1|127.0.0.1:4/solr|127.0.0.1:8/solr&hl=true&fl=id,a_i1&group.limit=-1&sort=a_i1+asc,+id+asc&hl.fl=a_t&rows=100&wt=javabin&group.field=a_i1&group=true} status=0 QTime=6
2> 15337 INFO (qtp2053781097-226-null-22) [ x:collection1 t:null-22] o.a.s.c.S.Request path=/select params={q=*:*&facet.field=a_t&fl=id,a_i1&group.limit=-1&sort=a_i1+asc,+id+asc&rows=100&facet=true&wt=javabin&group.field=a_i1&group=true} hits=0 status=0 QTime=10
2> 15344 INFO (qtp1255519943-248-null-23) [ x:collection1 t:null-23] o.a.s.c.S.Request path=/select params={facet.field=a_t&group.distributed.first=true&distrib=false&fl=id&group.limit=-1&shards.purpose=2048&start=0&sort=a_i1+asc,+id+asc&rows=100&q=*:*&omitHeader=false&NOW=1785610802145&isShard=true&facet=false&wt=javabin&group.field=a_i1&group=true} status=0 QTime=0
2> 15345 INFO (qtp1466210008-272-null-23) [ x:collection1 t:null-23] o.a.s.c.S.Request path=/select params={facet.field=a_t&group.distributed.first=true&distrib=false&fl=id&group.limit=-1&shards.purpose=2048&start=0&sort=a_i1+asc,+id+asc&rows=100&q=*:*&omitHeader=false&NOW=1785610802145&isShard=true&facet=false&wt=javabin&group.field=a_i1&group=true} status=0 QTime=0
2> 15352 INFO (qtp1466210008-274-null-23) [ x:collection1 t:null-23] o.a.s.c.S.Request path=/select params={facet.field=a_t&distrib=false&fl=id&group.limit=-1&shards.purpose=20&start=0&f.a_t.facet.mincount=0&sort=a_i1+asc,+id+asc&rows=100&group.distributed.second=true&q=*:*&f.a_t.facet.limit=160&omitHeader=false&NOW=1785610802145&isShard=true&facet=true&wt=javabin&group.field=a_i1&group=true} status=0 QTime=2
2> 15352 INFO (qtp1255519943-249-null-23) [ x:collection1 t:null-23] o.a.s.c.S.Request path=/select params={facet.field=a_t&distrib=false&fl=id&group.limit=-1&shards.purpose=20&start=0&f.a_t.facet.mincount=0&sort=a_i1+asc,+id+asc&rows=100&group.distributed.second=true&q=*:*&f.a_t.facet.limit=160&omitHeader=false&NOW=1785610802145&isShard=true&facet=true&wt=javabin&group.field=a_i1&group=true} status=0 QTime=3
2> 15356 INFO (qtp1255519943-253-null-23) [ x:collection1 t:null-23] o.a.s.c.S.Request path=/select params={q=*:*&shards=http://127.0.0.1:42357/solr/collection1|127.0.0.1:6/solr|127.0.0.1:8/solr|127.0.0.1:4/solr,http://127.0.0.1:43221/solr/collection1&facet.field=a_t&fl=id,a_i1&group.limit=-1&sort=a_i1+asc,+id+asc&rows=100&facet=true&wt=javabin&group.field=a_i1&group=true} status=0 QTime=15
2> 15365 INFO (qtp2053781097-227-null-24) [ x:collection1 t:null-24] o.a.s.c.S.Request path=/select params={q=*:*&stats=true&fl=id,a_i1&group.limit=-1&sort=a_i1+asc,+id+asc&rows=100&wt=javabin&group.field=a_i1&group=true&stats.field=a_i1} hits=0 status=0 QTime=6
2> 15372 INFO (qtp1255519943-251-null-25) [ x:collection1 t:null-25] o.a.s.c.S.Request path=/select params={group.distributed.first=true&distrib=false&fl=id&group.limit=-1&shards.purpose=2048&start=0&sort=a_i1+asc,+id+asc&rows=100&q=*:*&stats=false&omitHeader=false&NOW=1785610802173&isShard=true&wt=javabin&group.field=a_i1&group=true&stats.field=a_i1} status=0 QTime=0
2> 15372 INFO (qtp1466210008-275-null-25) [ x:collection1 t:null-25] o.a.s.c.S.Request path=/select params={group.distributed.first=true&distrib=false&fl=id&group.limit=-1&shards.purpose=2048&start=0&sort=a_i1+asc,+id+asc&rows=100&q=*:*&stats=false&omitHeader=false&NOW=1785610802173&isShard=true&wt=javabin&group.field=a_i1&group=true&stats.field=a_i1} status=0 QTime=0
2> 15376 INFO (qtp1255519943-250-null-25) [ x:collection1 t:null-25] o.a.s.c.S.Request path=/select params={distrib=false&fl=id&group.limit=-1&shards.purpose=516&start=0&sort=a_i1+asc,+id+asc&rows=100&group.distributed.second=true&q=*:*&stats=true&omitHeader=false&NOW=1785610802173&isShard=true&wt=javabin&group.field=a_i1&group=true&stats.field=a_i1} status=0 QTime=1
2> 15376 INFO (qtp1466210008-270-null-25) [ x:collection1 t:null-25] o.a.s.c.S.Request path=/select params={distrib=false&fl=id&group.limit=-1&shards.purpose=516&start=0&sort=a_i1+asc,+id+asc&rows=100&group.distributed.second=true&q=*:*&stats=true&omitHeader=false&NOW=1785610802173&isShard=true&wt=javabin&group.field=a_i1&group=true&stats.field=a_i1} status=0 QTime=0
2> 15377 INFO (qtp1255519943-252-null-25) [ x:collection1 t:null-25] o.a.s.c.S.Request path=/select params={q=*:*&shards=127.0.0.1:6/solr|http://127.0.0.1:42357/solr/collection1,http://127.0.0.1:43221/solr/collection1|127.0.0.1:6/solr|127.0.0.1:8/solr&stats=true&fl=id,a_i1&group.limit=-1&sort=a_i1+asc,+id+asc&rows=100&wt=javabin&group.field=a_i1&group=true&stats.field=a_i1} status=0 QTime=8
2> 15381 INFO (qtp2053781097-228-null-26) [ x:collection1 t:null-26] o.a.s.c.S.Request path=/select params={q=kings&df=subject&spellcheck=true&fl=id,a_i1&group.limit=-1&sort=a_i1+asc,+id+asc&rows=100&wt=javabin&group.field=a_i1&spellcheck.build=true&group=true} hits=0 status=0 QTime=0
2> 15385 INFO (qtp1466210008-271-null-27) [ x:collection1 t:null-27] o.a.s.c.S.Request path=/select params={df=subject&group.distributed.first=true&distrib=false&fl=id&group.limit=-1&shards.purpose=2048&start=0&sort=a_i1+asc,+id+asc&rows=100&spellcheck.build=true&q=kings&spellcheck=true&omitHeader=false&NOW=1785610802187&isShard=true&wt=javabin&group.field=a_i1&group=true} status=0 QTime=0
2> 15385 INFO (qtp1255519943-249-null-27) [ x:collection1 t:null-27] o.a.s.c.S.Request path=/select params={df=subject&group.distributed.first=true&distrib=false&fl=id&group.limit=-1&shards.purpose=2048&start=0&sort=a_i1+asc,+id+asc&rows=100&spellcheck.build=true&q=kings&spellcheck=true&omitHeader=false&NOW=1785610802187&isShard=true&wt=javabin&group.field=a_i1&group=true} status=0 QTime=0
2> 15386 INFO (qtp1255519943-248-null-27) [ x:collection1 t:null-27] o.a.s.c.S.Request path=/select params={q=kings&shards=http://127.0.0.1:42357/solr/collection1,127.0.0.1:6/solr|127.0.0.1:8/solr|127.0.0.1:4/solr|http://127.0.0.1:43221/solr/collection1&df=subject&spellcheck=true&fl=id,a_i1&group.limit=-1&sort=a_i1+asc,+id+asc&rows=100&wt=javabin&group.field=a_i1&spellcheck.build=true&group=true} status=0 QTime=3
2> 15391 INFO (qtp2053781097-229-null-28) [ x:collection1 t:null-28] o.a.s.c.S.Request path=/select params={q=*:*&facet.field=a_t&group.truncate=true&fl=id,a_i1&group.limit=-1&fq=a_s:a&sort=a_i1+asc,+id+asc&rows=100&facet=true&wt=javabin&group.field=a_i1&group=true} hits=0 status=0 QTime=3
2> 15396 INFO (qtp1255519943-251-null-29) [ x:collection1 t:null-29] o.a.s.c.S.Request path=/select params={facet.field=a_t&group.distributed.first=true&distrib=false&fl=id&group.limit=-1&shards.purpose=2048&start=0&fq=a_s:a&sort=a_i1+asc,+id+asc&rows=100&q=*:*&group.truncate=true&omitHeader=false&NOW=1785610802198&isShard=true&facet=false&wt=javabin&group.field=a_i1&group=true} status=0 QTime=0
2> 15397 INFO (qtp1466210008-273-null-29) [ x:collection1 t:null-29] o.a.s.c.S.Request path=/select params={facet.field=a_t&group.distributed.first=true&distrib=false&fl=id&group.limit=-1&shards.purpose=2048&start=0&fq=a_s:a&sort=a_i1+asc,+id+asc&rows=100&q=*:*&group.truncate=true&omitHeader=false&NOW=1785610802198&isShard=true&facet=false&wt=javabin&group.field=a_i1&group=true} status=0 QTime=0
2> 15399 INFO (qtp1255519943-250-null-29) [ x:collection1 t:null-29] o.a.s.c.S.Request path=/select params={facet.field=a_t&distrib=false&fl=id&group.limit=-1&shards.purpose=20&start=0&f.a_t.facet.mincount=0&fq=a_s:a&sort=a_i1+asc,+id+asc&rows=100&group.distributed.second=true&q=*:*&f.a_t.facet.limit=160&group.truncate=true&omitHeader=false&NOW=1785610802198&isShard=true&facet=true&wt=javabin&group.field=a_i1&group=true} status=0 QTime=0
2> 15400 INFO (qtp1466210008-272-null-29) [ x:collection1 t:null-29] o.a.s.c.S.Request path=/select params={facet.field=a_t&distrib=false&fl=id&group.limit=-1&shards.purpose=20&start=0&f.a_t.facet.mincount=0&fq=a_s:a&sort=a_i1+asc,+id+asc&rows=100&group.distributed.second=true&q=*:*&f.a_t.facet.limit=160&group.truncate=true&omitHeader=false&NOW=1785610802198&isShard=true&facet=true&wt=javabin&group.field=a_i1&group=true} status=0 QTime=0
2> 15401 INFO (qtp1255519943-253-null-29) [ x:collection1 t:null-29] o.a.s.c.S.Request path=/select params={facet.field=a_t&fl=id,a_i1&group.limit=-1&fq=a_s:a&sort=a_i1+asc,+id+asc&rows=100&q=*:*&shards=http://127.0.0.1:42357/solr/collection1,http://127.0.0.1:43221/solr/collection1&group.truncate=true&facet=true&wt=javabin&group.field=a_i1&group=true} status=0 QTime=7
2> 15422 INFO (qtp2053781097-230-null-30) [ x:collection1 t:null-30] o.a.s.u.p.LogUpdateProcessorFactory path=/updat
[...truncated too long message...]
ror: Locale provider adapter "CLDR"cannot be instantiated.
java.security.policy: error adding Permission, java.net.URLPermission:
java.util.ServiceConfigurationError: Locale provider adapter "CLDR"cannot be instantiated.
java.security.policy: error adding Permission, java.net.URLPermission:
java.util.ServiceConfigurationError: Locale provider adapter "CLDR"cannot be instantiated.
java.security.policy: error adding Permission, java.net.URLPermission:
java.util.ServiceConfigurationError: Locale provider adapter "CLDR"cannot be instantiated.
java.security.policy: error adding Permission, java.net.URLPermission:
java.util.ServiceConfigurationError: Locale provider adapter "CLDR"cannot be instantiated.
java.security.policy: error adding Permission, java.net.URLPermission:
java.util.ServiceConfigurationError: Locale provider adapter "CLDR"cannot be instantiated.
java.security.policy: error adding Permission, java.net.URLPermission:
java.util.ServiceConfigurationError: Locale provider adapter "CLDR"cannot be instantiated.
java.security.policy: error adding Permission, java.net.URLPermission:
java.util.ServiceConfigurationError: Locale provider adapter "CLDR"cannot be instantiated.
java.security.policy: error adding Permission, java.net.URLPermission:
java.util.ServiceConfigurationError: Locale provider adapter "CLDR"cannot be instantiated.
java.security.policy: error adding Permission, java.net.URLPermission:
java.util.ServiceConfigurationError: Locale provider adapter "CLDR"cannot be instantiated.
java.security.policy: error adding Permission, java.net.URLPermission:
java.util.ServiceConfigurationError: Locale provider adapter "CLDR"cannot be instantiated.
java.security.policy: error adding Permission, java.net.URLPermission:
java.util.ServiceConfigurationError: Locale provider adapter "CLDR"cannot be instantiated.
java.security.policy: error adding Permission, java.net.URLPermission:
java.util.ServiceConfigurationError: Locale provider adapter "CLDR"cannot be instantiated.
java.security.policy: error adding Permission, java.net.URLPermission:
java.util.ServiceConfigurationError: Locale provider adapter "CLDR"cannot be instantiated.
java.security.policy: error adding Permission, java.net.URLPermission:
java.util.ServiceConfigurationError: Locale provider adapter "CLDR"cannot be instantiated.
:solr:modules:scripting:test (SUCCESS): 24 test(s), 19 skipped
> Task :solr:modules:scripting:wipeTaskTemp
> Task :solr:modules:sql:compileTestJava
> Task :solr:modules:sql:testClasses
> Task :solr:modules:sql:test
WARNING: Using incubator modules: jdk.incubator.vector
WARNING: Using incubator modules: jdk.incubator.vector
WARNING: Using incubator modules: jdk.incubator.vector
WARNING: A command line option has enabled the Security Manager
WARNING: The Security Manager is deprecated and will be removed in a future release
WARNING: A command line option has enabled the Security Manager
WARNING: The Security Manager is deprecated and will be removed in a future release
WARNING: A command line option has enabled the Security Manager
WARNING: The Security Manager is deprecated and will be removed in a future release
java.security.policy: error adding Permission, java.net.URLPermission:
java.security.policy: error adding Permission, java.net.URLPermission:
java.util.ServiceConfigurationError: Locale provider adapter "CLDR"cannot be instantiated.
java.util.ServiceConfigurationError: Locale provider adapter "CLDR"cannot be instantiated.
java.security.policy: error adding Permission, java.net.URLPermission:
java.util.ServiceConfigurationError: Locale provider adapter "CLDR"cannot be instantiated.
java.security.policy: error adding Permission, java.net.URLPermission:
java.util.ServiceConfigurationError: Locale provider adapter "CLDR"cannot be instantiated.
java.security.policy: error adding Permission, java.net.URLPermission:
java.util.ServiceConfigurationError: Locale provider adapter "CLDR"cannot be instantiated.
java.security.policy: error adding Permission, java.net.URLPermission:
java.util.ServiceConfigurationError: Locale provider adapter "CLDR"cannot be instantiated.
java.security.policy: error adding Permission, java.net.URLPermission:
java.util.ServiceConfigurationError: Locale provider adapter "CLDR"cannot be instantiated.
java.security.policy: error adding Permission, java.net.URLPermission:
java.util.ServiceConfigurationError: Locale provider adapter "CLDR"cannot be instantiated.
java.security.policy: error adding Permission, java.net.URLPermission:
java.util.ServiceConfigurationError: Locale provider adapter "CLDR"cannot be instantiated.
java.security.policy: error adding Permission, java.net.URLPermission:
java.util.ServiceConfigurationError: Locale provider adapter "CLDR"cannot be instantiated.
java.security.policy: error adding Permission, java.net.URLPermission:
java.util.ServiceConfigurationError: Locale provider adapter "CLDR"cannot be instantiated.
java.security.policy: error adding Permission, java.net.URLPermission:
java.util.ServiceConfigurationError: Locale provider adapter "CLDR"cannot be instantiated.
java.security.policy: error adding Permission, java.net.URLPermission:
java.util.ServiceConfigurationError: Locale provider adapter "CLDR"cannot be instantiated.
java.security.policy: error adding Permission, java.net.URLPermission:
java.util.ServiceConfigurationError: Locale provider adapter "CLDR"cannot be instantiated.
java.security.policy: error adding Permission, java.net.URLPermission:
java.util.ServiceConfigurationError: Locale provider adapter "CLDR"cannot be instantiated.
:solr:modules:sql:test (SUCCESS): 34 test(s)
> Task :checkWorkingCopyClean
> Task :solr:modules:sql:wipeTaskTemp
The slowest tests (exceeding 500 ms) during this run:
864.47s TestInPlaceUpdatesDistrib.test (:solr:core)
64.94s TestCpuAllowedLimit.testDistribLimit2 (:solr:core)
59.49s TestCpuAllowedLimit.testDistribLimit (:solr:core)
43.15s TestRandomCollapseQParserPlugin.testRandomCollapseWithSort (:solr:core)
41.11s UnloadDistributedZkTest.test (:solr:core)
41.07s BasicDistributedZkTest.test (:solr:core)
40.15s HttpJettySolrClientTest.testIdleTimeoutWithHttpClient (:solr:solrj-jetty)
39.55s PeerSyncReplicationTest.test (:solr:core)
39.42s SyncSliceTest.test (:solr:core)
37.10s TestRandomFaceting.testRandomFaceting (:solr:core)
The slowest suites (exceeding 1s) during this run:
865.36s TestInPlaceUpdatesDistrib (:solr:core)
133.62s TestCpuAllowedLimit (:solr:core)
74.32s KnnQParserTest (:solr:core)
73.96s TestCoordinatorRole (:solr:core)
65.79s MultiThreadedOCPTest (:solr:core)
63.39s TestRecovery (:solr:core)
58.54s TestPullReplica (:solr:core)
57.80s TestInPlaceUpdatesStandalone (:solr:core)
52.71s ReindexCollectionTest (:solr:core)
52.70s SolrAndKafkaIntegrationTest (:solr:cross-dc-manager)
ERROR: The following test(s) have failed:
- org.apache.solr.TestDistributedGrouping.test (:solr:core)
Test history: https://develocity.apache.org/scans/tests?search.rootProjectNames=solr-root&tests.container=org.apache.solr.TestDistributedGrouping&tests.test=test http://fucit.org/solr-jenkins-reports/history-trend-of-recent-failures.html#series/org.apache.solr.TestDistributedGrouping.test
Test output: /home/jenkins/jenkins-agent/workspace/Solr/Solr-Test-main/solr/core/build/test-results/test/outputs/OUTPUT-org.apache.solr.TestDistributedGrouping.txt
Reproduce with: ./gradlew :solr:core:test --tests "org.apache.solr.TestDistributedGrouping.test" -Ptests.haltonfailure=false "-Ptests.jvmargs=-XX:TieredStopAtLevel=1 -XX:+UseParallelGC -XX:ActiveProcessorCount=1 -XX:ReservedCodeCacheSize=120m" -Ptests.seed=9FC7351F4FBF964C -Ptests.multiplier=2 -Ptests.useSecurityManager=true -Ptests.badapples=false -Ptests.file.encoding=ISO-8859-1
- org.apache.solr.cloud.RecoveryAfterSoftCommitTest.test (:solr:core)
Test history: https://develocity.apache.org/scans/tests?search.rootProjectNames=solr-root&tests.container=org.apache.solr.cloud.RecoveryAfterSoftCommitTest&tests.test=test http://fucit.org/solr-jenkins-reports/history-trend-of-recent-failures.html#series/org.apache.solr.cloud.RecoveryAfterSoftCommitTest.test
Test output: /home/jenkins/jenkins-agent/workspace/Solr/Solr-Test-main/solr/core/build/test-results/test/outputs/OUTPUT-org.apache.solr.cloud.RecoveryAfterSoftCommitTest.txt
Reproduce with: ./gradlew :solr:core:test --tests "org.apache.solr.cloud.RecoveryAfterSoftCommitTest.test" -Ptests.haltonfailure=false "-Ptests.jvmargs=-XX:TieredStopAtLevel=1 -XX:+UseParallelGC -XX:ActiveProcessorCount=1 -XX:ReservedCodeCacheSize=120m" -Ptests.seed=9FC7351F4FBF964C -Ptests.multiplier=2 -Ptests.useSecurityManager=true -Ptests.badapples=false -Ptests.file.encoding=ISO-8859-1
[Incubating] Problems report is available at: file:///home/jenkins/jenkins-agent/workspace/Solr/Solr-Test-main/build/reports/problems/problems-report.html
Deprecated Gradle features were used in this build, making it incompatible with Gradle 10.
You can use '--warning-mode all' to show the individual deprecation warnings and determine if they come from your own scripts or plugins.
For more on this, please refer to https://docs.gradle.org/9.6.0/userguide/command_line_interface.html#sec:command_line_warnings in the Gradle documentation.
BUILD SUCCESSFUL in 54m 24s
153 actionable tasks: 153 executed
Publishing Build Scan to Develocity...
https://develocity.apache.org/s/jltcchdvoiffu
Build step 'Invoke Gradle script' changed build result to SUCCESS
Archiving artifacts
‘**/*.events’ doesn’t match anything: ‘**’ exists but not ‘**/*.events’
No artifacts found that match the file pattern "**/*.events,heapdumps/**,**/hs_err_pid*". Configuration error?
Recording test results
[Checks API] No suitable checks publisher found.
Build step 'Publish JUnit test result report' changed build result to UNSTABLE
Email was triggered for: Unstable (Test Failures)
Sending email for trigger: Unstable (Test Failures)