You are viewing a plain text version of this content. The canonical link for it is here.
Posted to builds@beam.apache.org by Apache Jenkins Server <je...@builds.apache.org> on 2023/02/05 23:49:34 UTC
Build failed in Jenkins: beam_PostCommit_XVR_Direct #3715
See <https://ci-beam.apache.org/job/beam_PostCommit_XVR_Direct/3715/display/redirect?page=changes>
Changes:
[noreply] Clarify llm download/loading instructions (#25145)
------------------------------------------
[...truncated 1.29 MB...]
File "<https://ci-beam.apache.org/job/beam_PostCommit_XVR_Direct/ws/src/build/gradleenv/1922375555/lib/python3.7/site-packages/_pytest/capture.py",> line 630, in _get_multicapture
return MultiCapture(in_=FDCapture(0), out=FDCapture(1), err=FDCapture(2))
File "<https://ci-beam.apache.org/job/beam_PostCommit_XVR_Direct/ws/src/build/gradleenv/1922375555/lib/python3.7/site-packages/_pytest/capture.py",> line 388, in __init__
TemporaryFile(buffering=0),
File "/usr/lib/python3.7/tempfile.py", line 725, in TemporaryFile
prefix, suffix, dir, output_type = _sanitize_params(prefix, suffix, dir)
File "/usr/lib/python3.7/tempfile.py", line 265, in _sanitize_params
dir = gettempdir()
File "/usr/lib/python3.7/tempfile.py", line 433, in gettempdir
tempdir = _get_default_tempdir()
File "/usr/lib/python3.7/tempfile.py", line 368, in _get_default_tempdir
dirlist)
FileNotFoundError: [Errno 2] No usable temporary directory found in ['/tmp', '/var/tmp', '/usr/tmp', '<https://ci-beam.apache.org/job/beam_PostCommit_XVR_Direct/ws/src/sdks/python']>
> Task :sdks:python:test-suites:direct:xlang:validatesCrossLanguageRunnerPythonUsingSql FAILED
Traceback (most recent call last):
File "<https://ci-beam.apache.org/job/beam_PostCommit_XVR_Direct/ws/src/build/gradleenv/1922375555/bin/pytest",> line 8, in <module>
sys.exit(console_main())
File "<https://ci-beam.apache.org/job/beam_PostCommit_XVR_Direct/ws/src/build/gradleenv/1922375555/lib/python3.7/site-packages/_pytest/config/__init__.py",> line 190, in console_main
code = main()
File "<https://ci-beam.apache.org/job/beam_PostCommit_XVR_Direct/ws/src/build/gradleenv/1922375555/lib/python3.7/site-packages/_pytest/config/__init__.py",> line 148, in main
config = _prepareconfig(args, plugins)
File "<https://ci-beam.apache.org/job/beam_PostCommit_XVR_Direct/ws/src/build/gradleenv/1922375555/lib/python3.7/site-packages/_pytest/config/__init__.py",> line 330, in _prepareconfig
pluginmanager=pluginmanager, args=args
File "<https://ci-beam.apache.org/job/beam_PostCommit_XVR_Direct/ws/src/build/gradleenv/1922375555/lib/python3.7/site-packages/pluggy/_hooks.py",> line 265, in __call__
return self._hookexec(self.name, self.get_hookimpls(), kwargs, firstresult)
File "<https://ci-beam.apache.org/job/beam_PostCommit_XVR_Direct/ws/src/build/gradleenv/1922375555/lib/python3.7/site-packages/pluggy/_manager.py",> line 80, in _hookexec
return self._inner_hookexec(hook_name, methods, kwargs, firstresult)
File "<https://ci-beam.apache.org/job/beam_PostCommit_XVR_Direct/ws/src/build/gradleenv/1922375555/lib/python3.7/site-packages/pluggy/_callers.py",> line 55, in _multicall
gen.send(outcome)
File "<https://ci-beam.apache.org/job/beam_PostCommit_XVR_Direct/ws/src/build/gradleenv/1922375555/lib/python3.7/site-packages/_pytest/helpconfig.py",> line 103, in pytest_cmdline_parse
config: Config = outcome.get_result()
File "<https://ci-beam.apache.org/job/beam_PostCommit_XVR_Direct/ws/src/build/gradleenv/1922375555/lib/python3.7/site-packages/pluggy/_result.py",> line 60, in get_result
raise ex[1].with_traceback(ex[2])
File "<https://ci-beam.apache.org/job/beam_PostCommit_XVR_Direct/ws/src/build/gradleenv/1922375555/lib/python3.7/site-packages/pluggy/_callers.py",> line 39, in _multicall
res = hook_impl.function(*args)
File "<https://ci-beam.apache.org/job/beam_PostCommit_XVR_Direct/ws/src/build/gradleenv/1922375555/lib/python3.7/site-packages/_pytest/config/__init__.py",> line 1058, in pytest_cmdline_parse
self.parse(args)
File "<https://ci-beam.apache.org/job/beam_PostCommit_XVR_Direct/ws/src/build/gradleenv/1922375555/lib/python3.7/site-packages/_pytest/config/__init__.py",> line 1346, in parse
self._preparse(args, addopts=addopts)
File "<https://ci-beam.apache.org/job/beam_PostCommit_XVR_Direct/ws/src/build/gradleenv/1922375555/lib/python3.7/site-packages/_pytest/config/__init__.py",> line 1249, in _preparse
early_config=self, args=args, parser=self._parser
File "<https://ci-beam.apache.org/job/beam_PostCommit_XVR_Direct/ws/src/build/gradleenv/1922375555/lib/python3.7/site-packages/pluggy/_hooks.py",> line 265, in __call__
return self._hookexec(self.name, self.get_hookimpls(), kwargs, firstresult)
File "<https://ci-beam.apache.org/job/beam_PostCommit_XVR_Direct/ws/src/build/gradleenv/1922375555/lib/python3.7/site-packages/pluggy/_manager.py",> line 80, in _hookexec
return self._inner_hookexec(hook_name, methods, kwargs, firstresult)
File "<https://ci-beam.apache.org/job/beam_PostCommit_XVR_Direct/ws/src/build/gradleenv/1922375555/lib/python3.7/site-packages/pluggy/_callers.py",> line 60, in _multicall
return outcome.get_result()
File "<https://ci-beam.apache.org/job/beam_PostCommit_XVR_Direct/ws/src/build/gradleenv/1922375555/lib/python3.7/site-packages/pluggy/_result.py",> line 60, in get_result
raise ex[1].with_traceback(ex[2])
File "<https://ci-beam.apache.org/job/beam_PostCommit_XVR_Direct/ws/src/build/gradleenv/1922375555/lib/python3.7/site-packages/pluggy/_callers.py",> line 34, in _multicall
next(gen) # first yield
File "<https://ci-beam.apache.org/job/beam_PostCommit_XVR_Direct/ws/src/build/gradleenv/1922375555/lib/python3.7/site-packages/_pytest/capture.py",> line 141, in pytest_load_initial_conftests
capman.start_global_capturing()
File "<https://ci-beam.apache.org/job/beam_PostCommit_XVR_Direct/ws/src/build/gradleenv/1922375555/lib/python3.7/site-packages/_pytest/capture.py",> line 688, in start_global_capturing
self._global_capturing = _get_multicapture(self._method)
File "<https://ci-beam.apache.org/job/beam_PostCommit_XVR_Direct/ws/src/build/gradleenv/1922375555/lib/python3.7/site-packages/_pytest/capture.py",> line 630, in _get_multicapture
return MultiCapture(in_=FDCapture(0), out=FDCapture(1), err=FDCapture(2))
File "<https://ci-beam.apache.org/job/beam_PostCommit_XVR_Direct/ws/src/build/gradleenv/1922375555/lib/python3.7/site-packages/_pytest/capture.py",> line 388, in __init__
TemporaryFile(buffering=0),
File "/usr/lib/python3.7/tempfile.py", line 725, in TemporaryFile
prefix, suffix, dir, output_type = _sanitize_params(prefix, suffix, dir)
File "/usr/lib/python3.7/tempfile.py", line 265, in _sanitize_params
dir = gettempdir()
File "/usr/lib/python3.7/tempfile.py", line 433, in gettempdir
tempdir = _get_default_tempdir()
File "/usr/lib/python3.7/tempfile.py", line 368, in _get_default_tempdir
dirlist)
FileNotFoundError: [Errno 2] No usable temporary directory found in ['/tmp', '/var/tmp', '/usr/tmp', '<https://ci-beam.apache.org/job/beam_PostCommit_XVR_Direct/ws/src/sdks/python']>
> Task :sdks:python:test-suites:direct:xlang:fnApiJobServerCleanup
> Task :sdks:python:test-suites:direct:xlang:validatesCrossLanguageRunnerCleanup
FAILURE: Build completed with 3 failures.
1: Task failed with an exception.
-----------
* What went wrong:
Execution failed for task ':sdks:python:test-suites:direct:xlang:validatesCrossLanguageRunnerJavaUsingPython'.
> Multiple build operations failed.
Could not write XML test results for org.apache.beam.sdk.extensions.python.transforms.DataframeTransformTest to file <https://ci-beam.apache.org/job/beam_PostCommit_XVR_Direct/ws/src/sdks/python/test-suites/direct/xlang/build/test-results/validatesCrossLanguageRunnerJavaUsingPython/TEST-org.apache.beam.sdk.extensions.python.transforms.DataframeTransformTest.xml.>
Could not write XML test results for org.apache.beam.sdk.extensions.python.transforms.PythonMapTest to file <https://ci-beam.apache.org/job/beam_PostCommit_XVR_Direct/ws/src/sdks/python/test-suites/direct/xlang/build/test-results/validatesCrossLanguageRunnerJavaUsingPython/TEST-org.apache.beam.sdk.extensions.python.transforms.PythonMapTest.xml.>
Could not write XML test results for org.apache.beam.runners.core.construction.CoderTranslationTest$ToFromProtoTest to file <https://ci-beam.apache.org/job/beam_PostCommit_XVR_Direct/ws/src/sdks/python/test-suites/direct/xlang/build/test-results/validatesCrossLanguageRunnerJavaUsingPython/TEST-org.apache.beam.runners.core.construction.CoderTranslationTest$ToFromProtoTest.xml.>
Could not write XML test results for org.apache.beam.runners.core.construction.ValidateRunnerXlangTest$PartitionTest to file <https://ci-beam.apache.org/job/beam_PostCommit_XVR_Direct/ws/src/sdks/python/test-suites/direct/xlang/build/test-results/validatesCrossLanguageRunnerJavaUsingPython/TEST-org.apache.beam.runners.core.construction.ValidateRunnerXlangTest$PartitionTest.xml.>
Could not write XML test results for org.apache.beam.runners.core.construction.ValidateRunnerXlangTest$PythonDependenciesTest to file <https://ci-beam.apache.org/job/beam_PostCommit_XVR_Direct/ws/src/sdks/python/test-suites/direct/xlang/build/test-results/validatesCrossLanguageRunnerJavaUsingPython/TEST-org.apache.beam.runners.core.construction.ValidateRunnerXlangTest$PythonDependenciesTest.xml.>
Could not write XML test results for org.apache.beam.runners.core.construction.ValidateRunnerXlangTest$CombineGloballyTest to file <https://ci-beam.apache.org/job/beam_PostCommit_XVR_Direct/ws/src/sdks/python/test-suites/direct/xlang/build/test-results/validatesCrossLanguageRunnerJavaUsingPython/TEST-org.apache.beam.runners.core.construction.ValidateRunnerXlangTest$CombineGloballyTest.xml.>
Could not write XML test results for org.apache.beam.runners.core.construction.ValidateRunnerXlangTest$FlattenTest to file <https://ci-beam.apache.org/job/beam_PostCommit_XVR_Direct/ws/src/sdks/python/test-suites/direct/xlang/build/test-results/validatesCrossLanguageRunnerJavaUsingPython/TEST-org.apache.beam.runners.core.construction.ValidateRunnerXlangTest$FlattenTest.xml.>
Could not write XML test results for org.apache.beam.runners.core.construction.ValidateRunnerXlangTest$SingleInputOutputTest to file <https://ci-beam.apache.org/job/beam_PostCommit_XVR_Direct/ws/src/sdks/python/test-suites/direct/xlang/build/test-results/validatesCrossLanguageRunnerJavaUsingPython/TEST-org.apache.beam.runners.core.construction.ValidateRunnerXlangTest$SingleInputOutputTest.xml.>
Could not write XML test results for org.apache.beam.runners.core.construction.ValidateRunnerXlangTest$CombinePerKeyTest to file <https://ci-beam.apache.org/job/beam_PostCommit_XVR_Direct/ws/src/sdks/python/test-suites/direct/xlang/build/test-results/validatesCrossLanguageRunnerJavaUsingPython/TEST-org.apache.beam.runners.core.construction.ValidateRunnerXlangTest$CombinePerKeyTest.xml.>
Could not write XML test results for org.apache.beam.runners.core.construction.ValidateRunnerXlangTest$MultiInputOutputWithSideInputTest to file <https://ci-beam.apache.org/job/beam_PostCommit_XVR_Direct/ws/src/sdks/python/test-suites/direct/xlang/build/test-results/validatesCrossLanguageRunnerJavaUsingPython/TEST-org.apache.beam.runners.core.construction.ValidateRunnerXlangTest$MultiInputOutputWithSideInputTest.xml.>
...and 4 more failures.
> Could not write XML test results for org.apache.beam.sdk.extensions.python.transforms.DataframeTransformTest to file <https://ci-beam.apache.org/job/beam_PostCommit_XVR_Direct/ws/src/sdks/python/test-suites/direct/xlang/build/test-results/validatesCrossLanguageRunnerJavaUsingPython/TEST-org.apache.beam.sdk.extensions.python.transforms.DataframeTransformTest.xml.>
> Could not write XML test results for org.apache.beam.sdk.extensions.python.transforms.PythonMapTest to file <https://ci-beam.apache.org/job/beam_PostCommit_XVR_Direct/ws/src/sdks/python/test-suites/direct/xlang/build/test-results/validatesCrossLanguageRunnerJavaUsingPython/TEST-org.apache.beam.sdk.extensions.python.transforms.PythonMapTest.xml.>
> Could not write XML test results for org.apache.beam.runners.core.construction.CoderTranslationTest$ToFromProtoTest to file <https://ci-beam.apache.org/job/beam_PostCommit_XVR_Direct/ws/src/sdks/python/test-suites/direct/xlang/build/test-results/validatesCrossLanguageRunnerJavaUsingPython/TEST-org.apache.beam.runners.core.construction.CoderTranslationTest$ToFromProtoTest.xml.>
> Could not write XML test results for org.apache.beam.runners.core.construction.ValidateRunnerXlangTest$PartitionTest to file <https://ci-beam.apache.org/job/beam_PostCommit_XVR_Direct/ws/src/sdks/python/test-suites/direct/xlang/build/test-results/validatesCrossLanguageRunnerJavaUsingPython/TEST-org.apache.beam.runners.core.construction.ValidateRunnerXlangTest$PartitionTest.xml.>
> Could not write XML test results for org.apache.beam.runners.core.construction.ValidateRunnerXlangTest$PythonDependenciesTest to file <https://ci-beam.apache.org/job/beam_PostCommit_XVR_Direct/ws/src/sdks/python/test-suites/direct/xlang/build/test-results/validatesCrossLanguageRunnerJavaUsingPython/TEST-org.apache.beam.runners.core.construction.ValidateRunnerXlangTest$PythonDependenciesTest.xml.>
> Could not write XML test results for org.apache.beam.runners.core.construction.ValidateRunnerXlangTest$CombineGloballyTest to file <https://ci-beam.apache.org/job/beam_PostCommit_XVR_Direct/ws/src/sdks/python/test-suites/direct/xlang/build/test-results/validatesCrossLanguageRunnerJavaUsingPython/TEST-org.apache.beam.runners.core.construction.ValidateRunnerXlangTest$CombineGloballyTest.xml.>
> Could not write XML test results for org.apache.beam.runners.core.construction.ValidateRunnerXlangTest$FlattenTest to file <https://ci-beam.apache.org/job/beam_PostCommit_XVR_Direct/ws/src/sdks/python/test-suites/direct/xlang/build/test-results/validatesCrossLanguageRunnerJavaUsingPython/TEST-org.apache.beam.runners.core.construction.ValidateRunnerXlangTest$FlattenTest.xml.>
> Could not write XML test results for org.apache.beam.runners.core.construction.ValidateRunnerXlangTest$SingleInputOutputTest to file <https://ci-beam.apache.org/job/beam_PostCommit_XVR_Direct/ws/src/sdks/python/test-suites/direct/xlang/build/test-results/validatesCrossLanguageRunnerJavaUsingPython/TEST-org.apache.beam.runners.core.construction.ValidateRunnerXlangTest$SingleInputOutputTest.xml.>
> Could not write XML test results for org.apache.beam.runners.core.construction.ValidateRunnerXlangTest$CombinePerKeyTest to file <https://ci-beam.apache.org/job/beam_PostCommit_XVR_Direct/ws/src/sdks/python/test-suites/direct/xlang/build/test-results/validatesCrossLanguageRunnerJavaUsingPython/TEST-org.apache.beam.runners.core.construction.ValidateRunnerXlangTest$CombinePerKeyTest.xml.>
> Could not write XML test results for org.apache.beam.runners.core.construction.ValidateRunnerXlangTest$MultiInputOutputWithSideInputTest to file <https://ci-beam.apache.org/job/beam_PostCommit_XVR_Direct/ws/src/sdks/python/test-suites/direct/xlang/build/test-results/validatesCrossLanguageRunnerJavaUsingPython/TEST-org.apache.beam.runners.core.construction.ValidateRunnerXlangTest$MultiInputOutputWithSideInputTest.xml.>
> Could not write XML test results for org.apache.beam.sdk.extensions.python.transforms.RunInferenceTransformTest to file <https://ci-beam.apache.org/job/beam_PostCommit_XVR_Direct/ws/src/sdks/python/test-suites/direct/xlang/build/test-results/validatesCrossLanguageRunnerJavaUsingPython/TEST-org.apache.beam.sdk.extensions.python.transforms.RunInferenceTransformTest.xml.>
> Could not write XML test results for org.apache.beam.runners.core.construction.ValidateRunnerXlangTest$GroupByKeyTest to file <https://ci-beam.apache.org/job/beam_PostCommit_XVR_Direct/ws/src/sdks/python/test-suites/direct/xlang/build/test-results/validatesCrossLanguageRunnerJavaUsingPython/TEST-org.apache.beam.runners.core.construction.ValidateRunnerXlangTest$GroupByKeyTest.xml.>
> Could not write XML test results for org.apache.beam.runners.core.construction.ValidateRunnerXlangTest$CoGroupByKeyTest to file <https://ci-beam.apache.org/job/beam_PostCommit_XVR_Direct/ws/src/sdks/python/test-suites/direct/xlang/build/test-results/validatesCrossLanguageRunnerJavaUsingPython/TEST-org.apache.beam.runners.core.construction.ValidateRunnerXlangTest$CoGroupByKeyTest.xml.>
> Could not write XML test results for org.apache.beam.sdk.extensions.python.PythonExternalTransformTest to file <https://ci-beam.apache.org/job/beam_PostCommit_XVR_Direct/ws/src/sdks/python/test-suites/direct/xlang/build/test-results/validatesCrossLanguageRunnerJavaUsingPython/TEST-org.apache.beam.sdk.extensions.python.PythonExternalTransformTest.xml.>
* Try:
> Run with --stacktrace option to get the stack trace.
> Run with --info or --debug option to get more log output.
==============================================================================
2: Task failed with an exception.
-----------
* What went wrong:
Execution failed for task ':sdks:python:test-suites:direct:xlang:validatesCrossLanguageRunnerPythonUsingJava'.
> Process 'command 'sh'' finished with non-zero exit value 1
* Try:
> Run with --stacktrace option to get the stack trace.
> Run with --info or --debug option to get more log output.
==============================================================================
3: Task failed with an exception.
-----------
* What went wrong:
Execution failed for task ':sdks:python:test-suites:direct:xlang:validatesCrossLanguageRunnerPythonUsingSql'.
> Process 'command 'sh'' finished with non-zero exit value 1
* Try:
> Run with --stacktrace option to get the stack trace.
> Run with --info or --debug option to get more log output.
==============================================================================
* Get more help at https://help.gradle.org
Deprecated Gradle features were used in this build, making it incompatible with Gradle 8.0.
You can use '--warning-mode all' to show the individual deprecation warnings and determine if they come from your own scripts or plugins.
See https://docs.gradle.org/7.5.1/userguide/command_line_interface.html#sec:command_line_warnings
Execution optimizations have been disabled for 1 invalid unit(s) of work during this build to ensure correctness.
Please consult deprecation warnings for more details.
BUILD FAILED in 38m 57s
248 actionable tasks: 163 executed, 73 from cache, 12 up-to-date
Publishing build scan...
https://gradle.com/s/lipvcs2ywarrk
FAILURE: Build completed with 4 failures.
1: Task failed with an exception.
-----------
* What went wrong:
Execution failed for task ':sdks:python:test-suites:direct:xlang:validatesCrossLanguageRunnerJavaUsingPython'.
> Multiple build operations failed.
Could not write XML test results for org.apache.beam.sdk.extensions.python.transforms.DataframeTransformTest to file <https://ci-beam.apache.org/job/beam_PostCommit_XVR_Direct/ws/src/sdks/python/test-suites/direct/xlang/build/test-results/validatesCrossLanguageRunnerJavaUsingPython/TEST-org.apache.beam.sdk.extensions.python.transforms.DataframeTransformTest.xml.>
Could not write XML test results for org.apache.beam.sdk.extensions.python.transforms.PythonMapTest to file <https://ci-beam.apache.org/job/beam_PostCommit_XVR_Direct/ws/src/sdks/python/test-suites/direct/xlang/build/test-results/validatesCrossLanguageRunnerJavaUsingPython/TEST-org.apache.beam.sdk.extensions.python.transforms.PythonMapTest.xml.>
Could not write XML test results for org.apache.beam.runners.core.construction.CoderTranslationTest$ToFromProtoTest to file <https://ci-beam.apache.org/job/beam_PostCommit_XVR_Direct/ws/src/sdks/python/test-suites/direct/xlang/build/test-results/validatesCrossLanguageRunnerJavaUsingPython/TEST-org.apache.beam.runners.core.construction.CoderTranslationTest$ToFromProtoTest.xml.>
Could not write XML test results for org.apache.beam.runners.core.construction.ValidateRunnerXlangTest$PartitionTest to file <https://ci-beam.apache.org/job/beam_PostCommit_XVR_Direct/ws/src/sdks/python/test-suites/direct/xlang/build/test-results/validatesCrossLanguageRunnerJavaUsingPython/TEST-org.apache.beam.runners.core.construction.ValidateRunnerXlangTest$PartitionTest.xml.>
Could not write XML test results for org.apache.beam.runners.core.construction.ValidateRunnerXlangTest$PythonDependenciesTest to file <https://ci-beam.apache.org/job/beam_PostCommit_XVR_Direct/ws/src/sdks/python/test-suites/direct/xlang/build/test-results/validatesCrossLanguageRunnerJavaUsingPython/TEST-org.apache.beam.runners.core.construction.ValidateRunnerXlangTest$PythonDependenciesTest.xml.>
Could not write XML test results for org.apache.beam.runners.core.construction.ValidateRunnerXlangTest$CombineGloballyTest to file <https://ci-beam.apache.org/job/beam_PostCommit_XVR_Direct/ws/src/sdks/python/test-suites/direct/xlang/build/test-results/validatesCrossLanguageRunnerJavaUsingPython/TEST-org.apache.beam.runners.core.construction.ValidateRunnerXlangTest$CombineGloballyTest.xml.>
Could not write XML test results for org.apache.beam.runners.core.construction.ValidateRunnerXlangTest$FlattenTest to file <https://ci-beam.apache.org/job/beam_PostCommit_XVR_Direct/ws/src/sdks/python/test-suites/direct/xlang/build/test-results/validatesCrossLanguageRunnerJavaUsingPython/TEST-org.apache.beam.runners.core.construction.ValidateRunnerXlangTest$FlattenTest.xml.>
Could not write XML test results for org.apache.beam.runners.core.construction.ValidateRunnerXlangTest$SingleInputOutputTest to file <https://ci-beam.apache.org/job/beam_PostCommit_XVR_Direct/ws/src/sdks/python/test-suites/direct/xlang/build/test-results/validatesCrossLanguageRunnerJavaUsingPython/TEST-org.apache.beam.runners.core.construction.ValidateRunnerXlangTest$SingleInputOutputTest.xml.>
Could not write XML test results for org.apache.beam.runners.core.construction.ValidateRunnerXlangTest$CombinePerKeyTest to file <https://ci-beam.apache.org/job/beam_PostCommit_XVR_Direct/ws/src/sdks/python/test-suites/direct/xlang/build/test-results/validatesCrossLanguageRunnerJavaUsingPython/TEST-org.apache.beam.runners.core.construction.ValidateRunnerXlangTest$CombinePerKeyTest.xml.>
Could not write XML test results for org.apache.beam.runners.core.construction.ValidateRunnerXlangTest$MultiInputOutputWithSideInputTest to file <https://ci-beam.apache.org/job/beam_PostCommit_XVR_Direct/ws/src/sdks/python/test-suites/direct/xlang/build/test-results/validatesCrossLanguageRunnerJavaUsingPython/TEST-org.apache.beam.runners.core.construction.ValidateRunnerXlangTest$MultiInputOutputWithSideInputTest.xml.>
...and 4 more failures.
> Could not write XML test results for org.apache.beam.sdk.extensions.python.transforms.DataframeTransformTest to file <https://ci-beam.apache.org/job/beam_PostCommit_XVR_Direct/ws/src/sdks/python/test-suites/direct/xlang/build/test-results/validatesCrossLanguageRunnerJavaUsingPython/TEST-org.apache.beam.sdk.extensions.python.transforms.DataframeTransformTest.xml.>
> Could not write XML test results for org.apache.beam.sdk.extensions.python.transforms.PythonMapTest to file <https://ci-beam.apache.org/job/beam_PostCommit_XVR_Direct/ws/src/sdks/python/test-suites/direct/xlang/build/test-results/validatesCrossLanguageRunnerJavaUsingPython/TEST-org.apache.beam.sdk.extensions.python.transforms.PythonMapTest.xml.>
> Could not write XML test results for org.apache.beam.runners.core.construction.CoderTranslationTest$ToFromProtoTest to file <https://ci-beam.apache.org/job/beam_PostCommit_XVR_Direct/ws/src/sdks/python/test-suites/direct/xlang/build/test-results/validatesCrossLanguageRunnerJavaUsingPython/TEST-org.apache.beam.runners.core.construction.CoderTranslationTest$ToFromProtoTest.xml.>
> Could not write XML test results for org.apache.beam.runners.core.construction.ValidateRunnerXlangTest$PartitionTest to file <https://ci-beam.apache.org/job/beam_PostCommit_XVR_Direct/ws/src/sdks/python/test-suites/direct/xlang/build/test-results/validatesCrossLanguageRunnerJavaUsingPython/TEST-org.apache.beam.runners.core.construction.ValidateRunnerXlangTest$PartitionTest.xml.>
> Could not write XML test results for org.apache.beam.runners.core.construction.ValidateRunnerXlangTest$PythonDependenciesTest to file <https://ci-beam.apache.org/job/beam_PostCommit_XVR_Direct/ws/src/sdks/python/test-suites/direct/xlang/build/test-results/validatesCrossLanguageRunnerJavaUsingPython/TEST-org.apache.beam.runners.core.construction.ValidateRunnerXlangTest$PythonDependenciesTest.xml.>
> Could not write XML test results for org.apache.beam.runners.core.construction.ValidateRunnerXlangTest$CombineGloballyTest to file <https://ci-beam.apache.org/job/beam_PostCommit_XVR_Direct/ws/src/sdks/python/test-suites/direct/xlang/build/test-results/validatesCrossLanguageRunnerJavaUsingPython/TEST-org.apache.beam.runners.core.construction.ValidateRunnerXlangTest$CombineGloballyTest.xml.>
> Could not write XML test results for org.apache.beam.runners.core.construction.ValidateRunnerXlangTest$FlattenTest to file <https://ci-beam.apache.org/job/beam_PostCommit_XVR_Direct/ws/src/sdks/python/test-suites/direct/xlang/build/test-results/validatesCrossLanguageRunnerJavaUsingPython/TEST-org.apache.beam.runners.core.construction.ValidateRunnerXlangTest$FlattenTest.xml.>
> Could not write XML test results for org.apache.beam.runners.core.construction.ValidateRunnerXlangTest$SingleInputOutputTest to file <https://ci-beam.apache.org/job/beam_PostCommit_XVR_Direct/ws/src/sdks/python/test-suites/direct/xlang/build/test-results/validatesCrossLanguageRunnerJavaUsingPython/TEST-org.apache.beam.runners.core.construction.ValidateRunnerXlangTest$SingleInputOutputTest.xml.>
> Could not write XML test results for org.apache.beam.runners.core.construction.ValidateRunnerXlangTest$CombinePerKeyTest to file <https://ci-beam.apache.org/job/beam_PostCommit_XVR_Direct/ws/src/sdks/python/test-suites/direct/xlang/build/test-results/validatesCrossLanguageRunnerJavaUsingPython/TEST-org.apache.beam.runners.core.construction.ValidateRunnerXlangTest$CombinePerKeyTest.xml.>
> Could not write XML test results for org.apache.beam.runners.core.construction.ValidateRunnerXlangTest$MultiInputOutputWithSideInputTest to file <https://ci-beam.apache.org/job/beam_PostCommit_XVR_Direct/ws/src/sdks/python/test-suites/direct/xlang/build/test-results/validatesCrossLanguageRunnerJavaUsingPython/TEST-org.apache.beam.runners.core.construction.ValidateRunnerXlangTest$MultiInputOutputWithSideInputTest.xml.>
> Could not write XML test results for org.apache.beam.sdk.extensions.python.transforms.RunInferenceTransformTest to file <https://ci-beam.apache.org/job/beam_PostCommit_XVR_Direct/ws/src/sdks/python/test-suites/direct/xlang/build/test-results/validatesCrossLanguageRunnerJavaUsingPython/TEST-org.apache.beam.sdk.extensions.python.transforms.RunInferenceTransformTest.xml.>
> Could not write XML test results for org.apache.beam.runners.core.construction.ValidateRunnerXlangTest$GroupByKeyTest to file <https://ci-beam.apache.org/job/beam_PostCommit_XVR_Direct/ws/src/sdks/python/test-suites/direct/xlang/build/test-results/validatesCrossLanguageRunnerJavaUsingPython/TEST-org.apache.beam.runners.core.construction.ValidateRunnerXlangTest$GroupByKeyTest.xml.>
> Could not write XML test results for org.apache.beam.runners.core.construction.ValidateRunnerXlangTest$CoGroupByKeyTest to file <https://ci-beam.apache.org/job/beam_PostCommit_XVR_Direct/ws/src/sdks/python/test-suites/direct/xlang/build/test-results/validatesCrossLanguageRunnerJavaUsingPython/TEST-org.apache.beam.runners.core.construction.ValidateRunnerXlangTest$CoGroupByKeyTest.xml.>
> Could not write XML test results for org.apache.beam.sdk.extensions.python.PythonExternalTransformTest to file <https://ci-beam.apache.org/job/beam_PostCommit_XVR_Direct/ws/src/sdks/python/test-suites/direct/xlang/build/test-results/validatesCrossLanguageRunnerJavaUsingPython/TEST-org.apache.beam.sdk.extensions.python.PythonExternalTransformTest.xml.>
* Try:
> Run with --stacktrace option to get the stack trace.
> Run with --info or --debug option to get more log output.
> Run with --scan to get full insights.
==============================================================================
2: Task failed with an exception.
-----------
* What went wrong:
Execution failed for task ':sdks:python:test-suites:direct:xlang:validatesCrossLanguageRunnerPythonUsingJava'.
> Process 'command 'sh'' finished with non-zero exit value 1
* Try:
> Run with --stacktrace option to get the stack trace.
> Run with --info or --debug option to get more log output.
> Run with --scan to get full insights.
==============================================================================
3: Task failed with an exception.
-----------
* What went wrong:
Execution failed for task ':sdks:python:test-suites:direct:xlang:validatesCrossLanguageRunnerPythonUsingSql'.
> Process 'command 'sh'' finished with non-zero exit value 1
* Try:
> Run with --stacktrace option to get the stack trace.
> Run with --info or --debug option to get more log output.
> Run with --scan to get full insights.
==============================================================================
4: Task failed with an exception.
-----------
* What went wrong:
Could not add entry ':sdks:python:test-suites:direct:xlang:validatesCrossLanguageRunnerJavaUsingPython' to cache executionHistory.bin (<https://ci-beam.apache.org/job/beam_PostCommit_XVR_Direct/ws/src/.gradle/7.5.1/executionHistory/executionHistory.bin).>
> java.io.IOException: No space left on device
* Try:
> Run with --stacktrace option to get the stack trace.
> Run with --info or --debug option to get more log output.
> Run with --scan to get full insights.
==============================================================================
* Get more help at https://help.gradle.org
Deprecated Gradle features were used in this build, making it incompatible with Gradle 8.0.
You can use '--warning-mode all' to show the individual deprecation warnings and determine if they come from your own scripts or plugins.
See https://docs.gradle.org/7.5.1/userguide/command_line_interface.html#sec:command_line_warnings
BUILD FAILED in 38m 58s
FAILURE: Build failed with an exception.
* What went wrong:
Could not receive a message from the daemon.
* Try:
> Run with --stacktrace option to get the stack trace.
> Run with --info or --debug option to get more log output.
> Run with --scan to get full insights.
* Get more help at https://help.gradle.org
Build step 'Invoke Gradle script' changed build result to FAILURE
Build step 'Invoke Gradle script' marked build as failure
---------------------------------------------------------------------
To unsubscribe, e-mail: builds-unsubscribe@beam.apache.org
For additional commands, e-mail: builds-help@beam.apache.org
Jenkins build is back to normal : beam_PostCommit_XVR_Direct #3718
Posted by Apache Jenkins Server <je...@builds.apache.org>.
See <https://ci-beam.apache.org/job/beam_PostCommit_XVR_Direct/3718/display/redirect?page=changes>
---------------------------------------------------------------------
To unsubscribe, e-mail: builds-unsubscribe@beam.apache.org
For additional commands, e-mail: builds-help@beam.apache.org
Build failed in Jenkins: beam_PostCommit_XVR_Direct #3717
Posted by Apache Jenkins Server <je...@builds.apache.org>.
See <https://ci-beam.apache.org/job/beam_PostCommit_XVR_Direct/3717/display/redirect>
Changes:
------------------------------------------
[...truncated 1.97 MB...]
INFO apache_beam.utils.subprocess_server:subprocess_server.py:126
INFO apache_beam.utils.subprocess_server:subprocess_server.py:126 Registered transforms:
INFO apache_beam.utils.subprocess_server:subprocess_server.py:126 beam:external:java:sql:v1: org.apache.beam.sdk.expansion.service.ExpansionService$ExternalTransformRegistrarLoader$1@38425407
INFO apache_beam.utils.subprocess_server:subprocess_server.py:126 beam:transform:org.apache.beam:pubsub_read:v1: org.apache.beam.sdk.expansion.service.ExpansionService$ExternalTransformRegistrarLoader$1@43bc63a3
INFO apache_beam.utils.subprocess_server:subprocess_server.py:126 beam:transform:org.apache.beam:pubsub_write:v1: org.apache.beam.sdk.expansion.service.ExpansionService$ExternalTransformRegistrarLoader$1@702657cc
INFO apache_beam.utils.subprocess_server:subprocess_server.py:126 beam:transform:org.apache.beam:pubsublite_write:v1: org.apache.beam.sdk.expansion.service.ExpansionService$ExternalTransformRegistrarLoader$1@6a6cb05c
INFO apache_beam.utils.subprocess_server:subprocess_server.py:126 beam:transform:org.apache.beam:pubsublite_read:v1: org.apache.beam.sdk.expansion.service.ExpansionService$ExternalTransformRegistrarLoader$1@40a4337a
INFO apache_beam.utils.subprocess_server:subprocess_server.py:126 beam:transform:org.apache.beam:spanner_insert:v1: org.apache.beam.sdk.expansion.service.ExpansionService$ExternalTransformRegistrarLoader$1@6025e1b6
INFO apache_beam.utils.subprocess_server:subprocess_server.py:126 beam:transform:org.apache.beam:spanner_update:v1: org.apache.beam.sdk.expansion.service.ExpansionService$ExternalTransformRegistrarLoader$1@22ff4249
INFO apache_beam.utils.subprocess_server:subprocess_server.py:126 beam:transform:org.apache.beam:spanner_replace:v1: org.apache.beam.sdk.expansion.service.ExpansionService$ExternalTransformRegistrarLoader$1@2d1ef81a
INFO apache_beam.utils.subprocess_server:subprocess_server.py:126 beam:transform:org.apache.beam:spanner_insert_or_update:v1: org.apache.beam.sdk.expansion.service.ExpansionService$ExternalTransformRegistrarLoader$1@4c402120
INFO apache_beam.utils.subprocess_server:subprocess_server.py:126 beam:transform:org.apache.beam:spanner_delete:v1: org.apache.beam.sdk.expansion.service.ExpansionService$ExternalTransformRegistrarLoader$1@327514f
INFO apache_beam.utils.subprocess_server:subprocess_server.py:126 beam:transform:org.apache.beam:spanner_read:v1: org.apache.beam.sdk.expansion.service.ExpansionService$ExternalTransformRegistrarLoader$1@5b12b668
INFO apache_beam.utils.subprocess_server:subprocess_server.py:126 beam:transform:org.apache.beam:kafka_read_with_metadata:v1: org.apache.beam.sdk.expansion.service.ExpansionService$ExternalTransformRegistrarLoader$1@1165b38
INFO apache_beam.utils.subprocess_server:subprocess_server.py:126 beam:transform:org.apache.beam:kafka_read_without_metadata:v1: org.apache.beam.sdk.expansion.service.ExpansionService$ExternalTransformRegistrarLoader$1@4c12331b
INFO apache_beam.utils.subprocess_server:subprocess_server.py:126 beam:transform:org.apache.beam:kafka_write:v1: org.apache.beam.sdk.expansion.service.ExpansionService$ExternalTransformRegistrarLoader$1@7586beff
INFO apache_beam.utils.subprocess_server:subprocess_server.py:126 beam:external:java:generate_sequence:v1: org.apache.beam.sdk.expansion.service.ExpansionService$ExternalTransformRegistrarLoader$1@3b69e7d1
INFO apache_beam.utils.subprocess_server:subprocess_server.py:126
INFO apache_beam.utils.subprocess_server:subprocess_server.py:126 Registered SchemaTransformProviders:
INFO apache_beam.utils.subprocess_server:subprocess_server.py:126 beam:schematransform:org.apache.beam:kafka_read:v1
INFO apache_beam.utils.subprocess_server:subprocess_server.py:126 beam:schematransform:org.apache.beam:kafka_write:v1
INFO apache_beam.utils.subprocess_server:subprocess_server.py:126 beam:schematransform:org.apache.beam:bigquery_storage_write:v1
INFO apache_beam.utils.subprocess_server:subprocess_server.py:126 schematransform:org.apache.beam:sql_transform:v1
INFO apache_beam.utils.subprocess_server:subprocess_server.py:126 beam:schematransform:org.apache.beam:pubsub_read:v1
INFO apache_beam.utils.subprocess_server:subprocess_server.py:126 beam:schematransform:org.apache.beam:pubsub_write:v1
INFO apache_beam.utils.subprocess_server:subprocess_server.py:126 beam:schematransform:org.apache.beam:pubsublite_write:v1
INFO apache_beam.utils.subprocess_server:subprocess_server.py:126 beam:schematransform:org.apache.beam:spanner_write:v1
INFO apache_beam.utils.subprocess_server:subprocess_server.py:126 beam:schematransform:org.apache.beam:pubsublite_read:v1
INFO apache_beam.utils.subprocess_server:subprocess_server.py:126 beam:schematransform:org.apache.beam:bigquery_storage_read:v1
INFO apache_beam.utils.subprocess_server:subprocess_server.py:126 Feb 06, 2023 12:54:31 PM org.apache.beam.sdk.expansion.service.ExpansionService expand
INFO apache_beam.utils.subprocess_server:subprocess_server.py:126 INFO: Expanding 'SqlTransform(beam:external:java:sql:v1)' with URN 'beam:external:java:sql:v1'
INFO apache_beam.utils.subprocess_server:subprocess_server.py:126 Feb 06, 2023 12:54:32 PM org.apache.beam.sdk.expansion.service.ExpansionService$ExternalTransformRegistrarLoader payloadToConfig
INFO apache_beam.utils.subprocess_server:subprocess_server.py:126 WARNING: Configuration class 'org.apache.beam.sdk.extensions.sql.expansion.ExternalSqlTransformRegistrar$Configuration' has no schema registered. Attempting to construct with setter approach.
INFO apache_beam.utils.subprocess_server:subprocess_server.py:126 Feb 06, 2023 12:54:32 PM org.apache.beam.sdk.expansion.service.ExpansionService$ExternalTransformRegistrarLoader payloadToConfig
INFO apache_beam.utils.subprocess_server:subprocess_server.py:126 WARNING: Configuration class 'org.apache.beam.sdk.extensions.sql.expansion.ExternalSqlTransformRegistrar$Configuration' has no schema registered. Attempting to construct with setter approach.
INFO apache_beam.utils.subprocess_server:subprocess_server.py:126 Feb 06, 2023 12:54:34 PM org.apache.beam.sdk.extensions.sql.impl.CalciteQueryPlanner convertToBeamRel
INFO apache_beam.utils.subprocess_server:subprocess_server.py:126 INFO: SQL:
INFO apache_beam.utils.subprocess_server:subprocess_server.py:126 SELECT COUNT(*) AS `count`
INFO apache_beam.utils.subprocess_server:subprocess_server.py:126 FROM `beam`.`PCOLLECTION` AS `PCOLLECTION`
INFO apache_beam.utils.subprocess_server:subprocess_server.py:126 Feb 06, 2023 12:54:34 PM org.apache.beam.sdk.extensions.sql.impl.CalciteQueryPlanner convertToBeamRel
INFO apache_beam.utils.subprocess_server:subprocess_server.py:126 INFO: SQLPlan>
INFO apache_beam.utils.subprocess_server:subprocess_server.py:126 LogicalAggregate(group=[{}], count=[COUNT()])
INFO apache_beam.utils.subprocess_server:subprocess_server.py:126 BeamIOSourceRel(table=[[beam, PCOLLECTION]])
INFO apache_beam.utils.subprocess_server:subprocess_server.py:126
INFO apache_beam.utils.subprocess_server:subprocess_server.py:126 Feb 06, 2023 12:54:34 PM org.apache.beam.sdk.extensions.sql.impl.CalciteQueryPlanner convertToBeamRel
INFO apache_beam.utils.subprocess_server:subprocess_server.py:126 INFO: BEAMPlan>
INFO apache_beam.utils.subprocess_server:subprocess_server.py:126 BeamAggregationRel(group=[{}], count=[COUNT()])
INFO apache_beam.utils.subprocess_server:subprocess_server.py:126 BeamIOSourceRel(table=[[beam, PCOLLECTION]])
INFO apache_beam.utils.subprocess_server:subprocess_server.py:126
INFO root:environments.py:376 Default Python SDK image for environment is apache/beam_python3.10_sdk:2.46.0.dev
INFO root:environments.py:299 No image given, using default Python SDK image
INFO root:environments.py:376 Default Python SDK image for environment is apache/beam_python3.10_sdk:2.46.0.dev
INFO root:environments.py:302 Python SDK container image set to "apache/beam_python3.10_sdk:2.46.0.dev" for Docker environment
INFO apache_beam.runners.portability.fn_api_runner.translations:translations.py:710 ==================== <function pack_combiners at 0x7fb2a9068310> ====================
INFO apache_beam.runners.portability.fn_api_runner.translations:translations.py:710 ==================== <function lift_combiners at 0x7fb2a90683a0> ====================
INFO apache_beam.runners.portability.fn_api_runner.translations:translations.py:710 ==================== <function sort_stages at 0x7fb2a9068af0> ====================
INFO apache_beam.runners.portability.portable_runner:portable_runner.py:581 Job state changed to STOPPED
INFO apache_beam.runners.portability.portable_runner:portable_runner.py:581 Job state changed to STARTING
INFO apache_beam.runners.portability.portable_runner:portable_runner.py:581 Job state changed to RUNNING
INFO root:portable_runner.py:574 Default Python SDK image for environment is apache/beam_python3.10_sdk:2.46.0.dev
INFO root:portable_runner.py:574 ==================== <function annotate_downstream_side_inputs at 0x7efc6962fbe0> ====================
INFO root:portable_runner.py:574 ==================== <function fix_side_input_pcoll_coders at 0x7efc6962fd00> ====================
INFO root:portable_runner.py:574 ==================== <function pack_combiners at 0x7efc69634280> ====================
INFO root:portable_runner.py:574 ==================== <function lift_combiners at 0x7efc69634310> ====================
INFO root:portable_runner.py:574 ==================== <function expand_sdf at 0x7efc696344c0> ====================
INFO root:portable_runner.py:574 ==================== <function expand_gbk at 0x7efc69634550> ====================
INFO root:portable_runner.py:574 ==================== <function sink_flattens at 0x7efc69634670> ====================
INFO root:portable_runner.py:574 ==================== <function greedily_fuse at 0x7efc69634700> ====================
INFO root:portable_runner.py:574 ==================== <function read_to_impulse at 0x7efc69634790> ====================
INFO root:portable_runner.py:574 ==================== <function impulse_to_input at 0x7efc69634820> ====================
INFO root:portable_runner.py:574 ==================== <function sort_stages at 0x7efc69634a60> ====================
INFO root:portable_runner.py:574 ==================== <function add_impulse_to_dangling_transforms at 0x7efc69634b80> ====================
INFO root:portable_runner.py:574 ==================== <function setup_timer_mapping at 0x7efc696349d0> ====================
INFO root:portable_runner.py:574 ==================== <function populate_data_channel_coders at 0x7efc69634af0> ====================
INFO root:portable_runner.py:574 starting control server on port 41749
INFO root:portable_runner.py:574 starting data server on port 41557
INFO root:portable_runner.py:574 starting state server on port 42731
INFO root:portable_runner.py:574 starting logging server on port 41017
INFO root:portable_runner.py:574 Created Worker handler <apache_beam.runners.portability.fn_api_runner.worker_handlers.DockerSdkWorkerHandler object at 0x7efc695f0a60> for environment ref_Environment_default_environment_2 (beam:env:docker:v1, b'\n%apache/beam_python3.10_sdk:2.46.0.dev')
INFO root:portable_runner.py:574 Attempting to pull image apache/beam_python3.10_sdk:2.46.0.dev
INFO root:portable_runner.py:574 Unable to pull image apache/beam_python3.10_sdk:2.46.0.dev, defaulting to local image if it exists
INFO root:portable_runner.py:574 Waiting for docker to start up. Current status is running
INFO root:portable_runner.py:574 Docker container is running. container_id = b'f07e8a778b2560ec94a349cb9db25aa4f1d7c12ef4c7facc647449961b8ba4e9', worker_id = worker_58
INFO root:portable_runner.py:574 Created Worker handler <apache_beam.runners.portability.fn_api_runner.worker_handlers.DockerSdkWorkerHandler object at 0x7efc68460bb0> for environment external_8beam:env:docker:v1 (beam:env:docker:v1, b'\n apache/beam_java8_sdk:2.46.0.dev')
INFO root:portable_runner.py:574 Attempting to pull image apache/beam_java8_sdk:2.46.0.dev
INFO root:portable_runner.py:574 Unable to pull image apache/beam_java8_sdk:2.46.0.dev, defaulting to local image if it exists
INFO root:portable_runner.py:574 Waiting for docker to start up. Current status is running
INFO root:portable_runner.py:574 Docker container is running. container_id = b'd9ec7e68058b9b8e8bb0511c428d8ffd53bf69edb26f1c04cdb2bd7277dc31fa', worker_id = worker_59
INFO root:portable_runner.py:574 Completed job in 13.556046724319458 seconds with state DONE.
INFO apache_beam.runners.portability.portable_runner:portable_runner.py:581 Job state changed to DONE
PASSED [ 88%]
apache_beam/transforms/sql_test.py::SqlTransformTest::test_zetasql_generate_data
-------------------------------- live log call ---------------------------------
INFO apache_beam.utils.subprocess_server:subprocess_server.py:239 Using pre-built snapshot at <https://ci-beam.apache.org/job/beam_PostCommit_XVR_Direct/ws/src/sdks/java/extensions/sql/expansion-service/build/libs/beam-sdks-java-extensions-sql-expansion-service-2.46.0-SNAPSHOT.jar>
INFO root:external.py:850 Starting a JAR-based expansion service from JAR <https://ci-beam.apache.org/job/beam_PostCommit_XVR_Direct/ws/src/sdks/java/extensions/sql/expansion-service/build/libs/beam-sdks-java-extensions-sql-expansion-service-2.46.0-SNAPSHOT.jar>
INFO apache_beam.utils.subprocess_server:subprocess_server.py:116 Starting service with ['java' '-jar' '<https://ci-beam.apache.org/job/beam_PostCommit_XVR_Direct/ws/src/sdks/java/extensions/sql/expansion-service/build/libs/beam-sdks-java-extensions-sql-expansion-service-2.46.0-SNAPSHOT.jar'> '52183' '--filesToStage=<https://ci-beam.apache.org/job/beam_PostCommit_XVR_Direct/ws/src/sdks/java/extensions/sql/expansion-service/build/libs/beam-sdks-java-extensions-sql-expansion-service-2.46.0-SNAPSHOT.jar']>
INFO apache_beam.utils.subprocess_server:subprocess_server.py:126 Starting expansion service at localhost:52183
INFO apache_beam.utils.subprocess_server:subprocess_server.py:126 Feb 06, 2023 12:54:56 PM org.apache.beam.sdk.expansion.service.ExpansionService loadRegisteredTransforms
INFO apache_beam.utils.subprocess_server:subprocess_server.py:126 INFO: Registering external transforms: [beam:external:java:sql:v1, beam:transform:org.apache.beam:pubsub_read:v1, beam:transform:org.apache.beam:pubsub_write:v1, beam:transform:org.apache.beam:pubsublite_write:v1, beam:transform:org.apache.beam:pubsublite_read:v1, beam:transform:org.apache.beam:spanner_insert:v1, beam:transform:org.apache.beam:spanner_update:v1, beam:transform:org.apache.beam:spanner_replace:v1, beam:transform:org.apache.beam:spanner_insert_or_update:v1, beam:transform:org.apache.beam:spanner_delete:v1, beam:transform:org.apache.beam:spanner_read:v1, beam:transform:org.apache.beam:kafka_read_with_metadata:v1, beam:transform:org.apache.beam:kafka_read_without_metadata:v1, beam:transform:org.apache.beam:kafka_write:v1, beam:external:java:generate_sequence:v1]
INFO apache_beam.utils.subprocess_server:subprocess_server.py:126
INFO apache_beam.utils.subprocess_server:subprocess_server.py:126 Registered transforms:
INFO apache_beam.utils.subprocess_server:subprocess_server.py:126 beam:external:java:sql:v1: org.apache.beam.sdk.expansion.service.ExpansionService$ExternalTransformRegistrarLoader$1@38425407
INFO apache_beam.utils.subprocess_server:subprocess_server.py:126 beam:transform:org.apache.beam:pubsub_read:v1: org.apache.beam.sdk.expansion.service.ExpansionService$ExternalTransformRegistrarLoader$1@43bc63a3
INFO apache_beam.utils.subprocess_server:subprocess_server.py:126 beam:transform:org.apache.beam:pubsub_write:v1: org.apache.beam.sdk.expansion.service.ExpansionService$ExternalTransformRegistrarLoader$1@702657cc
INFO apache_beam.utils.subprocess_server:subprocess_server.py:126 beam:transform:org.apache.beam:pubsublite_write:v1: org.apache.beam.sdk.expansion.service.ExpansionService$ExternalTransformRegistrarLoader$1@6a6cb05c
INFO apache_beam.utils.subprocess_server:subprocess_server.py:126 beam:transform:org.apache.beam:pubsublite_read:v1: org.apache.beam.sdk.expansion.service.ExpansionService$ExternalTransformRegistrarLoader$1@40a4337a
INFO apache_beam.utils.subprocess_server:subprocess_server.py:126 beam:transform:org.apache.beam:spanner_insert:v1: org.apache.beam.sdk.expansion.service.ExpansionService$ExternalTransformRegistrarLoader$1@6025e1b6
INFO apache_beam.utils.subprocess_server:subprocess_server.py:126 beam:transform:org.apache.beam:spanner_update:v1: org.apache.beam.sdk.expansion.service.ExpansionService$ExternalTransformRegistrarLoader$1@22ff4249
INFO apache_beam.utils.subprocess_server:subprocess_server.py:126 beam:transform:org.apache.beam:spanner_replace:v1: org.apache.beam.sdk.expansion.service.ExpansionService$ExternalTransformRegistrarLoader$1@2d1ef81a
INFO apache_beam.utils.subprocess_server:subprocess_server.py:126 beam:transform:org.apache.beam:spanner_insert_or_update:v1: org.apache.beam.sdk.expansion.service.ExpansionService$ExternalTransformRegistrarLoader$1@4c402120
INFO apache_beam.utils.subprocess_server:subprocess_server.py:126 beam:transform:org.apache.beam:spanner_delete:v1: org.apache.beam.sdk.expansion.service.ExpansionService$ExternalTransformRegistrarLoader$1@327514f
INFO apache_beam.utils.subprocess_server:subprocess_server.py:126 beam:transform:org.apache.beam:spanner_read:v1: org.apache.beam.sdk.expansion.service.ExpansionService$ExternalTransformRegistrarLoader$1@5b12b668
INFO apache_beam.utils.subprocess_server:subprocess_server.py:126 beam:transform:org.apache.beam:kafka_read_with_metadata:v1: org.apache.beam.sdk.expansion.service.ExpansionService$ExternalTransformRegistrarLoader$1@1165b38
INFO apache_beam.utils.subprocess_server:subprocess_server.py:126 beam:transform:org.apache.beam:kafka_read_without_metadata:v1: org.apache.beam.sdk.expansion.service.ExpansionService$ExternalTransformRegistrarLoader$1@4c12331b
INFO apache_beam.utils.subprocess_server:subprocess_server.py:126 beam:transform:org.apache.beam:kafka_write:v1: org.apache.beam.sdk.expansion.service.ExpansionService$ExternalTransformRegistrarLoader$1@7586beff
INFO apache_beam.utils.subprocess_server:subprocess_server.py:126 beam:external:java:generate_sequence:v1: org.apache.beam.sdk.expansion.service.ExpansionService$ExternalTransformRegistrarLoader$1@3b69e7d1
INFO apache_beam.utils.subprocess_server:subprocess_server.py:126
INFO apache_beam.utils.subprocess_server:subprocess_server.py:126 Registered SchemaTransformProviders:
INFO apache_beam.utils.subprocess_server:subprocess_server.py:126 beam:schematransform:org.apache.beam:kafka_read:v1
INFO apache_beam.utils.subprocess_server:subprocess_server.py:126 beam:schematransform:org.apache.beam:kafka_write:v1
INFO apache_beam.utils.subprocess_server:subprocess_server.py:126 beam:schematransform:org.apache.beam:bigquery_storage_write:v1
INFO apache_beam.utils.subprocess_server:subprocess_server.py:126 schematransform:org.apache.beam:sql_transform:v1
INFO apache_beam.utils.subprocess_server:subprocess_server.py:126 beam:schematransform:org.apache.beam:pubsub_read:v1
INFO apache_beam.utils.subprocess_server:subprocess_server.py:126 beam:schematransform:org.apache.beam:pubsub_write:v1
INFO apache_beam.utils.subprocess_server:subprocess_server.py:126 beam:schematransform:org.apache.beam:pubsublite_write:v1
INFO apache_beam.utils.subprocess_server:subprocess_server.py:126 beam:schematransform:org.apache.beam:spanner_write:v1
INFO apache_beam.utils.subprocess_server:subprocess_server.py:126 beam:schematransform:org.apache.beam:pubsublite_read:v1
INFO apache_beam.utils.subprocess_server:subprocess_server.py:126 beam:schematransform:org.apache.beam:bigquery_storage_read:v1
INFO apache_beam.utils.subprocess_server:subprocess_server.py:126 Feb 06, 2023 12:54:57 PM org.apache.beam.sdk.expansion.service.ExpansionService expand
INFO apache_beam.utils.subprocess_server:subprocess_server.py:126 INFO: Expanding 'SqlTransform(beam:external:java:sql:v1)' with URN 'beam:external:java:sql:v1'
INFO apache_beam.utils.subprocess_server:subprocess_server.py:126 Feb 06, 2023 12:54:57 PM org.apache.beam.sdk.expansion.service.ExpansionService$ExternalTransformRegistrarLoader payloadToConfig
INFO apache_beam.utils.subprocess_server:subprocess_server.py:126 WARNING: Configuration class 'org.apache.beam.sdk.extensions.sql.expansion.ExternalSqlTransformRegistrar$Configuration' has no schema registered. Attempting to construct with setter approach.
INFO apache_beam.utils.subprocess_server:subprocess_server.py:126 Feb 06, 2023 12:54:58 PM org.apache.beam.sdk.expansion.service.ExpansionService$ExternalTransformRegistrarLoader payloadToConfig
INFO apache_beam.utils.subprocess_server:subprocess_server.py:126 WARNING: Configuration class 'org.apache.beam.sdk.extensions.sql.expansion.ExternalSqlTransformRegistrar$Configuration' has no schema registered. Attempting to construct with setter approach.
INFO apache_beam.utils.subprocess_server:subprocess_server.py:126 Feb 06, 2023 12:55:00 PM com.google.zetasql.io.grpc.NameResolverRegistry getDefaultRegistry
INFO apache_beam.utils.subprocess_server:subprocess_server.py:126 WARNING: No NameResolverProviders found via ServiceLoader, including for DNS. This is probably due to a broken build. If using ProGuard, check your configuration
INFO apache_beam.utils.subprocess_server:subprocess_server.py:126 Feb 06, 2023 12:55:01 PM org.apache.beam.sdk.extensions.sql.zetasql.ZetaSQLQueryPlanner convertToBeamRelInternal
INFO apache_beam.utils.subprocess_server:subprocess_server.py:126 INFO: BEAMPlan>
INFO apache_beam.utils.subprocess_server:subprocess_server.py:126 BeamZetaSqlCalcRel(expr#0=[{inputs}], expr#1=[1:BIGINT], expr#2=['foo':VARCHAR], expr#3=[3.1400000000000001243E0:DOUBLE], int=[$t1], str=[$t2], flt=[$t3])
INFO apache_beam.utils.subprocess_server:subprocess_server.py:126 BeamValuesRel(tuples=[[{ 0 }]])
INFO apache_beam.utils.subprocess_server:subprocess_server.py:126
INFO root:environments.py:376 Default Python SDK image for environment is apache/beam_python3.10_sdk:2.46.0.dev
INFO root:environments.py:299 No image given, using default Python SDK image
INFO root:environments.py:376 Default Python SDK image for environment is apache/beam_python3.10_sdk:2.46.0.dev
INFO root:environments.py:302 Python SDK container image set to "apache/beam_python3.10_sdk:2.46.0.dev" for Docker environment
INFO apache_beam.runners.portability.fn_api_runner.translations:translations.py:710 ==================== <function pack_combiners at 0x7fb2a9068310> ====================
INFO apache_beam.runners.portability.fn_api_runner.translations:translations.py:710 ==================== <function lift_combiners at 0x7fb2a90683a0> ====================
INFO apache_beam.runners.portability.fn_api_runner.translations:translations.py:710 ==================== <function sort_stages at 0x7fb2a9068af0> ====================
INFO apache_beam.runners.portability.portable_runner:portable_runner.py:581 Job state changed to STOPPED
INFO apache_beam.runners.portability.portable_runner:portable_runner.py:581 Job state changed to STARTING
INFO apache_beam.runners.portability.portable_runner:portable_runner.py:581 Job state changed to RUNNING
INFO root:portable_runner.py:574 Default Python SDK image for environment is apache/beam_python3.10_sdk:2.46.0.dev
INFO root:portable_runner.py:574 ==================== <function annotate_downstream_side_inputs at 0x7efc6962fbe0> ====================
INFO root:portable_runner.py:574 ==================== <function fix_side_input_pcoll_coders at 0x7efc6962fd00> ====================
INFO root:portable_runner.py:574 ==================== <function pack_combiners at 0x7efc69634280> ====================
INFO root:portable_runner.py:574 ==================== <function lift_combiners at 0x7efc69634310> ====================
INFO root:portable_runner.py:574 ==================== <function expand_sdf at 0x7efc696344c0> ====================
INFO root:portable_runner.py:574 ==================== <function expand_gbk at 0x7efc69634550> ====================
INFO root:portable_runner.py:574 ==================== <function sink_flattens at 0x7efc69634670> ====================
INFO root:portable_runner.py:574 ==================== <function greedily_fuse at 0x7efc69634700> ====================
INFO root:portable_runner.py:574 ==================== <function read_to_impulse at 0x7efc69634790> ====================
INFO root:portable_runner.py:574 ==================== <function impulse_to_input at 0x7efc69634820> ====================
INFO root:portable_runner.py:574 ==================== <function sort_stages at 0x7efc69634a60> ====================
INFO root:portable_runner.py:574 ==================== <function add_impulse_to_dangling_transforms at 0x7efc69634b80> ====================
INFO root:portable_runner.py:574 ==================== <function setup_timer_mapping at 0x7efc696349d0> ====================
INFO root:portable_runner.py:574 ==================== <function populate_data_channel_coders at 0x7efc69634af0> ====================
INFO root:portable_runner.py:574 starting control server on port 42327
INFO root:portable_runner.py:574 starting data server on port 46215
INFO root:portable_runner.py:574 starting state server on port 46115
INFO root:portable_runner.py:574 starting logging server on port 35115
INFO root:portable_runner.py:574 Created Worker handler <apache_beam.runners.portability.fn_api_runner.worker_handlers.DockerSdkWorkerHandler object at 0x7efc684abd90> for environment external_9beam:env:docker:v1 (beam:env:docker:v1, b'\n apache/beam_java8_sdk:2.46.0.dev')
INFO root:portable_runner.py:574 Attempting to pull image apache/beam_java8_sdk:2.46.0.dev
INFO root:portable_runner.py:574 Unable to pull image apache/beam_java8_sdk:2.46.0.dev, defaulting to local image if it exists
INFO root:portable_runner.py:574 Waiting for docker to start up. Current status is running
INFO root:portable_runner.py:574 Docker container is running. container_id = b'51645c8a680a6eb77a71348953d5de72fdd94a80d4dd8ed53199921835820bc0', worker_id = worker_60
INFO root:portable_runner.py:574 Created Worker handler <apache_beam.runners.portability.fn_api_runner.worker_handlers.DockerSdkWorkerHandler object at 0x7efc684aad10> for environment ref_Environment_default_environment_2 (beam:env:docker:v1, b'\n%apache/beam_python3.10_sdk:2.46.0.dev')
INFO root:portable_runner.py:574 Attempting to pull image apache/beam_python3.10_sdk:2.46.0.dev
INFO root:portable_runner.py:574 Unable to pull image apache/beam_python3.10_sdk:2.46.0.dev, defaulting to local image if it exists
INFO root:portable_runner.py:574 Waiting for docker to start up. Current status is running
INFO root:portable_runner.py:574 Docker container is running. container_id = b'bf32e9215a437f7975b075641dbb2d7b87f2ff573dc9fd8fab7991d514497d1c', worker_id = worker_61
INFO root:portable_runner.py:574 Completed job in 15.824428796768188 seconds with state DONE.
INFO apache_beam.runners.portability.portable_runner:portable_runner.py:581 Job state changed to DONE
PASSED [100%]
=============================== warnings summary ===============================
../../build/gradleenv/1922375555/lib/python3.10/site-packages/hdfs/config.py:15
<https://ci-beam.apache.org/job/beam_PostCommit_XVR_Direct/ws/src/build/gradleenv/1922375555/lib/python3.10/site-packages/hdfs/config.py>:15: DeprecationWarning: the imp module is deprecated in favour of importlib and slated for removal in Python 3.12; see the module's documentation for alternative uses
from imp import load_source
../../build/gradleenv/1922375555/lib/python3.10/site-packages/google/api_core/operations_v1/abstract_operations_client.py:17
<https://ci-beam.apache.org/job/beam_PostCommit_XVR_Direct/ws/src/build/gradleenv/1922375555/lib/python3.10/site-packages/google/api_core/operations_v1/abstract_operations_client.py>:17: DeprecationWarning: The distutils package is deprecated and slated for removal in Python 3.12. Use setuptools or check PEP 632 for potential alternatives
from distutils import util
../../build/gradleenv/1922375555/lib/python3.10/site-packages/tenacity/_asyncio.py:42
<https://ci-beam.apache.org/job/beam_PostCommit_XVR_Direct/ws/src/build/gradleenv/1922375555/lib/python3.10/site-packages/tenacity/_asyncio.py>:42: DeprecationWarning: "@coroutine" decorator is deprecated since Python 3.8, use "async def" instead
def call(self, fn, *args, **kwargs):
apache_beam/typehints/pandas_type_compatibility_test.py:67
<https://ci-beam.apache.org/job/beam_PostCommit_XVR_Direct/ws/src/sdks/python/apache_beam/typehints/pandas_type_compatibility_test.py>:67: FutureWarning: pandas.Int64Index is deprecated and will be removed from pandas in a future version. Use pandas.Index with the appropriate dtype instead.
}).set_index(pd.Int64Index(range(123, 223), name='an_index')),
apache_beam/typehints/pandas_type_compatibility_test.py:90
<https://ci-beam.apache.org/job/beam_PostCommit_XVR_Direct/ws/src/sdks/python/apache_beam/typehints/pandas_type_compatibility_test.py>:90: FutureWarning: pandas.Int64Index is deprecated and will be removed from pandas in a future version. Use pandas.Index with the appropriate dtype instead.
pd.Int64Index(range(123, 223), name='an_index'),
apache_beam/typehints/pandas_type_compatibility_test.py:91
<https://ci-beam.apache.org/job/beam_PostCommit_XVR_Direct/ws/src/sdks/python/apache_beam/typehints/pandas_type_compatibility_test.py>:91: FutureWarning: pandas.Int64Index is deprecated and will be removed from pandas in a future version. Use pandas.Index with the appropriate dtype instead.
pd.Int64Index(range(475, 575), name='another_index'),
-- Docs: https://docs.pytest.org/en/stable/how-to/capture-warnings.html
- generated xml file: <https://ci-beam.apache.org/job/beam_PostCommit_XVR_Direct/ws/src/sdks/python/pytest_xlangSqlValidateRunner.xml> -
==== 9 passed, 6 skipped, 6808 deselected, 6 warnings in 245.98s (0:04:05) =====
> Task :sdks:python:test-suites:direct:xlang:fnApiJobServerCleanup
Killing process at 2944633
> Task :sdks:python:test-suites:direct:xlang:validatesCrossLanguageRunnerCleanup
Stopping expansion service pid: 2957849.
Stopping expansion service pid: 2957850.
FAILURE: Build failed with an exception.
* What went wrong:
Execution failed for task ':sdks:python:test-suites:direct:xlang:validatesCrossLanguageRunnerJavaUsingPython'.
> There were failing tests. See the report at: file://<https://ci-beam.apache.org/job/beam_PostCommit_XVR_Direct/ws/src/sdks/python/test-suites/direct/xlang/build/reports/tests/validatesCrossLanguageRunnerJavaUsingPython/index.html>
* Try:
> Run with --stacktrace option to get the stack trace.
> Run with --info or --debug option to get more log output.
* Get more help at https://help.gradle.org
Deprecated Gradle features were used in this build, making it incompatible with Gradle 8.0.
You can use '--warning-mode all' to show the individual deprecation warnings and determine if they come from your own scripts or plugins.
See https://docs.gradle.org/7.5.1/userguide/command_line_interface.html#sec:command_line_warnings
Execution optimizations have been disabled for 1 invalid unit(s) of work during this build to ensure correctness.
Please consult deprecation warnings for more details.
BUILD FAILED in 55m 9s
161 actionable tasks: 26 executed, 135 up-to-date
Publishing build scan...
https://gradle.com/s/nozcmcuf4bp7i
Build step 'Invoke Gradle script' changed build result to FAILURE
Build step 'Invoke Gradle script' marked build as failure
---------------------------------------------------------------------
To unsubscribe, e-mail: builds-unsubscribe@beam.apache.org
For additional commands, e-mail: builds-help@beam.apache.org
Build failed in Jenkins: beam_PostCommit_XVR_Direct #3716
Posted by Apache Jenkins Server <je...@builds.apache.org>.
See <https://ci-beam.apache.org/job/beam_PostCommit_XVR_Direct/3716/display/redirect>
Changes:
------------------------------------------
[...truncated 847.80 KB...]
2023/02/06 05:23:31 2023-02-06 05:23:31. (13): ==================== <function add_impulse_to_dangling_transforms at 0x7f9beabc8b00> ====================
2023/02/06 05:23:31 2023-02-06 05:23:31. (14): ==================== <function setup_timer_mapping at 0x7f9beabc8950> ====================
2023/02/06 05:23:31 2023-02-06 05:23:31. (15): ==================== <function populate_data_channel_coders at 0x7f9beabc8a70> ====================
2023/02/06 05:23:31 2023-02-06 05:23:31. (16): starting control server on port 40431
2023/02/06 05:23:31 2023-02-06 05:23:31. (17): starting data server on port 39095
2023/02/06 05:23:31 2023-02-06 05:23:31. (18): starting state server on port 38691
2023/02/06 05:23:31 2023-02-06 05:23:31. (19): starting logging server on port 40443
2023/02/06 05:23:31 2023-02-06 05:23:31. (20): Created Worker handler <apache_beam.runners.portability.fn_api_runner.worker_handlers.DockerSdkWorkerHandler object at 0x7f9be83ea450> for environment xJgbMEmReqbeam:env:docker:v1 (beam:env:docker:v1, b'\n apache/beam_java8_sdk:2.46.0.dev')
2023/02/06 05:23:31 2023-02-06 05:23:31. (21): Attempting to pull image apache/beam_java8_sdk:2.46.0.dev
2023/02/06 05:23:32 2023-02-06 05:23:32. (22): Unable to pull image apache/beam_java8_sdk:2.46.0.dev, defaulting to local image if it exists
2023/02/06 05:23:33 2023-02-06 05:23:33. (23): Waiting for docker to start up. Current status is running
2023/02/06 05:23:33 2023-02-06 05:23:33. (24): Docker container is running. container_id = b'ac9021c66c38f2507b251f6941331cfd9dda7303a0bb0c3851da6f7f666b418e', worker_id = worker_16
2023/02/06 05:23:34 2023-02-06 05:23:34. (25): Created Worker handler <apache_beam.runners.portability.fn_api_runner.worker_handlers.DockerSdkWorkerHandler object at 0x7f9be83e4e90> for environment go (beam:env:docker:v1, b'\n\x16apache/beam_go_sdk:dev')
2023/02/06 05:23:34 2023-02-06 05:23:34. (26): Attempting to pull image apache/beam_go_sdk:dev
2023/02/06 05:23:35 2023-02-06 05:23:35. (27): Unable to pull image apache/beam_go_sdk:dev, defaulting to local image if it exists
2023/02/06 05:23:38 2023-02-06 05:23:38. (28): Waiting for docker to start up. Current status is running
2023/02/06 05:23:38 2023-02-06 05:23:38. (29): Docker container is running. container_id = b'c338f17c72e56684d451c860cf149868c896441c74f249bded6094f8af1a67f8', worker_id = worker_17
2023/02/06 05:23:45 2023-02-06 05:23:45. (30): Completed job in 14.030335903167725 seconds with state DONE.
2023/02/06 05:23:45 Job state: DONE
--- PASS: TestJDBCIO_PostgresReadWrite (38.88s)
PASS
ok github.com/apache/beam/sdks/v2/go/test/integration/io/xlang/jdbc 94.113s
=== RUN TestKafkaIO_BasicReadWrite
integration.go:308: Test TestKafkaIO_BasicReadWrite is currently filtered for runner portable
--- SKIP: TestKafkaIO_BasicReadWrite (0.00s)
PASS
ok github.com/apache/beam/sdks/v2/go/test/integration/io/xlang/kafka 6.031s
$ cd ../..
$ exit
$ exit
> Task :sdks:python:test-suites:direct:xlang:validatesCrossLanguageRunnerJavaUsingPython
org.apache.beam.runners.core.construction.ValidateRunnerXlangTest$FlattenTest > test FAILED
java.lang.RuntimeException at JobServicePipelineResult.java:176
org.apache.beam.runners.core.construction.ValidateRunnerXlangTest$GroupByKeyTest > test FAILED
java.lang.RuntimeException at ValidateRunnerXlangTest.java:285
java.lang.NullPointerException at Preconditions.java:980
org.apache.beam.runners.core.construction.ValidateRunnerXlangTest$MultiInputOutputWithSideInputTest > test FAILED
java.lang.RuntimeException at ValidateRunnerXlangTest.java:263
java.lang.NullPointerException at Preconditions.java:980
org.apache.beam.runners.core.construction.ValidateRunnerXlangTest$PartitionTest > test FAILED
java.lang.RuntimeException at ValidateRunnerXlangTest.java:392
java.lang.NullPointerException at Preconditions.java:980
org.apache.beam.runners.core.construction.ValidateRunnerXlangTest$PythonDependenciesTest > test FAILED
java.lang.RuntimeException at ValidateRunnerXlangTest.java:401
java.lang.NullPointerException at Preconditions.java:980
org.apache.beam.runners.core.construction.ValidateRunnerXlangTest$SingleInputOutputTest > test FAILED
java.lang.RuntimeException at ValidateRunnerXlangTest.java:242
java.lang.NullPointerException at Preconditions.java:980
org.apache.beam.sdk.extensions.python.PythonExternalTransformTest > trivialPythonTransform FAILED
java.lang.RuntimeException at PythonExternalTransformTest.java:58
Caused by: java.io.IOException at PythonExternalTransformTest.java:58
org.apache.beam.sdk.extensions.python.PythonExternalTransformTest > pythonTransformWithDependencies FAILED
java.lang.RuntimeException at PythonExternalTransformTest.java:73
Caused by: java.io.IOException at PythonExternalTransformTest.java:73
org.apache.beam.sdk.extensions.python.transforms.DataframeTransformTest > testDataframeSum FAILED
java.lang.RuntimeException at DataframeTransformTest.java:50
java.lang.NullPointerException at Preconditions.java:980
org.apache.beam.sdk.extensions.python.transforms.PythonMapTest > testPythonMap FAILED
java.lang.RuntimeException at PythonMapTest.java:41
java.lang.NullPointerException at Preconditions.java:980
org.apache.beam.sdk.extensions.python.transforms.PythonMapTest > testPythonFlatMap FAILED
java.lang.RuntimeException at PythonMapTest.java:54
Caused by: java.io.IOException at PythonMapTest.java:54
java.lang.NullPointerException at Preconditions.java:980
org.apache.beam.sdk.extensions.python.transforms.RunInferenceTransformTest > testRunInferenceWithKVs FAILED
java.lang.RuntimeException at RunInferenceTransformTest.java:108
java.lang.NullPointerException at Preconditions.java:980
org.apache.beam.sdk.extensions.python.transforms.RunInferenceTransformTest > testRunInference FAILED
java.lang.RuntimeException at RunInferenceTransformTest.java:60
java.lang.NullPointerException at Preconditions.java:980
16 tests completed, 13 failed
> Task :sdks:python:test-suites:direct:xlang:validatesCrossLanguageRunnerJavaUsingPython FAILED
> Task :sdks:python:test-suites:direct:xlang:validatesCrossLanguageRunnerPythonUsingJava
>>> RUNNING integration tests with pipeline options: --runner=PortableRunner --job_endpoint=localhost:38521 --environment_cache_millis=10000 --experiments=beam_fn_api
>>> pytest options:
>>> collect markers: -m=uses_java_expansion_service
ImportError while loading conftest '<https://ci-beam.apache.org/job/beam_PostCommit_XVR_Direct/ws/src/sdks/python/conftest.py'.>
conftest.py:22: in <module>
from apache_beam.options import pipeline_options
apache_beam/__init__.py:93: in <module>
from apache_beam import io
apache_beam/io/__init__.py:21: in <module>
from apache_beam.io.avroio import *
apache_beam/io/avroio.py:53: in <module>
from apache_beam.io import filebasedsink
apache_beam/io/filebasedsink.py:29: in <module>
from apache_beam.io import iobase
apache_beam/io/iobase.py:54: in <module>
from apache_beam.transforms import Impulse
apache_beam/transforms/__init__.py:24: in <module>
from apache_beam.transforms.external import *
apache_beam/transforms/external.py:44: in <module>
from apache_beam.runners import pipeline_context
apache_beam/runners/__init__.py:24: in <module>
from apache_beam.runners.direct.test_direct_runner import TestDirectRunner
/usr/lib/python3.7/os.py:223: in makedirs
mkdir(name, mode)
E OSError: [Errno 28] No space left on device: '<https://ci-beam.apache.org/job/beam_PostCommit_XVR_Direct/ws/src/sdks/python/apache_beam/runners/direct/__pycache__'>
> Task :sdks:python:test-suites:direct:xlang:validatesCrossLanguageRunnerPythonUsingJava FAILED
> Task :sdks:python:test-suites:direct:xlang:validatesCrossLanguageRunnerPythonUsingSql FAILED
>>> RUNNING integration tests with pipeline options: --runner=PortableRunner --job_endpoint=localhost:38521 --environment_cache_millis=10000 --experiments=beam_fn_api
>>> pytest options:
>>> collect markers: -m=xlang_sql_expansion_service
Traceback (most recent call last):
File "<https://ci-beam.apache.org/job/beam_PostCommit_XVR_Direct/ws/src/build/gradleenv/1922375555/bin/pytest",> line 8, in <module>
sys.exit(console_main())
File "<https://ci-beam.apache.org/job/beam_PostCommit_XVR_Direct/ws/src/build/gradleenv/1922375555/lib/python3.7/site-packages/_pytest/config/__init__.py",> line 190, in console_main
code = main()
File "<https://ci-beam.apache.org/job/beam_PostCommit_XVR_Direct/ws/src/build/gradleenv/1922375555/lib/python3.7/site-packages/_pytest/config/__init__.py",> line 148, in main
config = _prepareconfig(args, plugins)
File "<https://ci-beam.apache.org/job/beam_PostCommit_XVR_Direct/ws/src/build/gradleenv/1922375555/lib/python3.7/site-packages/_pytest/config/__init__.py",> line 330, in _prepareconfig
pluginmanager=pluginmanager, args=args
File "<https://ci-beam.apache.org/job/beam_PostCommit_XVR_Direct/ws/src/build/gradleenv/1922375555/lib/python3.7/site-packages/pluggy/_hooks.py",> line 265, in __call__
return self._hookexec(self.name, self.get_hookimpls(), kwargs, firstresult)
File "<https://ci-beam.apache.org/job/beam_PostCommit_XVR_Direct/ws/src/build/gradleenv/1922375555/lib/python3.7/site-packages/pluggy/_manager.py",> line 80, in _hookexec
return self._inner_hookexec(hook_name, methods, kwargs, firstresult)
File "<https://ci-beam.apache.org/job/beam_PostCommit_XVR_Direct/ws/src/build/gradleenv/1922375555/lib/python3.7/site-packages/pluggy/_callers.py",> line 55, in _multicall
gen.send(outcome)
File "<https://ci-beam.apache.org/job/beam_PostCommit_XVR_Direct/ws/src/build/gradleenv/1922375555/lib/python3.7/site-packages/_pytest/helpconfig.py",> line 103, in pytest_cmdline_parse
config: Config = outcome.get_result()
File "<https://ci-beam.apache.org/job/beam_PostCommit_XVR_Direct/ws/src/build/gradleenv/1922375555/lib/python3.7/site-packages/pluggy/_result.py",> line 60, in get_result
raise ex[1].with_traceback(ex[2])
File "<https://ci-beam.apache.org/job/beam_PostCommit_XVR_Direct/ws/src/build/gradleenv/1922375555/lib/python3.7/site-packages/pluggy/_callers.py",> line 39, in _multicall
res = hook_impl.function(*args)
File "<https://ci-beam.apache.org/job/beam_PostCommit_XVR_Direct/ws/src/build/gradleenv/1922375555/lib/python3.7/site-packages/_pytest/config/__init__.py",> line 1058, in pytest_cmdline_parse
self.parse(args)
File "<https://ci-beam.apache.org/job/beam_PostCommit_XVR_Direct/ws/src/build/gradleenv/1922375555/lib/python3.7/site-packages/_pytest/config/__init__.py",> line 1346, in parse
self._preparse(args, addopts=addopts)
File "<https://ci-beam.apache.org/job/beam_PostCommit_XVR_Direct/ws/src/build/gradleenv/1922375555/lib/python3.7/site-packages/_pytest/config/__init__.py",> line 1249, in _preparse
early_config=self, args=args, parser=self._parser
File "<https://ci-beam.apache.org/job/beam_PostCommit_XVR_Direct/ws/src/build/gradleenv/1922375555/lib/python3.7/site-packages/pluggy/_hooks.py",> line 265, in __call__
return self._hookexec(self.name, self.get_hookimpls(), kwargs, firstresult)
File "<https://ci-beam.apache.org/job/beam_PostCommit_XVR_Direct/ws/src/build/gradleenv/1922375555/lib/python3.7/site-packages/pluggy/_manager.py",> line 80, in _hookexec
return self._inner_hookexec(hook_name, methods, kwargs, firstresult)
File "<https://ci-beam.apache.org/job/beam_PostCommit_XVR_Direct/ws/src/build/gradleenv/1922375555/lib/python3.7/site-packages/pluggy/_callers.py",> line 60, in _multicall
return outcome.get_result()
File "<https://ci-beam.apache.org/job/beam_PostCommit_XVR_Direct/ws/src/build/gradleenv/1922375555/lib/python3.7/site-packages/pluggy/_result.py",> line 60, in get_result
raise ex[1].with_traceback(ex[2])
File "<https://ci-beam.apache.org/job/beam_PostCommit_XVR_Direct/ws/src/build/gradleenv/1922375555/lib/python3.7/site-packages/pluggy/_callers.py",> line 34, in _multicall
next(gen) # first yield
File "<https://ci-beam.apache.org/job/beam_PostCommit_XVR_Direct/ws/src/build/gradleenv/1922375555/lib/python3.7/site-packages/_pytest/capture.py",> line 141, in pytest_load_initial_conftests
capman.start_global_capturing()
File "<https://ci-beam.apache.org/job/beam_PostCommit_XVR_Direct/ws/src/build/gradleenv/1922375555/lib/python3.7/site-packages/_pytest/capture.py",> line 688, in start_global_capturing
self._global_capturing = _get_multicapture(self._method)
File "<https://ci-beam.apache.org/job/beam_PostCommit_XVR_Direct/ws/src/build/gradleenv/1922375555/lib/python3.7/site-packages/_pytest/capture.py",> line 630, in _get_multicapture
return MultiCapture(in_=FDCapture(0), out=FDCapture(1), err=FDCapture(2))
File "<https://ci-beam.apache.org/job/beam_PostCommit_XVR_Direct/ws/src/build/gradleenv/1922375555/lib/python3.7/site-packages/_pytest/capture.py",> line 388, in __init__
TemporaryFile(buffering=0),
File "/usr/lib/python3.7/tempfile.py", line 725, in TemporaryFile
prefix, suffix, dir, output_type = _sanitize_params(prefix, suffix, dir)
File "/usr/lib/python3.7/tempfile.py", line 265, in _sanitize_params
dir = gettempdir()
File "/usr/lib/python3.7/tempfile.py", line 433, in gettempdir
tempdir = _get_default_tempdir()
File "/usr/lib/python3.7/tempfile.py", line 368, in _get_default_tempdir
dirlist)
FileNotFoundError: [Errno 2] No usable temporary directory found in ['/tmp', '/var/tmp', '/usr/tmp', '<https://ci-beam.apache.org/job/beam_PostCommit_XVR_Direct/ws/src/sdks/python']>
> Task :sdks:python:test-suites:direct:xlang:fnApiJobServerCleanup
Killing process at 1596604
> Task :sdks:python:test-suites:direct:xlang:validatesCrossLanguageRunnerCleanup
Stopping expansion service pid: 1601084.
Stopping expansion service pid: 1601085.
FAILURE: Build completed with 3 failures.
1: Task failed with an exception.
-----------
* What went wrong:
Execution failed for task ':sdks:python:test-suites:direct:xlang:validatesCrossLanguageRunnerJavaUsingPython'.
> There were failing tests. See the report at: file://<https://ci-beam.apache.org/job/beam_PostCommit_XVR_Direct/ws/src/sdks/python/test-suites/direct/xlang/build/reports/tests/validatesCrossLanguageRunnerJavaUsingPython/index.html>
* Try:
> Run with --stacktrace option to get the stack trace.
> Run with --info or --debug option to get more log output.
==============================================================================
2: Task failed with an exception.
-----------
* What went wrong:
Execution failed for task ':sdks:python:test-suites:direct:xlang:validatesCrossLanguageRunnerPythonUsingJava'.
> Process 'command 'sh'' finished with non-zero exit value 4
* Try:
> Run with --stacktrace option to get the stack trace.
> Run with --info or --debug option to get more log output.
==============================================================================
3: Task failed with an exception.
-----------
* What went wrong:
Execution failed for task ':sdks:python:test-suites:direct:xlang:validatesCrossLanguageRunnerPythonUsingSql'.
> Process 'command 'sh'' finished with non-zero exit value 1
* Try:
> Run with --stacktrace option to get the stack trace.
> Run with --info or --debug option to get more log output.
==============================================================================
* Get more help at https://help.gradle.org
Deprecated Gradle features were used in this build, making it incompatible with Gradle 8.0.
You can use '--warning-mode all' to show the individual deprecation warnings and determine if they come from your own scripts or plugins.
See https://docs.gradle.org/7.5.1/userguide/command_line_interface.html#sec:command_line_warnings
Execution optimizations have been disabled for 1 invalid unit(s) of work during this build to ensure correctness.
Please consult deprecation warnings for more details.
BUILD FAILED in 23m 1s
248 actionable tasks: 163 executed, 73 from cache, 12 up-to-date
A build scan cannot be produced as an error occurred spooling the build data.
Please report this problem via https://gradle.com/help/plugin and include the following via copy/paste:
----------
Gradle version: 7.5.1
Plugin version: 3.4.1
java.lang.IllegalStateException: Could not close the event spooler due to previous errors.
at com.gradle.scan.plugin.internal.f.c.c.a(SourceFile:128)
at com.gradle.scan.plugin.internal.q.a$a.a(SourceFile:31)
at com.gradle.scan.plugin.internal.q.a$a.a(SourceFile:20)
at com.gradle.scan.plugin.internal.q.a.c(SourceFile:67)
----------
Build step 'Invoke Gradle script' changed build result to FAILURE
Build step 'Invoke Gradle script' marked build as failure
---------------------------------------------------------------------
To unsubscribe, e-mail: builds-unsubscribe@beam.apache.org
For additional commands, e-mail: builds-help@beam.apache.org