You are viewing a plain text version of this content. The canonical link for it is here.
Posted to dev@lucene.apache.org by Apache Jenkins Server <je...@builds.apache.org> on 2014/10/23 04:42:13 UTC

[JENKINS-MAVEN] Lucene-Solr-Maven-5.x #739: POMs out of sync

Build: https://builds.apache.org/job/Lucene-Solr-Maven-5.x/739/

1 tests failed.
REGRESSION:  org.apache.solr.cloud.DeleteReplicaTest.testDistribSearch

Error Message:
No live SolrServers available to handle this request:[https://127.0.0.1:26872/ei_, https://127.0.0.1:26877/ei_, https://127.0.0.1:26883/ei_, https://127.0.0.1:26886/ei_, https://127.0.0.1:26880/ei_]

Stack Trace:
org.apache.solr.client.solrj.SolrServerException: No live SolrServers available to handle this request:[https://127.0.0.1:26872/ei_, https://127.0.0.1:26877/ei_, https://127.0.0.1:26883/ei_, https://127.0.0.1:26886/ei_, https://127.0.0.1:26880/ei_]
	at org.apache.solr.client.solrj.impl.HttpSolrServer.executeMethod(HttpSolrServer.java:569)
	at org.apache.solr.client.solrj.impl.HttpSolrServer.request(HttpSolrServer.java:215)
	at org.apache.solr.client.solrj.impl.HttpSolrServer.request(HttpSolrServer.java:211)
	at org.apache.solr.client.solrj.impl.LBHttpSolrServer.doRequest(LBHttpSolrServer.java:354)
	at org.apache.solr.client.solrj.impl.LBHttpSolrServer.request(LBHttpSolrServer.java:313)
	at org.apache.solr.client.solrj.impl.CloudSolrServer.sendRequest(CloudSolrServer.java:1015)
	at org.apache.solr.client.solrj.impl.CloudSolrServer.requestWithRetryOnStaleState(CloudSolrServer.java:793)
	at org.apache.solr.client.solrj.impl.CloudSolrServer.request(CloudSolrServer.java:736)
	at org.apache.solr.cloud.DeleteReplicaTest.removeAndWaitForReplicaGone(DeleteReplicaTest.java:172)
	at org.apache.solr.cloud.DeleteReplicaTest.deleteLiveReplicaTest(DeleteReplicaTest.java:145)
	at org.apache.solr.cloud.DeleteReplicaTest.doTest(DeleteReplicaTest.java:89)




Build Log:
[...truncated 53311 lines...]
BUILD FAILED
/usr/home/jenkins/jenkins-slave/workspace/Lucene-Solr-Maven-5.x/build.xml:547: The following error occurred while executing this line:
/usr/home/jenkins/jenkins-slave/workspace/Lucene-Solr-Maven-5.x/build.xml:199: The following error occurred while executing this line:
: Java returned: 1

Total time: 262 minutes 40 seconds
Build step 'Invoke Ant' marked build as failure
Recording test results
Email was triggered for: Failure
Sending email for trigger: Failure



[JENKINS-MAVEN] Lucene-Solr-Maven-5.x #740: POMs out of sync

Posted by Apache Jenkins Server <je...@builds.apache.org>.
Build: https://builds.apache.org/job/Lucene-Solr-Maven-5.x/740/

1 tests failed.
FAILED:  org.apache.solr.cloud.DeleteReplicaTest.testDistribSearch

Error Message:
No live SolrServers available to handle this request:[http://127.0.0.1:42591/dvz, http://127.0.0.1:24299/dvz, http://127.0.0.1:36812/dvz, http://127.0.0.1:61682/dvz, http://127.0.0.1:15215/dvz]

Stack Trace:
org.apache.solr.client.solrj.SolrServerException: No live SolrServers available to handle this request:[http://127.0.0.1:42591/dvz, http://127.0.0.1:24299/dvz, http://127.0.0.1:36812/dvz, http://127.0.0.1:61682/dvz, http://127.0.0.1:15215/dvz]
	at org.apache.solr.client.solrj.impl.HttpSolrServer.executeMethod(HttpSolrServer.java:569)
	at org.apache.solr.client.solrj.impl.HttpSolrServer.request(HttpSolrServer.java:215)
	at org.apache.solr.client.solrj.impl.HttpSolrServer.request(HttpSolrServer.java:211)
	at org.apache.solr.client.solrj.impl.LBHttpSolrServer.doRequest(LBHttpSolrServer.java:354)
	at org.apache.solr.client.solrj.impl.LBHttpSolrServer.request(LBHttpSolrServer.java:313)
	at org.apache.solr.client.solrj.impl.CloudSolrServer.sendRequest(CloudSolrServer.java:1015)
	at org.apache.solr.client.solrj.impl.CloudSolrServer.requestWithRetryOnStaleState(CloudSolrServer.java:793)
	at org.apache.solr.client.solrj.impl.CloudSolrServer.request(CloudSolrServer.java:736)
	at org.apache.solr.cloud.DeleteReplicaTest.removeAndWaitForReplicaGone(DeleteReplicaTest.java:172)
	at org.apache.solr.cloud.DeleteReplicaTest.deleteLiveReplicaTest(DeleteReplicaTest.java:145)
	at org.apache.solr.cloud.DeleteReplicaTest.doTest(DeleteReplicaTest.java:89)




Build Log:
[...truncated 53244 lines...]
BUILD FAILED
/usr/home/jenkins/jenkins-slave/workspace/Lucene-Solr-Maven-5.x/build.xml:547: The following error occurred while executing this line:
/usr/home/jenkins/jenkins-slave/workspace/Lucene-Solr-Maven-5.x/build.xml:199: The following error occurred while executing this line:
: Java returned: 1

Total time: 265 minutes 12 seconds
Build step 'Invoke Ant' marked build as failure
Recording test results
Email was triggered for: Failure
Sending email for trigger: Failure