You are viewing a plain text version of this content. The canonical link for it is here.
Posted to dev@kafka.apache.org by Apache Jenkins Server <je...@builds.apache.org> on 2026/01/12 19:17:38 UTC
Build failed in Jenkins: Kafka » Kafka Branch Builder » 3.9 #257
See <https://ci-builds.apache.org/job/Kafka/job/kafka/job/3.9/257/display/redirect>
Changes:
------------------------------------------
[...truncated 732052 lines...]
[2026-01-12T19:17:23.296Z] at org.gradle.internal.jvm.inspection.DefaultJvmVersionDetector.getJavaVersionMajor(DefaultJvmVersionDetector.java:46)
[2026-01-12T19:17:23.296Z] ... 20 more
[2026-01-12T19:17:23.296Z] A problem occurred starting process 'command '/usr/local/asfpackages/java/adoptium-jdk-25+36/bin/java''
[2026-01-12T19:17:23.296Z] org.gradle.process.internal.ExecException: A problem occurred starting process 'command '/usr/local/asfpackages/java/adoptium-jdk-25+36/bin/java''
[2026-01-12T19:17:23.296Z] at org.gradle.internal.jvm.inspection.DefaultJvmVersionDetector.getJavaVersionMajor(DefaultJvmVersionDetector.java:47)
[2026-01-12T19:17:23.296Z] at org.gradle.process.internal.worker.DefaultWorkerProcessBuilder.build(DefaultWorkerProcessBuilder.java:246)
[2026-01-12T19:17:23.296Z] at org.gradle.api.internal.tasks.testing.worker.ForkingTestClassProcessor.forkProcess(ForkingTestClassProcessor.java:118)
[2026-01-12T19:17:23.296Z] at org.gradle.api.internal.tasks.testing.worker.ForkingTestClassProcessor.processTestClass(ForkingTestClassProcessor.java:92)
[2026-01-12T19:17:23.296Z] at org.gradle.api.internal.tasks.testing.processors.RestartEveryNTestClassProcessor.processTestClass(RestartEveryNTestClassProcessor.java:52)
[2026-01-12T19:17:23.296Z] at java.base/jdk.internal.reflect.DirectMethodHandleAccessor.invoke(DirectMethodHandleAccessor.java:103)
[2026-01-12T19:17:23.296Z] at java.base/java.lang.reflect.Method.invoke(Method.java:580)
[2026-01-12T19:17:23.296Z] at org.gradle.internal.dispatch.ReflectionDispatch.dispatch(ReflectionDispatch.java:36)
[2026-01-12T19:17:23.296Z] at org.gradle.internal.dispatch.ReflectionDispatch.dispatch(ReflectionDispatch.java:24)
[2026-01-12T19:17:23.296Z] at org.gradle.internal.dispatch.FailureHandlingDispatch.dispatch(FailureHandlingDispatch.java:30)
[2026-01-12T19:17:23.296Z] at org.gradle.internal.dispatch.AsyncDispatch.dispatchMessages(AsyncDispatch.java:87)
[2026-01-12T19:17:23.296Z] at org.gradle.internal.dispatch.AsyncDispatch.access$000(AsyncDispatch.java:36)
[2026-01-12T19:17:23.296Z] at org.gradle.internal.dispatch.AsyncDispatch$1.run(AsyncDispatch.java:71)
[2026-01-12T19:17:23.296Z] at org.gradle.internal.concurrent.InterruptibleRunnable.run(InterruptibleRunnable.java:42)
[2026-01-12T19:17:23.296Z] at org.gradle.internal.operations.CurrentBuildOperationRef.with(CurrentBuildOperationRef.java:85)
[2026-01-12T19:17:23.296Z] at org.gradle.internal.operations.CurrentBuildOperationPreservingRunnable.run(CurrentBuildOperationPreservingRunnable.java:51)
[2026-01-12T19:17:23.296Z] at org.gradle.internal.concurrent.ExecutorPolicy$CatchAndRecordFailures.onExecute(ExecutorPolicy.java:64)
[2026-01-12T19:17:23.296Z] at org.gradle.internal.concurrent.AbstractManagedExecutor$1.run(AbstractManagedExecutor.java:48)
[2026-01-12T19:17:23.296Z] at java.base/java.util.concurrent.ThreadPoolExecutor.runWorker(ThreadPoolExecutor.java:1144)
[2026-01-12T19:17:23.296Z] at java.base/java.util.concurrent.ThreadPoolExecutor$Worker.run(ThreadPoolExecutor.java:642)
[2026-01-12T19:17:23.296Z] at java.base/java.lang.Thread.run(Thread.java:1583)
[2026-01-12T19:17:23.296Z] Caused by: java.nio.file.NoSuchFileException: /usr/local/asfpackages/java/adoptium-jdk-25+36/bin/java
[2026-01-12T19:17:23.296Z] at org.gradle.internal.jvm.inspection.DefaultJvmVersionDetector.getJavaVersionMajor(DefaultJvmVersionDetector.java:46)
[2026-01-12T19:17:23.296Z] ... 20 more
[2026-01-12T19:17:23.296Z] A problem occurred starting process 'command '/usr/local/asfpackages/java/adoptium-jdk-25+36/bin/java''
[2026-01-12T19:17:23.296Z] org.gradle.process.internal.ExecException: A problem occurred starting process 'command '/usr/local/asfpackages/java/adoptium-jdk-25+36/bin/java''
[2026-01-12T19:17:23.296Z] at org.gradle.internal.jvm.inspection.DefaultJvmVersionDetector.getJavaVersionMajor(DefaultJvmVersionDetector.java:47)
[2026-01-12T19:17:23.296Z] at org.gradle.process.internal.worker.DefaultWorkerProcessBuilder.build(DefaultWorkerProcessBuilder.java:246)
[2026-01-12T19:17:23.296Z] at org.gradle.api.internal.tasks.testing.worker.ForkingTestClassProcessor.forkProcess(ForkingTestClassProcessor.java:118)
[2026-01-12T19:17:23.296Z] at org.gradle.api.internal.tasks.testing.worker.ForkingTestClassProcessor.processTestClass(ForkingTestClassProcessor.java:92)
[2026-01-12T19:17:23.296Z] at org.gradle.api.internal.tasks.testing.processors.RestartEveryNTestClassProcessor.processTestClass(RestartEveryNTestClassProcessor.java:52)
[2026-01-12T19:17:23.296Z] at java.base/jdk.internal.reflect.DirectMethodHandleAccessor.invoke(DirectMethodHandleAccessor.java:103)
[2026-01-12T19:17:23.296Z] at java.base/java.lang.reflect.Method.invoke(Method.java:580)
[2026-01-12T19:17:23.296Z] at org.gradle.internal.dispatch.ReflectionDispatch.dispatch(ReflectionDispatch.java:36)
[2026-01-12T19:17:23.296Z] at org.gradle.internal.dispatch.ReflectionDispatch.dispatch(ReflectionDispatch.java:24)
[2026-01-12T19:17:23.296Z] at org.gradle.internal.dispatch.FailureHandlingDispatch.dispatch(FailureHandlingDispatch.java:30)
[2026-01-12T19:17:23.296Z] at org.gradle.internal.dispatch.AsyncDispatch.dispatchMessages(AsyncDispatch.java:87)
[2026-01-12T19:17:23.296Z] at org.gradle.internal.dispatch.AsyncDispatch.access$000(AsyncDispatch.java:36)
[2026-01-12T19:17:23.296Z] at org.gradle.internal.dispatch.AsyncDispatch$1.run(AsyncDispatch.java:71)
[2026-01-12T19:17:23.296Z] at org.gradle.internal.concurrent.InterruptibleRunnable.run(InterruptibleRunnable.java:42)
[2026-01-12T19:17:23.296Z] at org.gradle.internal.operations.CurrentBuildOperationRef.with(CurrentBuildOperationRef.java:85)
[2026-01-12T19:17:23.296Z] at org.gradle.internal.operations.CurrentBuildOperationPreservingRunnable.run(CurrentBuildOperationPreservingRunnable.java:51)
[2026-01-12T19:17:23.296Z] at org.gradle.internal.concurrent.ExecutorPolicy$CatchAndRecordFailures.onExecute(ExecutorPolicy.java:64)
[2026-01-12T19:17:23.296Z] at org.gradle.internal.concurrent.AbstractManagedExecutor$1.run(AbstractManagedExecutor.java:48)
[2026-01-12T19:17:23.296Z] at java.base/java.util.concurrent.ThreadPoolExecutor.runWorker(ThreadPoolExecutor.java:1144)
[2026-01-12T19:17:23.296Z] at java.base/java.util.concurrent.ThreadPoolExecutor$Worker.run(ThreadPoolExecutor.java:642)
[2026-01-12T19:17:23.296Z] at java.base/java.lang.Thread.run(Thread.java:1583)
[2026-01-12T19:17:23.296Z] Caused by: java.nio.file.NoSuchFileException: /usr/local/asfpackages/java/adoptium-jdk-25+36/bin/java
[2026-01-12T19:17:23.296Z] at org.gradle.internal.jvm.inspection.DefaultJvmVersionDetector.getJavaVersionMajor(DefaultJvmVersionDetector.java:46)
[2026-01-12T19:17:23.296Z] ... 20 more
[2026-01-12T19:17:23.296Z] A problem occurred starting process 'command '/usr/local/asfpackages/java/adoptium-jdk-25+36/bin/java''
[2026-01-12T19:17:23.296Z] org.gradle.process.internal.ExecException: A problem occurred starting process 'command '/usr/local/asfpackages/java/adoptium-jdk-25+36/bin/java''
[2026-01-12T19:17:23.296Z] at org.gradle.internal.jvm.inspection.DefaultJvmVersionDetector.getJavaVersionMajor(DefaultJvmVersionDetector.java:47)
[2026-01-12T19:17:23.296Z] at org.gradle.process.internal.worker.DefaultWorkerProcessBuilder.build(DefaultWorkerProcessBuilder.java:246)
[2026-01-12T19:17:23.296Z] at org.gradle.api.internal.tasks.testing.worker.ForkingTestClassProcessor.forkProcess(ForkingTestClassProcessor.java:118)
[2026-01-12T19:17:23.296Z] at org.gradle.api.internal.tasks.testing.worker.ForkingTestClassProcessor.processTestClass(ForkingTestClassProcessor.java:92)
[2026-01-12T19:17:23.296Z] at org.gradle.api.internal.tasks.testing.processors.RestartEveryNTestClassProcessor.processTestClass(RestartEveryNTestClassProcessor.java:52)
[2026-01-12T19:17:23.296Z] at java.base/jdk.internal.reflect.DirectMethodHandleAccessor.invoke(DirectMethodHandleAccessor.java:103)
[2026-01-12T19:17:23.296Z] at java.base/java.lang.reflect.Method.invoke(Method.java:580)
[2026-01-12T19:17:23.296Z] at org.gradle.internal.dispatch.ReflectionDispatch.dispatch(ReflectionDispatch.java:36)
[2026-01-12T19:17:23.296Z] at org.gradle.internal.dispatch.ReflectionDispatch.dispatch(ReflectionDispatch.java:24)
[2026-01-12T19:17:23.296Z] at org.gradle.internal.dispatch.FailureHandlingDispatch.dispatch(FailureHandlingDispatch.java:30)
[2026-01-12T19:17:23.296Z] at org.gradle.internal.dispatch.AsyncDispatch.dispatchMessages(AsyncDispatch.java:87)
[2026-01-12T19:17:23.296Z] at org.gradle.internal.dispatch.AsyncDispatch.access$000(AsyncDispatch.java:36)
[2026-01-12T19:17:23.296Z] at org.gradle.internal.dispatch.AsyncDispatch$1.run(AsyncDispatch.java:71)
[2026-01-12T19:17:23.296Z] at org.gradle.internal.concurrent.InterruptibleRunnable.run(InterruptibleRunnable.java:42)
[2026-01-12T19:17:23.296Z] at org.gradle.internal.operations.CurrentBuildOperationRef.with(CurrentBuildOperationRef.java:85)
[2026-01-12T19:17:23.296Z] at org.gradle.internal.operations.CurrentBuildOperationPreservingRunnable.run(CurrentBuildOperationPreservingRunnable.java:51)
[2026-01-12T19:17:23.296Z] at org.gradle.internal.concurrent.ExecutorPolicy$CatchAndRecordFailures.onExecute(ExecutorPolicy.java:64)
[2026-01-12T19:17:23.296Z] at org.gradle.internal.concurrent.AbstractManagedExecutor$1.run(AbstractManagedExecutor.java:48)
[2026-01-12T19:17:23.296Z] at java.base/java.util.concurrent.ThreadPoolExecutor.runWorker(ThreadPoolExecutor.java:1144)
[2026-01-12T19:17:23.296Z] at java.base/java.util.concurrent.ThreadPoolExecutor$Worker.run(ThreadPoolExecutor.java:642)
[2026-01-12T19:17:23.296Z] at java.base/java.lang.Thread.run(Thread.java:1583)
[2026-01-12T19:17:23.296Z] Caused by: java.nio.file.NoSuchFileException: /usr/local/asfpackages/java/adoptium-jdk-25+36/bin/java
[2026-01-12T19:17:23.296Z] at org.gradle.internal.jvm.inspection.DefaultJvmVersionDetector.getJavaVersionMajor(DefaultJvmVersionDetector.java:46)
[2026-01-12T19:17:23.296Z] ... 20 more
[2026-01-12T19:17:23.296Z] A problem occurred starting process 'command '/usr/local/asfpackages/java/adoptium-jdk-25+36/bin/java''
[2026-01-12T19:17:23.296Z] org.gradle.process.internal.ExecException: A problem occurred starting process 'command '/usr/local/asfpackages/java/adoptium-jdk-25+36/bin/java''
[2026-01-12T19:17:23.296Z] at org.gradle.internal.jvm.inspection.DefaultJvmVersionDetector.getJavaVersionMajor(DefaultJvmVersionDetector.java:47)
[2026-01-12T19:17:23.296Z] at org.gradle.process.internal.worker.DefaultWorkerProcessBuilder.build(DefaultWorkerProcessBuilder.java:246)
[2026-01-12T19:17:23.296Z] at org.gradle.api.internal.tasks.testing.worker.ForkingTestClassProcessor.forkProcess(ForkingTestClassProcessor.java:118)
[2026-01-12T19:17:23.296Z] at org.gradle.api.internal.tasks.testing.worker.ForkingTestClassProcessor.processTestClass(ForkingTestClassProcessor.java:92)
[2026-01-12T19:17:23.296Z] at org.gradle.api.internal.tasks.testing.processors.RestartEveryNTestClassProcessor.processTestClass(RestartEveryNTestClassProcessor.java:52)
[2026-01-12T19:17:23.296Z] at java.base/jdk.internal.reflect.DirectMethodHandleAccessor.invoke(DirectMethodHandleAccessor.java:103)
[2026-01-12T19:17:23.296Z] at java.base/java.lang.reflect.Method.invoke(Method.java:580)
[2026-01-12T19:17:23.296Z] at org.gradle.internal.dispatch.ReflectionDispatch.dispatch(ReflectionDispatch.java:36)
[2026-01-12T19:17:23.296Z] at org.gradle.internal.dispatch.ReflectionDispatch.dispatch(ReflectionDispatch.java:24)
[2026-01-12T19:17:23.296Z] at org.gradle.internal.dispatch.FailureHandlingDispatch.dispatch(FailureHandlingDispatch.java:30)
[2026-01-12T19:17:23.296Z] at org.gradle.internal.dispatch.AsyncDispatch.dispatchMessages(AsyncDispatch.java:87)
[2026-01-12T19:17:23.296Z] at org.gradle.internal.dispatch.AsyncDispatch.access$000(AsyncDispatch.java:36)
[2026-01-12T19:17:23.296Z] at org.gradle.internal.dispatch.AsyncDispatch$1.run(AsyncDispatch.java:71)
[2026-01-12T19:17:23.296Z] at org.gradle.internal.concurrent.InterruptibleRunnable.run(InterruptibleRunnable.java:42)
[2026-01-12T19:17:23.296Z] at org.gradle.internal.operations.CurrentBuildOperationRef.with(CurrentBuildOperationRef.java:85)
[2026-01-12T19:17:23.296Z] at org.gradle.internal.operations.CurrentBuildOperationPreservingRunnable.run(CurrentBuildOperationPreservingRunnable.java:51)
[2026-01-12T19:17:23.296Z] at org.gradle.internal.concurrent.ExecutorPolicy$CatchAndRecordFailures.onExecute(ExecutorPolicy.java:64)
[2026-01-12T19:17:23.296Z] at org.gradle.internal.concurrent.AbstractManagedExecutor$1.run(AbstractManagedExecutor.java:48)
[2026-01-12T19:17:23.296Z] at java.base/java.util.concurrent.ThreadPoolExecutor.runWorker(ThreadPoolExecutor.java:1144)
[2026-01-12T19:17:23.296Z] at java.base/java.util.concurrent.ThreadPoolExecutor$Worker.run(ThreadPoolExecutor.java:642)
[2026-01-12T19:17:23.296Z] at java.base/java.lang.Thread.run(Thread.java:1583)
[2026-01-12T19:17:23.296Z] Caused by: java.nio.file.NoSuchFileException: /usr/local/asfpackages/java/adoptium-jdk-25+36/bin/java
[2026-01-12T19:17:23.296Z] at org.gradle.internal.jvm.inspection.DefaultJvmVersionDetector.getJavaVersionMajor(DefaultJvmVersionDetector.java:46)
[2026-01-12T19:17:23.296Z] ... 20 more
[2026-01-12T19:17:23.296Z] A problem occurred starting process 'command '/usr/local/asfpackages/java/adoptium-jdk-25+36/bin/java''
[2026-01-12T19:17:23.296Z] org.gradle.process.internal.ExecException: A problem occurred starting process 'command '/usr/local/asfpackages/java/adoptium-jdk-25+36/bin/java''
[2026-01-12T19:17:23.296Z] at org.gradle.internal.jvm.inspection.DefaultJvmVersionDetector.getJavaVersionMajor(DefaultJvmVersionDetector.java:47)
[2026-01-12T19:17:23.296Z] at org.gradle.process.internal.worker.DefaultWorkerProcessBuilder.build(DefaultWorkerProcessBuilder.java:246)
[2026-01-12T19:17:23.296Z] at org.gradle.api.internal.tasks.testing.worker.ForkingTestClassProcessor.forkProcess(ForkingTestClassProcessor.java:118)
[2026-01-12T19:17:23.296Z] at org.gradle.api.internal.tasks.testing.worker.ForkingTestClassProcessor.processTestClass(ForkingTestClassProcessor.java:92)
[2026-01-12T19:17:23.296Z] at org.gradle.api.internal.tasks.testing.processors.RestartEveryNTestClassProcessor.processTestClass(RestartEveryNTestClassProcessor.java:52)
[2026-01-12T19:17:23.296Z] at java.base/jdk.internal.reflect.DirectMethodHandleAccessor.invoke(DirectMethodHandleAccessor.java:103)
[2026-01-12T19:17:23.296Z] at java.base/java.lang.reflect.Method.invoke(Method.java:580)
[2026-01-12T19:17:23.296Z] at org.gradle.internal.dispatch.ReflectionDispatch.dispatch(ReflectionDispatch.java:36)
[2026-01-12T19:17:23.296Z] at org.gradle.internal.dispatch.ReflectionDispatch.dispatch(ReflectionDispatch.java:24)
[2026-01-12T19:17:23.297Z] at org.gradle.internal.dispatch.FailureHandlingDispatch.dispatch(FailureHandlingDispatch.java:30)
[2026-01-12T19:17:23.297Z] at org.gradle.internal.dispatch.AsyncDispatch.dispatchMessages(AsyncDispatch.java:87)
[2026-01-12T19:17:23.297Z] at org.gradle.internal.dispatch.AsyncDispatch.access$000(AsyncDispatch.java:36)
[2026-01-12T19:17:23.297Z] at org.gradle.internal.dispatch.AsyncDispatch$1.run(AsyncDispatch.java:71)
[2026-01-12T19:17:23.297Z] at org.gradle.internal.concurrent.InterruptibleRunnable.run(InterruptibleRunnable.java:42)
[2026-01-12T19:17:23.297Z] at org.gradle.internal.operations.CurrentBuildOperationRef.with(CurrentBuildOperationRef.java:85)
[2026-01-12T19:17:23.297Z] at org.gradle.internal.operations.CurrentBuildOperationPreservingRunnable.run(CurrentBuildOperationPreservingRunnable.java:51)
[2026-01-12T19:17:23.297Z] at org.gradle.internal.concurrent.ExecutorPolicy$CatchAndRecordFailures.onExecute(ExecutorPolicy.java:64)
[2026-01-12T19:17:23.297Z] at org.gradle.internal.concurrent.AbstractManagedExecutor$1.run(AbstractManagedExecutor.java:48)
[2026-01-12T19:17:23.297Z] at java.base/java.util.concurrent.ThreadPoolExecutor.runWorker(ThreadPoolExecutor.java:1144)
[2026-01-12T19:17:23.297Z] at java.base/java.util.concurrent.ThreadPoolExecutor$Worker.run(ThreadPoolExecutor.java:642)
[2026-01-12T19:17:23.297Z] at java.base/java.lang.Thread.run(Thread.java:1583)
[2026-01-12T19:17:23.297Z] Caused by: java.nio.file.NoSuchFileException: /usr/local/asfpackages/java/adoptium-jdk-25+36/bin/java
[2026-01-12T19:17:23.297Z] at org.gradle.internal.jvm.inspection.DefaultJvmVersionDetector.getJavaVersionMajor(DefaultJvmVersionDetector.java:46)
[2026-01-12T19:17:23.297Z] ... 20 more
[2026-01-12T19:17:23.297Z] A problem occurred starting process 'command '/usr/local/asfpackages/java/adoptium-jdk-25+36/bin/java''
[2026-01-12T19:17:23.297Z] org.gradle.process.internal.ExecException: A problem occurred starting process 'command '/usr/local/asfpackages/java/adoptium-jdk-25+36/bin/java''
[2026-01-12T19:17:23.297Z] at org.gradle.internal.jvm.inspection.DefaultJvmVersionDetector.getJavaVersionMajor(DefaultJvmVersionDetector.java:47)
[2026-01-12T19:17:23.297Z] at org.gradle.process.internal.worker.DefaultWorkerProcessBuilder.build(DefaultWorkerProcessBuilder.java:246)
[2026-01-12T19:17:23.297Z] at org.gradle.api.internal.tasks.testing.worker.ForkingTestClassProcessor.forkProcess(ForkingTestClassProcessor.java:118)
[2026-01-12T19:17:23.297Z] at org.gradle.api.internal.tasks.testing.worker.ForkingTestClassProcessor.processTestClass(ForkingTestClassProcessor.java:92)
[2026-01-12T19:17:23.297Z] at org.gradle.api.internal.tasks.testing.processors.RestartEveryNTestClassProcessor.processTestClass(RestartEveryNTestClassProcessor.java:52)
[2026-01-12T19:17:23.297Z] at java.base/jdk.internal.reflect.DirectMethodHandleAccessor.invoke(DirectMethodHandleAccessor.java:103)
[2026-01-12T19:17:23.297Z] at java.base/java.lang.reflect.Method.invoke(Method.java:580)
[2026-01-12T19:17:23.297Z] at org.gradle.internal.dispatch.ReflectionDispatch.dispatch(ReflectionDispatch.java:36)
[2026-01-12T19:17:23.297Z] at org.gradle.internal.dispatch.ReflectionDispatch.dispatch(ReflectionDispatch.java:24)
[2026-01-12T19:17:23.297Z] at org.gradle.internal.dispatch.FailureHandlingDispatch.dispatch(FailureHandlingDispatch.java:30)
[2026-01-12T19:17:23.297Z] at org.gradle.internal.dispatch.AsyncDispatch.dispatchMessages(AsyncDispatch.java:87)
[2026-01-12T19:17:23.297Z] at org.gradle.internal.dispatch.AsyncDispatch.access$000(AsyncDispatch.java:36)
[2026-01-12T19:17:23.297Z] at org.gradle.internal.dispatch.AsyncDispatch$1.run(AsyncDispatch.java:71)
[2026-01-12T19:17:23.297Z] at org.gradle.internal.concurrent.InterruptibleRunnable.run(InterruptibleRunnable.java:42)
[2026-01-12T19:17:23.297Z] at org.gradle.internal.operations.CurrentBuildOperationRef.with(CurrentBuildOperationRef.java:85)
[2026-01-12T19:17:23.297Z] at org.gradle.internal.operations.CurrentBuildOperationPreservingRunnable.run(CurrentBuildOperationPreservingRunnable.java:51)
[2026-01-12T19:17:23.297Z] at org.gradle.internal.concurrent.ExecutorPolicy$CatchAndRecordFailures.onExecute(ExecutorPolicy.java:64)
[2026-01-12T19:17:23.297Z] at org.gradle.internal.concurrent.AbstractManagedExecutor$1.run(AbstractManagedExecutor.java:48)
[2026-01-12T19:17:23.297Z] at java.base/java.util.concurrent.ThreadPoolExecutor.runWorker(ThreadPoolExecutor.java:1144)
[2026-01-12T19:17:23.297Z] at java.base/java.util.concurrent.ThreadPoolExecutor$Worker.run(ThreadPoolExecutor.java:642)
[2026-01-12T19:17:23.297Z] at java.base/java.lang.Thread.run(Thread.java:1583)
[2026-01-12T19:17:23.297Z] Caused by: java.nio.file.NoSuchFileException: /usr/local/asfpackages/java/adoptium-jdk-25+36/bin/java
[2026-01-12T19:17:23.297Z] at org.gradle.internal.jvm.inspection.DefaultJvmVersionDetector.getJavaVersionMajor(DefaultJvmVersionDetector.java:46)
[2026-01-12T19:17:23.297Z] ... 20 more
[2026-01-12T19:17:23.297Z]
[2026-01-12T19:17:23.297Z] 5977 tests completed, 4 failed, 16 skipped
[2026-01-12T19:17:23.297Z]
[2026-01-12T19:17:23.297Z] > Task :core:testWithJava25 FAILED
[2026-01-12T19:17:24.042Z]
[2026-01-12T19:17:24.042Z] FAILURE: Build completed with 2 failures.
[2026-01-12T19:17:24.042Z]
[2026-01-12T19:17:24.042Z] 1: Task failed with an exception.
[2026-01-12T19:17:24.042Z] -----------
[2026-01-12T19:17:24.042Z] * What went wrong:
[2026-01-12T19:17:24.042Z] Execution failed for task ':streams:testWithJava25'.
[2026-01-12T19:17:24.042Z] > Could not stop all services.
[2026-01-12T19:17:24.042Z] > Could not dispatch message [MethodInvocation method: processTestClass(DefaultTestClassRunInfo(org.apache.kafka.common.metrics.SensorAccessor))].
[2026-01-12T19:17:24.042Z] > Could not dispatch message [MethodInvocation method: processTestClass(DefaultTestClassRunInfo(org.apache.kafka.streams.EqualityCheck))].
[2026-01-12T19:17:24.042Z]
[2026-01-12T19:17:24.042Z] * Try:
[2026-01-12T19:17:24.042Z] > Run with --stacktrace option to get the stack trace.
[2026-01-12T19:17:24.042Z] > Run with --info or --debug option to get more log output.
[2026-01-12T19:17:24.042Z] > Get more help at https://help.gradle.org.
[2026-01-12T19:17:24.042Z] ==============================================================================
[2026-01-12T19:17:24.042Z]
[2026-01-12T19:17:24.042Z] 2: Task failed with an exception.
[2026-01-12T19:17:24.042Z] -----------
[2026-01-12T19:17:24.042Z] * What went wrong:
[2026-01-12T19:17:24.042Z] Execution failed for task ':core:testWithJava25'.
[2026-01-12T19:17:24.042Z] > Could not stop all services.
[2026-01-12T19:17:24.042Z] > Could not dispatch message [MethodInvocation method: processTestClass(DefaultTestClassRunInfo(integration.kafka.admin.AdminFenceProducersIntegrationTest))].
[2026-01-12T19:17:24.042Z] > Could not dispatch message [MethodInvocation method: processTestClass(DefaultTestClassRunInfo(integration.kafka.api.PlaintextConsumerCallbackTest$))].
[2026-01-12T19:17:24.042Z]
[2026-01-12T19:17:24.042Z] * Try:
[2026-01-12T19:17:24.042Z] > Run with --stacktrace option to get the stack trace.
[2026-01-12T19:17:24.042Z] > Run with --info or --debug option to get more log output.
[2026-01-12T19:17:24.042Z] > Get more help at https://help.gradle.org.
[2026-01-12T19:17:24.042Z] ==============================================================================
[2026-01-12T19:17:24.042Z]
[2026-01-12T19:17:24.042Z] Deprecated Gradle features were used in this build, making it incompatible with Gradle 9.0.
[2026-01-12T19:17:24.042Z]
[2026-01-12T19:17:24.042Z] You can use '--warning-mode all' to show the individual deprecation warnings and determine if they come from your own scripts or plugins.
[2026-01-12T19:17:24.042Z]
[2026-01-12T19:17:24.042Z] For more on this, please refer to https://docs.gradle.org/8.10.2/userguide/command_line_interface.html#sec:command_line_warnings in the Gradle documentation.
[2026-01-12T19:17:24.042Z]
[2026-01-12T19:17:24.042Z] BUILD FAILED in 5h 54m 43s
[2026-01-12T19:17:24.042Z] 215 actionable tasks: 90 executed, 125 up-to-date
[2026-01-12T19:17:24.042Z]
[2026-01-12T19:17:24.042Z] See the profiling report at: file:///home/jenkins/workspace/Kafka_kafka_3.9@2/build/reports/profile/profile-2026-01-12-13-22-45.html
[2026-01-12T19:17:24.042Z] A fine-grained performance profile is available: use the --scan option.
[Pipeline] }
[Pipeline] // withEnv
[Pipeline] }
[Pipeline] // withEnv
[Pipeline] }
[Pipeline] // withEnv
[Pipeline] }
[Pipeline] // node
[Pipeline] }
[Pipeline] // timestamps
[Pipeline] }
[Pipeline] // timeout
[Pipeline] }
[Pipeline] // stage
[Pipeline] }
Failed in branch JDK 25 and Scala 2.13
[2026-01-12T19:17:37.616Z] [Checks API] No suitable checks publisher found.
[Pipeline] echo
[2026-01-12T19:17:37.617Z] Skipping Kafka Streams archetype test for Java 21
[Pipeline] }
[Pipeline] // withEnv
[Pipeline] }
[Pipeline] // withEnv
[Pipeline] }
[Pipeline] // withEnv
[Pipeline] }
[Pipeline] // node
[Pipeline] }
[Pipeline] // timestamps
[Pipeline] }
[Pipeline] // timeout
[Pipeline] }
[Pipeline] // stage
[Pipeline] }
[Pipeline] // parallel
[Pipeline] }
[Pipeline] // stage
[Pipeline] stage
[Pipeline] { (Declarative: Post Actions)
[Pipeline] script
[Pipeline] {
[Pipeline] node
Running on builds23 in /home/jenkins/workspace/Kafka_kafka_3.9
[Pipeline] {
[Pipeline] step
Jenkins build is still unstable: Kafka » Kafka Branch Builder » 3.9 #261
Posted by Apache Jenkins Server <je...@builds.apache.org>.
See <https://ci-builds.apache.org/job/Kafka/job/kafka/job/3.9/261/display/redirect>
Jenkins build is unstable: Kafka » Kafka Branch Builder » 3.9 #260
Posted by Apache Jenkins Server <je...@builds.apache.org>.
See <https://ci-builds.apache.org/job/Kafka/job/kafka/job/3.9/260/display/redirect>
Build failed in Jenkins: Kafka » Kafka Branch Builder » 3.9 #259
Posted by Apache Jenkins Server <je...@builds.apache.org>.
See <https://ci-builds.apache.org/job/Kafka/job/kafka/job/3.9/259/display/redirect>
Changes:
------------------------------------------
[...truncated 552011 lines...]
[2026-01-14T15:16:37.403Z] Gradle Test Run :core:test > Gradle Test Executor 54 > ZkMigrationClientTest > testEmptyWrite() STARTED
[2026-01-14T15:16:38.827Z]
[2026-01-14T15:16:38.827Z] Gradle Test Run :core:test > Gradle Test Executor 54 > ZkMigrationClientTest > testEmptyWrite() PASSED
[2026-01-14T15:16:38.827Z]
[2026-01-14T15:16:38.827Z] Gradle Test Run :core:test > Gradle Test Executor 54 > ZkMigrationClientTest > testReadMigrateAndWriteProducerId() STARTED
[2026-01-14T15:16:38.827Z]
[2026-01-14T15:16:38.827Z] Gradle Test Run :core:test > Gradle Test Executor 54 > ZkMigrationClientTest > testReadMigrateAndWriteProducerId() PASSED
[2026-01-14T15:16:38.827Z]
[2026-01-14T15:16:38.827Z] Gradle Test Run :core:test > Gradle Test Executor 54 > ZkMigrationClientTest > testExistingKRaftControllerClaim() STARTED
[2026-01-14T15:16:40.362Z]
[2026-01-14T15:16:40.362Z] Gradle Test Run :core:test > Gradle Test Executor 54 > ZkMigrationClientTest > testExistingKRaftControllerClaim() PASSED
[2026-01-14T15:16:40.362Z]
[2026-01-14T15:16:40.362Z] Gradle Test Run :core:test > Gradle Test Executor 54 > ZkMigrationClientTest > testMigrateTopicConfigs() STARTED
[2026-01-14T15:16:41.722Z]
[2026-01-14T15:16:41.722Z] Gradle Test Run :core:test > Gradle Test Executor 54 > ZkMigrationClientTest > testMigrateTopicConfigs() PASSED
[2026-01-14T15:16:41.722Z]
[2026-01-14T15:16:41.722Z] Gradle Test Run :core:test > Gradle Test Executor 54 > ZkMigrationClientTest > testNonIncreasingKRaftEpoch() STARTED
[2026-01-14T15:16:41.722Z]
[2026-01-14T15:16:41.722Z] Gradle Test Run :core:test > Gradle Test Executor 54 > ZkMigrationClientTest > testNonIncreasingKRaftEpoch() PASSED
[2026-01-14T15:16:41.722Z]
[2026-01-14T15:16:41.722Z] Gradle Test Run :core:test > Gradle Test Executor 54 > ZkMigrationClientTest > testMigrateEmptyZk() STARTED
[2026-01-14T15:16:43.222Z]
[2026-01-14T15:16:43.222Z] Gradle Test Run :core:test > Gradle Test Executor 54 > ZkMigrationClientTest > testMigrateEmptyZk() PASSED
[2026-01-14T15:16:43.222Z]
[2026-01-14T15:16:43.222Z] Gradle Test Run :core:test > Gradle Test Executor 54 > ZkMigrationClientTest > testTopicAndBrokerConfigsMigrationWithSnapshots() STARTED
[2026-01-14T15:16:43.222Z]
[2026-01-14T15:16:43.222Z] Gradle Test Run :core:test > Gradle Test Executor 54 > ZkMigrationClientTest > testTopicAndBrokerConfigsMigrationWithSnapshots() PASSED
[2026-01-14T15:16:43.222Z]
[2026-01-14T15:16:43.222Z] Gradle Test Run :core:test > Gradle Test Executor 54 > ZkMigrationClientTest > testClaimAndReleaseExistingController() STARTED
[2026-01-14T15:16:44.757Z]
[2026-01-14T15:16:44.757Z] Gradle Test Run :core:test > Gradle Test Executor 54 > ZkMigrationClientTest > testClaimAndReleaseExistingController() PASSED
[2026-01-14T15:16:44.757Z]
[2026-01-14T15:16:44.757Z] Gradle Test Run :core:test > Gradle Test Executor 54 > ZkMigrationClientTest > testClaimAbsentController() STARTED
[2026-01-14T15:16:44.757Z]
[2026-01-14T15:16:44.757Z] Gradle Test Run :core:test > Gradle Test Executor 54 > ZkMigrationClientTest > testClaimAbsentController() PASSED
[2026-01-14T15:16:44.757Z]
[2026-01-14T15:16:44.757Z] Gradle Test Run :core:test > Gradle Test Executor 54 > ZkMigrationClientTest > testIdempotentCreateTopics() STARTED
[2026-01-14T15:16:46.460Z]
[2026-01-14T15:16:46.460Z] Gradle Test Run :core:test > Gradle Test Executor 54 > ZkMigrationClientTest > testIdempotentCreateTopics() PASSED
[2026-01-14T15:16:46.460Z]
[2026-01-14T15:16:46.460Z] Gradle Test Run :core:test > Gradle Test Executor 54 > ZkMigrationClientTest > testCreateNewTopic() STARTED
[2026-01-14T15:16:46.460Z]
[2026-01-14T15:16:46.460Z] Gradle Test Run :core:test > Gradle Test Executor 54 > ZkMigrationClientTest > testCreateNewTopic() PASSED
[2026-01-14T15:16:46.460Z]
[2026-01-14T15:16:46.460Z] Gradle Test Run :core:test > Gradle Test Executor 54 > ZkMigrationClientTest > testUpdateExistingTopicWithNewAndChangedPartitions() STARTED
[2026-01-14T15:16:47.992Z]
[2026-01-14T15:16:47.992Z] Gradle Test Run :core:test > Gradle Test Executor 54 > ZkMigrationClientTest > testUpdateExistingTopicWithNewAndChangedPartitions() PASSED
[2026-01-14T15:16:47.992Z]
[2026-01-14T15:16:47.992Z] Gradle Test Run :core:test > Gradle Test Executor 54 > ZooKeeperClientTest > testZNodeChangeHandlerForDataChange() STARTED
[2026-01-14T15:16:47.992Z]
[2026-01-14T15:16:47.992Z] Gradle Test Run :core:test > Gradle Test Executor 54 > ZooKeeperClientTest > testZNodeChangeHandlerForDataChange() PASSED
[2026-01-14T15:16:47.992Z]
[2026-01-14T15:16:47.992Z] Gradle Test Run :core:test > Gradle Test Executor 54 > ZooKeeperClientTest > testZooKeeperSessionStateMetric() STARTED
[2026-01-14T15:16:49.226Z]
[2026-01-14T15:16:49.226Z] Gradle Test Run :core:test > Gradle Test Executor 54 > ZooKeeperClientTest > testZooKeeperSessionStateMetric() PASSED
[2026-01-14T15:16:49.226Z]
[2026-01-14T15:16:49.226Z] Gradle Test Run :core:test > Gradle Test Executor 54 > ZooKeeperClientTest > testExceptionInBeforeInitializingSession() STARTED
[2026-01-14T15:16:49.226Z]
[2026-01-14T15:16:49.226Z] Gradle Test Run :core:test > Gradle Test Executor 54 > ZooKeeperClientTest > testExceptionInBeforeInitializingSession() PASSED
[2026-01-14T15:16:49.226Z]
[2026-01-14T15:16:49.226Z] Gradle Test Run :core:test > Gradle Test Executor 54 > ZooKeeperClientTest > testGetChildrenExistingZNode() STARTED
[2026-01-14T15:16:50.664Z]
[2026-01-14T15:16:50.664Z] Gradle Test Run :core:test > Gradle Test Executor 54 > ZooKeeperClientTest > testGetChildrenExistingZNode() PASSED
[2026-01-14T15:16:50.664Z]
[2026-01-14T15:16:50.664Z] Gradle Test Run :core:test > Gradle Test Executor 54 > ZooKeeperClientTest > testConnection() STARTED
[2026-01-14T15:16:52.285Z]
[2026-01-14T15:16:52.285Z] Gradle Test Run :core:test > Gradle Test Executor 54 > ZooKeeperClientTest > testConnection() PASSED
[2026-01-14T15:16:52.285Z]
[2026-01-14T15:16:52.285Z] Gradle Test Run :core:test > Gradle Test Executor 54 > ZooKeeperClientTest > testZNodeChangeHandlerForCreation() STARTED
[2026-01-14T15:16:52.285Z]
[2026-01-14T15:16:52.285Z] Gradle Test Run :core:test > Gradle Test Executor 54 > ZooKeeperClientTest > testZNodeChangeHandlerForCreation() PASSED
[2026-01-14T15:16:52.285Z]
[2026-01-14T15:16:52.285Z] Gradle Test Run :core:test > Gradle Test Executor 54 > ZooKeeperClientTest > testGetAclExistingZNode() STARTED
[2026-01-14T15:16:53.796Z]
[2026-01-14T15:16:53.796Z] Gradle Test Run :core:test > Gradle Test Executor 54 > ZooKeeperClientTest > testGetAclExistingZNode() PASSED
[2026-01-14T15:16:53.796Z]
[2026-01-14T15:16:53.796Z] Gradle Test Run :core:test > Gradle Test Executor 54 > ZooKeeperClientTest > testSessionExpiryDuringClose() STARTED
[2026-01-14T15:16:53.796Z]
[2026-01-14T15:16:53.796Z] Gradle Test Run :core:test > Gradle Test Executor 54 > ZooKeeperClientTest > testSessionExpiryDuringClose() PASSED
[2026-01-14T15:16:53.796Z]
[2026-01-14T15:16:53.796Z] Gradle Test Run :core:test > Gradle Test Executor 54 > ZooKeeperClientTest > testReinitializeAfterAuthFailure() STARTED
[2026-01-14T15:16:57.612Z]
[2026-01-14T15:16:57.612Z] Gradle Test Run :core:test > Gradle Test Executor 54 > ZooKeeperClientTest > testReinitializeAfterAuthFailure() PASSED
[2026-01-14T15:16:57.612Z]
[2026-01-14T15:16:57.612Z] Gradle Test Run :core:test > Gradle Test Executor 54 > ZooKeeperClientTest > testSetAclNonExistentZNode() STARTED
[2026-01-14T15:16:57.612Z]
[2026-01-14T15:16:57.612Z] Gradle Test Run :core:test > Gradle Test Executor 54 > ZooKeeperClientTest > testSetAclNonExistentZNode() PASSED
[2026-01-14T15:16:57.612Z]
[2026-01-14T15:16:57.612Z] Gradle Test Run :core:test > Gradle Test Executor 54 > ZooKeeperClientTest > testConnectionLossRequestTermination() STARTED
[2026-01-14T15:17:09.754Z]
[2026-01-14T15:17:09.754Z] Gradle Test Run :core:test > Gradle Test Executor 54 > ZooKeeperClientTest > testConnectionLossRequestTermination() PASSED
[2026-01-14T15:17:09.755Z]
[2026-01-14T15:17:09.755Z] Gradle Test Run :core:test > Gradle Test Executor 54 > ZooKeeperClientTest > testExistsNonExistentZNode() STARTED
[2026-01-14T15:17:11.197Z]
[2026-01-14T15:17:11.197Z] Gradle Test Run :core:test > Gradle Test Executor 54 > ZooKeeperClientTest > testExistsNonExistentZNode() PASSED
[2026-01-14T15:17:11.197Z]
[2026-01-14T15:17:11.197Z] Gradle Test Run :core:test > Gradle Test Executor 54 > ZooKeeperClientTest > testGetDataNonExistentZNode() STARTED
[2026-01-14T15:17:11.197Z]
[2026-01-14T15:17:11.197Z] Gradle Test Run :core:test > Gradle Test Executor 54 > ZooKeeperClientTest > testGetDataNonExistentZNode() PASSED
[2026-01-14T15:17:11.197Z]
[2026-01-14T15:17:11.197Z] Gradle Test Run :core:test > Gradle Test Executor 54 > ZooKeeperClientTest > testConnectionTimeout() STARTED
[2026-01-14T15:17:15.074Z]
[2026-01-14T15:17:15.074Z] Gradle Test Run :core:test > Gradle Test Executor 54 > ZooKeeperClientTest > testConnectionTimeout() PASSED
[2026-01-14T15:17:15.074Z]
[2026-01-14T15:17:15.074Z] Gradle Test Run :core:test > Gradle Test Executor 54 > ZooKeeperClientTest > testBlockOnRequestCompletionFromStateChangeHandler() STARTED
[2026-01-14T15:17:15.074Z]
[2026-01-14T15:17:15.074Z] Gradle Test Run :core:test > Gradle Test Executor 54 > ZooKeeperClientTest > testBlockOnRequestCompletionFromStateChangeHandler() PASSED
[2026-01-14T15:17:15.074Z]
[2026-01-14T15:17:15.074Z] Gradle Test Run :core:test > Gradle Test Executor 54 > ZooKeeperClientTest > testUnresolvableConnectString() STARTED
[2026-01-14T15:17:16.435Z]
[2026-01-14T15:17:16.435Z] Gradle Test Run :core:test > Gradle Test Executor 54 > ZooKeeperClientTest > testUnresolvableConnectString() PASSED
[2026-01-14T15:17:16.435Z]
[2026-01-14T15:17:16.435Z] Gradle Test Run :core:test > Gradle Test Executor 54 > ZooKeeperClientTest > testGetChildrenNonExistentZNode() STARTED
[2026-01-14T15:17:16.435Z]
[2026-01-14T15:17:16.435Z] Gradle Test Run :core:test > Gradle Test Executor 54 > ZooKeeperClientTest > testGetChildrenNonExistentZNode() PASSED
[2026-01-14T15:17:16.435Z]
[2026-01-14T15:17:16.435Z] Gradle Test Run :core:test > Gradle Test Executor 54 > ZooKeeperClientTest > testPipelinedGetData() STARTED
[2026-01-14T15:17:17.741Z]
[2026-01-14T15:17:17.741Z] Gradle Test Run :core:test > Gradle Test Executor 54 > ZooKeeperClientTest > testPipelinedGetData() PASSED
[2026-01-14T15:17:17.741Z]
[2026-01-14T15:17:17.741Z] Gradle Test Run :core:test > Gradle Test Executor 54 > ZooKeeperClientTest > testZNodeChildChangeHandlerForChildChange() STARTED
[2026-01-14T15:17:19.388Z]
[2026-01-14T15:17:19.388Z] Gradle Test Run :core:test > Gradle Test Executor 54 > ZooKeeperClientTest > testZNodeChildChangeHandlerForChildChange() PASSED
[2026-01-14T15:17:19.388Z]
[2026-01-14T15:17:19.388Z] Gradle Test Run :core:test > Gradle Test Executor 54 > ZooKeeperClientTest > testGetChildrenExistingZNodeWithChildren() STARTED
[2026-01-14T15:17:19.388Z]
[2026-01-14T15:17:19.388Z] Gradle Test Run :core:test > Gradle Test Executor 54 > ZooKeeperClientTest > testGetChildrenExistingZNodeWithChildren() PASSED
[2026-01-14T15:17:19.388Z]
[2026-01-14T15:17:19.388Z] Gradle Test Run :core:test > Gradle Test Executor 54 > ZooKeeperClientTest > testSetDataExistingZNode() STARTED
[2026-01-14T15:17:20.948Z]
[2026-01-14T15:17:20.948Z] Gradle Test Run :core:test > Gradle Test Executor 54 > ZooKeeperClientTest > testSetDataExistingZNode() PASSED
[2026-01-14T15:17:20.948Z]
[2026-01-14T15:17:20.948Z] Gradle Test Run :core:test > Gradle Test Executor 54 > ZooKeeperClientTest > testZNodeChildChangeHandlerForChildChangeNotTriggered() STARTED
[2026-01-14T15:17:20.948Z]
[2026-01-14T15:17:20.948Z] Gradle Test Run :core:test > Gradle Test Executor 54 > ZooKeeperClientTest > testZNodeChildChangeHandlerForChildChangeNotTriggered() PASSED
[2026-01-14T15:17:20.948Z]
[2026-01-14T15:17:20.948Z] Gradle Test Run :core:test > Gradle Test Executor 54 > ZooKeeperClientTest > testMixedPipeline() STARTED
[2026-01-14T15:17:22.658Z]
[2026-01-14T15:17:22.658Z] Gradle Test Run :core:test > Gradle Test Executor 54 > ZooKeeperClientTest > testMixedPipeline() PASSED
[2026-01-14T15:17:22.658Z]
[2026-01-14T15:17:22.658Z] Gradle Test Run :core:test > Gradle Test Executor 54 > ZooKeeperClientTest > testGetDataExistingZNode() STARTED
[2026-01-14T15:17:22.658Z]
[2026-01-14T15:17:22.658Z] Gradle Test Run :core:test > Gradle Test Executor 54 > ZooKeeperClientTest > testGetDataExistingZNode() PASSED
[2026-01-14T15:17:22.658Z]
[2026-01-14T15:17:22.658Z] Gradle Test Run :core:test > Gradle Test Executor 54 > ZooKeeperClientTest > testDeleteExistingZNode() STARTED
[2026-01-14T15:17:24.182Z]
[2026-01-14T15:17:24.182Z] Gradle Test Run :core:test > Gradle Test Executor 54 > ZooKeeperClientTest > testDeleteExistingZNode() PASSED
[2026-01-14T15:17:24.182Z]
[2026-01-14T15:17:24.182Z] Gradle Test Run :core:test > Gradle Test Executor 54 > ZooKeeperClientTest > testSessionExpiry() STARTED
[2026-01-14T15:17:25.751Z]
[2026-01-14T15:17:25.751Z] Gradle Test Run :core:test > Gradle Test Executor 54 > ZooKeeperClientTest > testSessionExpiry() PASSED
[2026-01-14T15:17:25.751Z]
[2026-01-14T15:17:25.751Z] Gradle Test Run :core:test > Gradle Test Executor 54 > ZooKeeperClientTest > testSetDataNonExistentZNode() STARTED
[2026-01-14T15:17:27.288Z]
[2026-01-14T15:17:27.288Z] Gradle Test Run :core:test > Gradle Test Executor 54 > ZooKeeperClientTest > testSetDataNonExistentZNode() PASSED
[2026-01-14T15:17:27.288Z]
[2026-01-14T15:17:27.288Z] Gradle Test Run :core:test > Gradle Test Executor 54 > ZooKeeperClientTest > testConnectionViaNettyClient() STARTED
[2026-01-14T15:17:27.288Z]
[2026-01-14T15:17:27.288Z] Gradle Test Run :core:test > Gradle Test Executor 54 > ZooKeeperClientTest > testConnectionViaNettyClient() PASSED
[2026-01-14T15:17:27.288Z]
[2026-01-14T15:17:27.288Z] Gradle Test Run :core:test > Gradle Test Executor 54 > ZooKeeperClientTest > testDeleteNonExistentZNode() STARTED
[2026-01-14T15:17:28.833Z]
[2026-01-14T15:17:28.833Z] Gradle Test Run :core:test > Gradle Test Executor 54 > ZooKeeperClientTest > testDeleteNonExistentZNode() PASSED
[2026-01-14T15:17:28.833Z]
[2026-01-14T15:17:28.833Z] Gradle Test Run :core:test > Gradle Test Executor 54 > ZooKeeperClientTest > testExistsExistingZNode() STARTED
[2026-01-14T15:17:28.833Z]
[2026-01-14T15:17:28.833Z] Gradle Test Run :core:test > Gradle Test Executor 54 > ZooKeeperClientTest > testExistsExistingZNode() PASSED
[2026-01-14T15:17:28.833Z]
[2026-01-14T15:17:28.833Z] Gradle Test Run :core:test > Gradle Test Executor 54 > ZooKeeperClientTest > testZooKeeperStateChangeRateMetrics() STARTED
[2026-01-14T15:17:30.352Z]
[2026-01-14T15:17:30.353Z] Gradle Test Run :core:test > Gradle Test Executor 54 > ZooKeeperClientTest > testZooKeeperStateChangeRateMetrics() PASSED
[2026-01-14T15:17:30.353Z]
[2026-01-14T15:17:30.353Z] Gradle Test Run :core:test > Gradle Test Executor 54 > ZooKeeperClientTest > testZNodeChangeHandlerForDeletion() STARTED
[2026-01-14T15:17:30.353Z]
[2026-01-14T15:17:30.353Z] Gradle Test Run :core:test > Gradle Test Executor 54 > ZooKeeperClientTest > testZNodeChangeHandlerForDeletion() PASSED
[2026-01-14T15:17:30.353Z]
[2026-01-14T15:17:30.353Z] Gradle Test Run :core:test > Gradle Test Executor 54 > ZooKeeperClientTest > testGetAclNonExistentZNode() STARTED
[2026-01-14T15:17:31.898Z]
[2026-01-14T15:17:31.898Z] Gradle Test Run :core:test > Gradle Test Executor 54 > ZooKeeperClientTest > testGetAclNonExistentZNode() PASSED
[2026-01-14T15:17:31.898Z]
[2026-01-14T15:17:31.898Z] Gradle Test Run :core:test > Gradle Test Executor 54 > ZooKeeperClientTest > testStateChangeHandlerForAuthFailure() STARTED
[2026-01-14T15:17:31.898Z]
[2026-01-14T15:17:31.898Z] Gradle Test Run :core:test > Gradle Test Executor 54 > ZooKeeperClientTest > testStateChangeHandlerForAuthFailure() PASSED
[2026-01-14T15:17:31.898Z]
[2026-01-14T15:17:31.898Z] Gradle Test Run :core:test > Gradle Test Executor 54 > AllocateProducerIdsRequestTest > testAllocateProducersIdSentToController() > testAllocateProducersIdSentToController [1] Type=Raft-Isolated, MetadataVersion=4.0-IV1,Security=PLAINTEXT STARTED
[2026-01-14T15:17:34.962Z]
[2026-01-14T15:17:34.962Z] Gradle Test Run :core:test > Gradle Test Executor 54 > AllocateProducerIdsRequestTest > testAllocateProducersIdSentToController() > testAllocateProducersIdSentToController [1] Type=Raft-Isolated, MetadataVersion=4.0-IV1,Security=PLAINTEXT PASSED
[2026-01-14T15:17:34.962Z]
[2026-01-14T15:17:34.962Z] Gradle Test Run :core:test > Gradle Test Executor 54 > AllocateProducerIdsRequestTest > testAllocateProducersIdSentToNonController() > testAllocateProducersIdSentToNonController [1] Type=Raft-Isolated, MetadataVersion=4.0-IV1,Security=PLAINTEXT STARTED
[2026-01-14T15:17:44.048Z]
[2026-01-14T15:17:44.048Z] Gradle Test Run :core:test > Gradle Test Executor 54 > AllocateProducerIdsRequestTest > testAllocateProducersIdSentToNonController() > testAllocateProducersIdSentToNonController [1] Type=Raft-Isolated, MetadataVersion=4.0-IV1,Security=PLAINTEXT PASSED
[2026-01-14T15:17:44.048Z]
[2026-01-14T15:17:44.048Z] Gradle Test Run :core:test > Gradle Test Executor 54 > UnifiedLogTest > testRandomRecords STARTED
[2026-01-14T15:17:44.048Z]
[2026-01-14T15:17:44.048Z] Gradle Test Run :core:test > Gradle Test Executor 54 > UnifiedLogTest > testRandomRecords PASSED
[2026-01-14T15:17:52.082Z]
[2026-01-14T15:17:52.082Z] Gradle Test Run :core:test > Gradle Test Executor 112 > UserQuotaTest > testQuotaOverrideDelete(String) > "testQuotaOverrideDelete(String).quorum=zk" STARTED
[2026-01-14T15:18:57.895Z]
[2026-01-14T15:18:57.895Z] Gradle Test Run :core:test > Gradle Test Executor 112 > UserQuotaTest > testQuotaOverrideDelete(String) > "testQuotaOverrideDelete(String).quorum=zk" PASSED
[2026-01-14T15:18:57.895Z]
[2026-01-14T15:18:57.895Z] Gradle Test Run :core:test > Gradle Test Executor 112 > UserQuotaTest > testQuotaOverrideDelete(String) > "testQuotaOverrideDelete(String).quorum=kraft" STARTED
[2026-01-14T15:19:51.290Z]
[2026-01-14T15:19:51.290Z] Gradle Test Run :core:test > Gradle Test Executor 112 > UserQuotaTest > testQuotaOverrideDelete(String) > "testQuotaOverrideDelete(String).quorum=kraft" PASSED
[2026-01-14T15:19:51.290Z]
[2026-01-14T15:19:51.290Z] 5981 tests completed, 1 failed, 16 skipped
[2026-01-14T15:19:51.290Z] There were failing tests. See the report at: file:///home/jenkins/jenkins-agent/workspace/Kafka_kafka_3.9/core/build/reports/tests/test/index.html
[2026-01-14T15:19:52.477Z]
[2026-01-14T15:19:52.477Z] Deprecated Gradle features were used in this build, making it incompatible with Gradle 9.0.
[2026-01-14T15:19:52.477Z]
[2026-01-14T15:19:52.477Z] You can use '--warning-mode all' to show the individual deprecation warnings and determine if they come from your own scripts or plugins.
[2026-01-14T15:19:52.477Z]
[2026-01-14T15:19:52.477Z] For more on this, please refer to https://docs.gradle.org/8.10.2/userguide/command_line_interface.html#sec:command_line_warnings in the Gradle documentation.
[2026-01-14T15:19:52.477Z]
[2026-01-14T15:19:52.477Z] BUILD SUCCESSFUL in 4h 40m 4s
[2026-01-14T15:19:52.477Z] 338 actionable tasks: 100 executed, 238 up-to-date
[2026-01-14T15:19:53.846Z]
[2026-01-14T15:19:53.846Z] See the profiling report at: file:///home/jenkins/jenkins-agent/workspace/Kafka_kafka_3.9/build/reports/profile/profile-2026-01-14-10-39-52.html
[2026-01-14T15:19:53.846Z] A fine-grained performance profile is available: use the --scan option.
[Pipeline] junit
[2026-01-14T15:19:54.973Z] Recording test results
[2026-01-14T15:20:10.462Z] [Checks API] No suitable checks publisher found.
[Pipeline] echo
[2026-01-14T15:20:10.463Z] Skipping Kafka Streams archetype test for Java 17
[Pipeline] }
[Pipeline] // withEnv
[Pipeline] }
[Pipeline] // withEnv
[Pipeline] }
[Pipeline] // withEnv
[Pipeline] }
[Pipeline] // node
[Pipeline] }
[Pipeline] // timestamps
[Pipeline] }
[Pipeline] // timeout
[Pipeline] }
[Pipeline] // stage
[Pipeline] }
[Pipeline] // parallel
[Pipeline] }
[Pipeline] // stage
[Pipeline] stage
[Pipeline] { (Declarative: Post Actions)
[Pipeline] script
[Pipeline] {
[Pipeline] node
Running on builds23 in /home/jenkins/workspace/Kafka_kafka_3.9
[Pipeline] {
[Pipeline] step
Jenkins build is unstable: Kafka » Kafka Branch Builder » 3.9 #258
Posted by Apache Jenkins Server <je...@builds.apache.org>.
See <https://ci-builds.apache.org/job/Kafka/job/kafka/job/3.9/258/display/redirect>