You are viewing a plain text version of this content. The canonical link for it is here.
Posted to issues@bookkeeper.apache.org by Apache Jenkins Server <je...@builds.apache.org> on 2018/03/18 13:06:10 UTC

Build failed in Jenkins: bookkeeper_release_branch #92

See <https://builds.apache.org/job/bookkeeper_release_branch/92/display/redirect>

------------------------------------------
[...truncated 441.81 KB...]
Running org.apache.bookkeeper.client.TestRackawareEnsemblePlacementPolicyUsingScript
Tests run: 9, Failures: 0, Errors: 0, Skipped: 0, Time elapsed: 0.487 sec - in org.apache.bookkeeper.client.TestRackawareEnsemblePlacementPolicyUsingScript
Running org.apache.bookkeeper.client.BookieRecoveryTest
Tests run: 12, Failures: 0, Errors: 0, Skipped: 0, Time elapsed: 37.54 sec - in org.apache.bookkeeper.client.BookieRecoveryTest
Running org.apache.bookkeeper.client.TestDelayEnsembleChange
Tests run: 6, Failures: 0, Errors: 0, Skipped: 0, Time elapsed: 7.433 sec - in org.apache.bookkeeper.client.TestDelayEnsembleChange
Running org.apache.bookkeeper.client.TestPiggybackLAC
Tests run: 1, Failures: 0, Errors: 0, Skipped: 0, Time elapsed: 4.195 sec - in org.apache.bookkeeper.client.TestPiggybackLAC
Running org.apache.bookkeeper.client.TestReadTimeout
Tests run: 1, Failures: 0, Errors: 0, Skipped: 0, Time elapsed: 17.575 sec - in org.apache.bookkeeper.client.TestReadTimeout
Running org.apache.bookkeeper.client.ParallelLedgerRecoveryTest
Tests run: 14, Failures: 0, Errors: 0, Skipped: 0, Time elapsed: 37.13 sec - in org.apache.bookkeeper.client.ParallelLedgerRecoveryTest
Running org.apache.bookkeeper.client.TestTryReadLastConfirmed
Tests run: 3, Failures: 0, Errors: 0, Skipped: 0, Time elapsed: 9.11 sec - in org.apache.bookkeeper.client.TestTryReadLastConfirmed
Running org.apache.bookkeeper.client.ListLedgersTest
Tests run: 3, Failures: 0, Errors: 0, Skipped: 0, Time elapsed: 2.216 sec - in org.apache.bookkeeper.client.ListLedgersTest
Running org.apache.bookkeeper.client.TestPendingReadLacOp
Tests run: 2, Failures: 0, Errors: 0, Skipped: 0, Time elapsed: 1.941 sec - in org.apache.bookkeeper.client.TestPendingReadLacOp
Running org.apache.bookkeeper.client.TestDisableEnsembleChange
Tests run: 4, Failures: 0, Errors: 0, Skipped: 0, Time elapsed: 21.79 sec - in org.apache.bookkeeper.client.TestDisableEnsembleChange
Running org.apache.bookkeeper.client.LedgerMetadataTest
Tests run: 6, Failures: 0, Errors: 0, Skipped: 0, Time elapsed: 0.448 sec - in org.apache.bookkeeper.client.LedgerMetadataTest
Running org.apache.bookkeeper.client.LedgerCloseTest
Tests run: 4, Failures: 0, Errors: 0, Skipped: 0, Time elapsed: 23.188 sec - in org.apache.bookkeeper.client.LedgerCloseTest
Running org.apache.bookkeeper.client.BookKeeperCloseTest
Tests run: 10, Failures: 0, Errors: 0, Skipped: 0, Time elapsed: 14.68 sec - in org.apache.bookkeeper.client.BookKeeperCloseTest
Running org.apache.bookkeeper.client.TestBookieHealthCheck
Tests run: 3, Failures: 0, Errors: 0, Skipped: 0, Time elapsed: 17.576 sec - in org.apache.bookkeeper.client.TestBookieHealthCheck
Running org.apache.bookkeeper.client.UpdateLedgerOpTest
Tests run: 4, Failures: 0, Errors: 0, Skipped: 0, Time elapsed: 36.651 sec - in org.apache.bookkeeper.client.UpdateLedgerOpTest
Running org.apache.bookkeeper.client.PendingAddOpTest
Tests run: 1, Failures: 0, Errors: 0, Skipped: 0, Time elapsed: 1.55 sec - in org.apache.bookkeeper.client.PendingAddOpTest
Running org.apache.bookkeeper.client.TestWatchEnsembleChange
Tests run: 9, Failures: 0, Errors: 4, Skipped: 0, Time elapsed: 16.394 sec <<< FAILURE! - in org.apache.bookkeeper.client.TestWatchEnsembleChange
testWatchEnsembleChange[2](org.apache.bookkeeper.client.TestWatchEnsembleChange)  Time elapsed: 0.095 sec  <<< ERROR!
java.lang.OutOfMemoryError: unable to create new native thread

testWatchEnsembleChange[2](org.apache.bookkeeper.client.TestWatchEnsembleChange)  Time elapsed: 0.096 sec  <<< ERROR!
java.lang.OutOfMemoryError: unable to create new native thread

testWatchMetadataRemoval[3](org.apache.bookkeeper.client.TestWatchEnsembleChange)  Time elapsed: 0.03 sec  <<< ERROR!
java.lang.OutOfMemoryError: unable to create new native thread

testWatchEnsembleChange[3](org.apache.bookkeeper.client.TestWatchEnsembleChange)  Time elapsed: 0.017 sec  <<< ERROR!
java.lang.OutOfMemoryError: unable to create new native thread

Error occurred during initialization of VM
java.lang.OutOfMemoryError: unable to create new native thread
	at java.lang.Thread.start0(Native Method)
	at java.lang.Thread.start(Thread.java:717)
	at java.lang.ref.Finalizer.<clinit>(Finalizer.java:226)
#
# There is insufficient memory for the Java Runtime Environment to continue.
# Cannot create GC thread. Out of system resources.
# An error report file with more information is saved as:
# <https://builds.apache.org/job/bookkeeper_release_branch/ws/bookkeeper-server/hs_err_pid9097.log>
Error occurred during initialization of VM
java.lang.OutOfMemoryError: unable to create new native thread
	at java.lang.Thread.start0(Native Method)
	at java.lang.Thread.start(Thread.java:717)
	at java.lang.ref.Reference.<clinit>(Reference.java:232)
Running org.apache.bookkeeper.util.collections.ConcurrentLongLongPairHashMapTest
Tests run: 12, Failures: 0, Errors: 0, Skipped: 0, Time elapsed: 1.434 sec - in org.apache.bookkeeper.util.collections.ConcurrentLongLongPairHashMapTest
Running org.apache.bookkeeper.util.collections.ConcurrentLongLongHashMapTest
Tests run: 17, Failures: 0, Errors: 0, Skipped: 0, Time elapsed: 0.936 sec - in org.apache.bookkeeper.util.collections.ConcurrentLongLongHashMapTest
Running org.apache.bookkeeper.util.collections.ConcurrentLongHashMapTest
Tests run: 12, Failures: 0, Errors: 0, Skipped: 0, Time elapsed: 0.828 sec - in org.apache.bookkeeper.util.collections.ConcurrentLongHashMapTest
Running org.apache.bookkeeper.util.collections.ConcurrentLongHashSetTest
Tests run: 9, Failures: 0, Errors: 0, Skipped: 0, Time elapsed: 0.7 sec - in org.apache.bookkeeper.util.collections.ConcurrentLongHashSetTest
Running org.apache.bookkeeper.util.collections.ConcurrentOpenHashMapTest
Tests run: 13, Failures: 0, Errors: 0, Skipped: 0, Time elapsed: 1.227 sec - in org.apache.bookkeeper.util.collections.ConcurrentOpenHashMapTest
Running org.apache.bookkeeper.util.collections.GrowableArrayBlockingQueueTest
Tests run: 5, Failures: 0, Errors: 0, Skipped: 0, Time elapsed: 0.247 sec - in org.apache.bookkeeper.util.collections.GrowableArrayBlockingQueueTest
Running org.apache.bookkeeper.util.collections.ConcurrentOpenHashSetTest
Tests run: 10, Failures: 0, Errors: 0, Skipped: 0, Time elapsed: 0.953 sec - in org.apache.bookkeeper.util.collections.ConcurrentOpenHashSetTest
Running org.apache.bookkeeper.test.ConditionalSetTest
Tests run: 1, Failures: 0, Errors: 0, Skipped: 0, Time elapsed: 1.965 sec - in org.apache.bookkeeper.test.ConditionalSetTest
Running org.apache.bookkeeper.test.OpStatTest
Tests run: 2, Failures: 0, Errors: 0, Skipped: 0, Time elapsed: 4.536 sec - in org.apache.bookkeeper.test.OpStatTest
Running org.apache.bookkeeper.test.BookieClientTest
Tests run: 3, Failures: 0, Errors: 0, Skipped: 0, Time elapsed: 1.329 sec - in org.apache.bookkeeper.test.BookieClientTest
Running org.apache.bookkeeper.test.ForceReadOnlyBookieTest
Tests run: 1, Failures: 0, Errors: 0, Skipped: 0, Time elapsed: 4.986 sec - in org.apache.bookkeeper.test.ForceReadOnlyBookieTest
Running org.apache.bookkeeper.test.ConfigurationTest
Tests run: 2, Failures: 0, Errors: 0, Skipped: 0, Time elapsed: 0.212 sec - in org.apache.bookkeeper.test.ConfigurationTest
Running org.apache.bookkeeper.test.BookieZKExpireTest
Tests run: 1, Failures: 0, Errors: 0, Skipped: 0, Time elapsed: 16.201 sec - in org.apache.bookkeeper.test.BookieZKExpireTest
Running org.apache.bookkeeper.test.LedgerDeleteTest
Tests run: 2, Failures: 0, Errors: 0, Skipped: 0, Time elapsed: 8.974 sec - in org.apache.bookkeeper.test.LedgerDeleteTest
Running org.apache.bookkeeper.test.BookieFailureTest
Running org.apache.bookkeeper.test.ConcurrentLedgerTest
Tests run: 1, Failures: 0, Errors: 0, Skipped: 0, Time elapsed: 0.718 sec - in org.apache.bookkeeper.test.ConcurrentLedgerTest
Running org.apache.bookkeeper.test.ReadOnlyBookieTest
Tests run: 5, Failures: 0, Errors: 1, Skipped: 0, Time elapsed: 8.199 sec <<< FAILURE! - in org.apache.bookkeeper.test.ReadOnlyBookieTest
testBookieContinueWritingIfMultipleLedgersPresent(org.apache.bookkeeper.test.ReadOnlyBookieTest)  Time elapsed: 0.146 sec  <<< ERROR!
io.netty.channel.unix.Errors$NativeIoException: bind(..) failed: Address already in use

Running org.apache.bookkeeper.test.AsyncLedgerOpsTest
Tests run: 1, Failures: 0, Errors: 0, Skipped: 0, Time elapsed: 4.12 sec - in org.apache.bookkeeper.test.AsyncLedgerOpsTest
Running org.apache.bookkeeper.test.LocalBookiesRegistryTest
Tests run: 1, Failures: 0, Errors: 0, Skipped: 0, Time elapsed: 1.638 sec - in org.apache.bookkeeper.test.LocalBookiesRegistryTest
Running org.apache.bookkeeper.test.BookieJournalRollingTest
Running org.apache.bookkeeper.test.BookieReadWriteTest
Running org.apache.bookkeeper.test.LedgerCreateDeleteTest
Tests run: 3, Failures: 0, Errors: 0, Skipped: 0, Time elapsed: 5.683 sec - in org.apache.bookkeeper.test.LedgerCreateDeleteTest
Running org.apache.bookkeeper.test.CloseTest
Tests run: 2, Failures: 0, Errors: 0, Skipped: 0, Time elapsed: 4.614 sec - in org.apache.bookkeeper.test.CloseTest
Running org.apache.bookkeeper.test.MultipleThreadReadTest
Tests run: 3, Failures: 0, Errors: 0, Skipped: 0, Time elapsed: 10.845 sec - in org.apache.bookkeeper.test.MultipleThreadReadTest
Running org.apache.bookkeeper.replication.AutoRecoveryMainTest
Tests run: 3, Failures: 0, Errors: 0, Skipped: 0, Time elapsed: 5.56 sec - in org.apache.bookkeeper.replication.AutoRecoveryMainTest
Running org.apache.bookkeeper.replication.TestAutoRecoveryAlongWithBookieServers
Tests run: 1, Failures: 0, Errors: 0, Skipped: 0, Time elapsed: 5.953 sec - in org.apache.bookkeeper.replication.TestAutoRecoveryAlongWithBookieServers
Running org.apache.bookkeeper.replication.AuthAutoRecoveryTest
Tests run: 1, Failures: 0, Errors: 0, Skipped: 0, Time elapsed: 2.068 sec - in org.apache.bookkeeper.replication.AuthAutoRecoveryTest
Running org.apache.bookkeeper.replication.TestReplicationWorker
Running org.apache.bookkeeper.replication.AuditorLedgerCheckerTest
Running org.apache.bookkeeper.replication.BookieLedgerIndexTest
Tests run: 3, Failures: 0, Errors: 0, Skipped: 0, Time elapsed: 7.154 sec - in org.apache.bookkeeper.replication.BookieLedgerIndexTest
Running org.apache.bookkeeper.replication.AuditorRollingRestartTest
Running org.apache.bookkeeper.replication.AuditorPeriodicCheckTest
Tests run: 4, Failures: 0, Errors: 0, Skipped: 0, Time elapsed: 15.079 sec - in org.apache.bookkeeper.replication.AuditorPeriodicCheckTest
Running org.apache.bookkeeper.replication.TestLedgerUnderreplicationManager
Running org.apache.bookkeeper.replication.AuditorPeriodicBookieCheckTest
Tests run: 1, Failures: 0, Errors: 0, Skipped: 0, Time elapsed: 2.477 sec - in org.apache.bookkeeper.replication.AuditorPeriodicBookieCheckTest
Running org.apache.bookkeeper.replication.AuditorBookieTest
Tests run: 5, Failures: 0, Errors: 0, Skipped: 0, Time elapsed: 7.847 sec - in org.apache.bookkeeper.replication.AuditorBookieTest
Running org.apache.bookkeeper.replication.BookieAutoRecoveryTest
Running org.apache.bookkeeper.zookeeper.TestZooKeeperClient
Running org.apache.bookkeeper.zookeeper.TestRetryPolicy
Tests run: 2, Failures: 0, Errors: 0, Skipped: 0, Time elapsed: 0.073 sec - in org.apache.bookkeeper.zookeeper.TestRetryPolicy
Running org.apache.bookkeeper.meta.GcLedgersTest
Running org.apache.bookkeeper.meta.LedgerLayoutTest
Tests run: 5, Failures: 0, Errors: 0, Skipped: 0, Time elapsed: 0.65 sec - in org.apache.bookkeeper.meta.LedgerLayoutTest
Running org.apache.bookkeeper.meta.TestLedgerManager
Tests run: 5, Failures: 0, Errors: 0, Skipped: 0, Time elapsed: 1.077 sec - in org.apache.bookkeeper.meta.TestLedgerManager
Running org.apache.bookkeeper.meta.LedgerManagerIteratorTest
Tests run: 4, Failures: 0, Errors: 0, Skipped: 0, Time elapsed: 0.661 sec - in org.apache.bookkeeper.meta.LedgerManagerIteratorTest
Running org.apache.bookkeeper.meta.TestLongZkLedgerIdGenerator
Tests run: 1, Failures: 0, Errors: 0, Skipped: 0, Time elapsed: 2.125 sec - in org.apache.bookkeeper.meta.TestLongZkLedgerIdGenerator
Running org.apache.bookkeeper.meta.TestZkLedgerIdGenerator
Tests run: 1, Failures: 0, Errors: 0, Skipped: 0, Time elapsed: 1.642 sec - in org.apache.bookkeeper.meta.TestZkLedgerIdGenerator
Running org.apache.bookkeeper.meta.AbstractZkLedgerManagerTest
Tests run: 26, Failures: 0, Errors: 0, Skipped: 0, Time elapsed: 3.649 sec - in org.apache.bookkeeper.meta.AbstractZkLedgerManagerTest
Running org.apache.bookkeeper.meta.LedgerMetadataCreationTest
Running org.apache.bookkeeper.metastore.TestMetaStore
Tests run: 5, Failures: 0, Errors: 0, Skipped: 0, Time elapsed: 0.302 sec - in org.apache.bookkeeper.metastore.TestMetaStore
Running org.apache.bookkeeper.auth.TestAuth
Tests run: 12, Failures: 0, Errors: 0, Skipped: 0, Time elapsed: 17.78 sec - in org.apache.bookkeeper.auth.TestAuth

Results :

Tests in error: 
org.apache.bookkeeper.client.TestWatchEnsembleChange.testWatchEnsembleChange[2](org.apache.bookkeeper.client.TestWatchEnsembleChange)
  Run 1: TestWatchEnsembleChange>BookKeeperClusterTestCase.setUp:118->BookKeeperClusterTestCase.startBKCluster:178->BookKeeperClusterTestCase.startNewBookie:550->BookKeeperClusterTestCase.startBookie:566 » OutOfMemory
  Run 2: TestWatchEnsembleChange>BookKeeperClusterTestCase.tearDown:131->BookKeeperClusterTestCase.stopBKCluster:190 » OutOfMemory

  TestWatchEnsembleChange>BookKeeperClusterTestCase.setUp:116->BookKeeperClusterTestCase.startZKCluster:151 » OutOfMemory
  TestWatchEnsembleChange>BookKeeperClusterTestCase.setUp:116->BookKeeperClusterTestCase.startZKCluster:151 » OutOfMemory
  ReadOnlyBookieTest.testBookieContinueWritingIfMultipleLedgersPresent » NativeIo

Tests run: 648, Failures: 0, Errors: 4, Skipped: 0

[JENKINS] Recording test results
[JENKINS] Archiving disabled
[JENKINS] Archiving disabled
[JENKINS] Archiving disabled
[JENKINS] Archiving disabled
[JENKINS] Archiving disabled
[JENKINS] Archiving disabled
[JENKINS] Archiving disabled
[JENKINS] Archiving disabled
[JENKINS] Archiving disabled
[JENKINS] Archiving disabled
[JENKINS] Archiving disabled
[JENKINS] Archiving disabled
[JENKINS] Archiving disabled
[JENKINS] Archiving disabled
[JENKINS] Archiving disabled
[JENKINS] Archiving disabled
[JENKINS] Archiving disabled
[JENKINS] Archiving disabled
[JENKINS] Archiving disabled
[JENKINS] Archiving disabled
[JENKINS] Archiving disabled
[JENKINS] Archiving disabled
[JENKINS] Archiving disabled
[JENKINS] Archiving disabled
[JENKINS] Archiving disabled
[JENKINS] Archiving disabled
[JENKINS] Archiving disabled
[JENKINS] Archiving disabled
[JENKINS] Archiving disabled
[JENKINS] Archiving disabled
[JENKINS] Archiving disabled
2018-03-18T13:05:59.946 [INFO] ------------------------------------------------------------------------
2018-03-18T13:05:59.946 [INFO] Reactor Summary:
2018-03-18T13:05:59.946 [INFO] 
2018-03-18T13:05:59.947 [INFO] Apache BookKeeper :: Parent ........................ SUCCESS [ 17.520 s]
2018-03-18T13:05:59.947 [INFO] Apache BookKeeper :: Build Tools ................... SUCCESS [  5.361 s]
2018-03-18T13:05:59.947 [INFO] Apache BookKeeper :: Stats API ..................... SUCCESS [ 14.621 s]
2018-03-18T13:05:59.947 [INFO] Apache BookKeeper :: Common ........................ SUCCESS [01:18 min]
2018-03-18T13:05:59.947 [INFO] Apache BookKeeper :: Bookkeeper Http :: Http Server  SUCCESS [  8.904 s]
2018-03-18T13:05:59.947 [INFO] Apache BookKeeper :: Server ........................ FAILURE [30:36 min]
2018-03-18T13:05:59.947 [INFO] Apache BookKeeper :: Benchmark ..................... SKIPPED
2018-03-18T13:05:59.947 [INFO] Apache BookKeeper :: Stats Providers :: Twitter Finagle Stats SKIPPED
2018-03-18T13:05:59.947 [INFO] Apache BookKeeper :: Stats Providers :: Twitter Science Stats SKIPPED
2018-03-18T13:05:59.947 [INFO] Apache BookKeeper :: Stats Providers :: Twitter Ostrich Stats SKIPPED
2018-03-18T13:05:59.947 [INFO] Apache BookKeeper :: Stats Providers :: Codahale Metrics SKIPPED
2018-03-18T13:05:59.947 [INFO] Apache BookKeeper :: Stats Providers :: Prometheus . SKIPPED
2018-03-18T13:05:59.947 [INFO] Apache BookKeeper :: Stats Providers ............... SKIPPED
2018-03-18T13:05:59.947 [INFO] Apache BookKeeper :: Bookkeeper Http :: Twitter Http Server SKIPPED
2018-03-18T13:05:59.947 [INFO] Apache BookKeeper :: Bookkeeper Http :: Vertx Http Server SKIPPED
2018-03-18T13:05:59.948 [INFO] Apache BookKeeper :: Bookkeeper Http ............... SKIPPED
2018-03-18T13:05:59.948 [INFO] Apache BookKeeper :: Shaded :: Parent .............. SKIPPED
2018-03-18T13:05:59.948 [INFO] Apache BookKeeper :: Shaded :: bookkeeper-server-shaded SKIPPED
2018-03-18T13:05:59.948 [INFO] Apache BookKeeper :: Shaded :: bookkeeper-server-tests-shaded SKIPPED
2018-03-18T13:05:59.948 [INFO] Apache BookKeeper :: Tests ......................... SKIPPED
2018-03-18T13:05:59.948 [INFO] Apache BookKeeper :: Tests :: Compability Dependencies :: 4.0.0 SKIPPED
2018-03-18T13:05:59.948 [INFO] Apache BookKeeper :: Tests :: Compability Dependencies :: 4.1.0 SKIPPED
2018-03-18T13:05:59.948 [INFO] Apache BookKeeper :: Tests :: Compability Dependencies :: 4.2.0 SKIPPED
2018-03-18T13:05:59.948 [INFO] Apache BookKeeper :: Tests :: Backward ............. SKIPPED
2018-03-18T13:05:59.948 [INFO] Apache BookKeeper :: Tests :: bookkeeper-server shaded artifact test SKIPPED
2018-03-18T13:05:59.948 [INFO] Apache BookKeeper :: Tests :: bookkeeper-server-shaded test SKIPPED
2018-03-18T13:05:59.948 [INFO] Apache BookKeeper :: Tests :: bookkeeper-server-tests-shaded test SKIPPED
2018-03-18T13:05:59.948 [INFO] Apache BookKeeper :: Dist (Parent) ................. SKIPPED
2018-03-18T13:05:59.948 [INFO] Apache BookKeeper :: Dist (All) .................... SKIPPED
2018-03-18T13:05:59.948 [INFO] Apache BookKeeper :: Dist (Server) ................. SKIPPED
2018-03-18T13:05:59.948 [INFO] ------------------------------------------------------------------------
2018-03-18T13:05:59.948 [INFO] BUILD FAILURE
2018-03-18T13:05:59.948 [INFO] ------------------------------------------------------------------------
2018-03-18T13:05:59.948 [INFO] Total time: 33:15 min
2018-03-18T13:05:59.948 [INFO] Finished at: 2018-03-18T13:05:59Z
2018-03-18T13:06:00.574 [INFO] Final Memory: 90M/2580M
2018-03-18T13:06:00.575 [INFO] ------------------------------------------------------------------------
Waiting for Jenkins to finish collecting data
2018-03-18T13:06:01.041 [ERROR] Failed to execute goal org.apache.maven.plugins:maven-surefire-plugin:2.19.1:test (default-test) on project bookkeeper-server: ExecutionException The forked VM terminated without properly saying goodbye. VM crash or System.exit called?
2018-03-18T13:06:01.041 [ERROR] Command was /bin/sh -c cd <https://builds.apache.org/job/bookkeeper_release_branch/ws/bookkeeper-server> && /usr/local/asfpackages/java/jdk1.8.0_152/jre/bin/java -Xmx2G -Djava.net.preferIPv4Stack=true -jar <https://builds.apache.org/job/bookkeeper_release_branch/ws/bookkeeper-server/target/surefire/surefirebooter463806292165906876.jar> <https://builds.apache.org/job/bookkeeper_release_branch/ws/bookkeeper-server/target/surefire/surefire359358587586806292tmp> <https://builds.apache.org/job/bookkeeper_release_branch/ws/bookkeeper-server/target/surefire/surefire_862425684967341337499tmp>
2018-03-18T13:06:01.041 [ERROR] -> [Help 1]
2018-03-18T13:06:01.041 [ERROR] 
2018-03-18T13:06:01.041 [ERROR] To see the full stack trace of the errors, re-run Maven with the -e switch.
2018-03-18T13:06:01.041 [ERROR] Re-run Maven using the -X switch to enable full debug logging.
2018-03-18T13:06:01.041 [ERROR] 
2018-03-18T13:06:01.041 [ERROR] For more information about the errors and possible solutions, please read the following articles:
2018-03-18T13:06:01.041 [ERROR] [Help 1] http://cwiki.apache.org/confluence/display/MAVEN/MojoFailureException
2018-03-18T13:06:01.042 [ERROR] 
2018-03-18T13:06:01.042 [ERROR] After correcting the problems, you can resume the build with the command
2018-03-18T13:06:01.042 [ERROR]   mvn <goals> -rf :bookkeeper-server
channel stopped

Jenkins build is back to stable : bookkeeper_release_branch #97

Posted by Apache Jenkins Server <je...@builds.apache.org>.
See <https://builds.apache.org/job/bookkeeper_release_branch/97/display/redirect>


Jenkins build is still unstable: bookkeeper_release_branch #96

Posted by Apache Jenkins Server <je...@builds.apache.org>.
See <https://builds.apache.org/job/bookkeeper_release_branch/96/display/redirect>


Jenkins build is still unstable: bookkeeper_release_branch #95

Posted by Apache Jenkins Server <je...@builds.apache.org>.
See <https://builds.apache.org/job/bookkeeper_release_branch/95/display/redirect>


Jenkins build is still unstable: bookkeeper_release_branch #94

Posted by Apache Jenkins Server <je...@builds.apache.org>.
See <https://builds.apache.org/job/bookkeeper_release_branch/94/display/redirect>


Jenkins build is unstable: bookkeeper_release_branch #93

Posted by Apache Jenkins Server <je...@builds.apache.org>.
See <https://builds.apache.org/job/bookkeeper_release_branch/93/display/redirect>