You are viewing a plain text version of this content. The canonical link for it is here.
Posted to notifications@jclouds.apache.org by BuildHive <bu...@cloudbees.com> on 2014/05/15 03:48:41 UTC
Build failed in Jenkins: jclouds » jclouds-labs-aws #843
See <https://buildhive.cloudbees.com/job/jclouds/job/jclouds-labs-aws/843/>
------------------------------------------
Started by upstream project "jclouds/jclouds" build number 1101
originally caused by:
GitHub pull request #368 to jclouds/jclouds
Building remotely on s-b5de4121 in workspace <https://buildhive.cloudbees.com/job/jclouds/job/jclouds-labs-aws/ws/>
Fetching changes from the remote Git repository
Fetching upstream changes from git://github.com/jclouds/jclouds-labs-aws.git
Checking out Revision ed6d635e98bb3181ec6259e61e2e45601449847a (origin/master)
Cleaning workspace
Resetting working tree
Parsing POMs
Modules changed, recalculating dependency graph
[jclouds-labs-aws] $ /usr/bin/tenant-isolate /opt/jdk/jdk1.7.latest/bin/java -XX:MaxPermSize=256m -cp /scratch/jenkins/maven3-agent.jar:/opt/maven/latest/boot/plexus-classworlds-2.5.1.jar org.jvnet.hudson.maven3.agent.Maven3Main /opt/maven/latest /scratch/jenkins/slave.jar /scratch/jenkins/maven3-interceptor.jar 58870
<===[JENKINS REMOTING CAPACITY]===> channel started
log4j:WARN No appenders could be found for logger (org.apache.commons.beanutils.converters.BooleanConverter).
log4j:WARN Please initialize the log4j system properly.
Executing Maven: -B -f <https://buildhive.cloudbees.com/job/jclouds/job/jclouds-labs-aws/ws/pom.xml> clean verify -U -e -Dmaven.javadoc.skip=true
java.lang.reflect.InvocationTargetException
at sun.reflect.NativeMethodAccessorImpl.invoke0(Native Method)
at sun.reflect.NativeMethodAccessorImpl.invoke(NativeMethodAccessorImpl.java:57)
at sun.reflect.DelegatingMethodAccessorImpl.invoke(DelegatingMethodAccessorImpl.java:43)
at java.lang.reflect.Method.invoke(Method.java:606)
at org.codehaus.plexus.classworlds.launcher.Launcher.launchStandard(Launcher.java:330)
at org.codehaus.plexus.classworlds.launcher.Launcher.launch(Launcher.java:238)
at org.jvnet.hudson.maven3.agent.Maven3Main.launch(Maven3Main.java:158)
at hudson.maven.Maven3Builder.call(Maven3Builder.java:104)
at hudson.maven.Maven3Builder.call(Maven3Builder.java:70)
at hudson.remoting.UserRequest.perform(UserRequest.java:118)
at hudson.remoting.UserRequest.perform(UserRequest.java:48)
at hudson.remoting.Request$2.run(Request.java:328)
at hudson.remoting.InterceptingExecutorService$1.call(InterceptingExecutorService.java:72)
at java.util.concurrent.FutureTask.run(FutureTask.java:262)
at java.util.concurrent.ThreadPoolExecutor.runWorker(ThreadPoolExecutor.java:1145)
at java.util.concurrent.ThreadPoolExecutor$Worker.run(ThreadPoolExecutor.java:615)
at java.lang.Thread.run(Thread.java:744)
Caused by: java.lang.NoClassDefFoundError: org/apache/maven/cli/MavenLoggerManager
at org.jvnet.hudson.maven3.launcher.Maven3Launcher.main(Maven3Launcher.java:73)
... 17 more
Caused by: java.lang.ClassNotFoundException: org.apache.maven.cli.MavenLoggerManager
at org.codehaus.plexus.classworlds.strategy.SelfFirstStrategy.loadClass(SelfFirstStrategy.java:50)
at org.codehaus.plexus.classworlds.realm.ClassRealm.unsynchronizedLoadClass(ClassRealm.java:259)
at org.codehaus.plexus.classworlds.realm.ClassRealm.loadClass(ClassRealm.java:235)
at org.codehaus.plexus.classworlds.realm.ClassRealm.loadClass(ClassRealm.java:227)
... 18 more
channel stopped
ERROR: Failed to parse POMs
hudson.util.IOException2: java.lang.reflect.InvocationTargetException
at hudson.maven.Maven3Builder.call(Maven3Builder.java:158)
at hudson.maven.Maven3Builder.call(Maven3Builder.java:70)
at hudson.remoting.UserRequest.perform(UserRequest.java:118)
at hudson.remoting.UserRequest.perform(UserRequest.java:48)
at hudson.remoting.Request$2.run(Request.java:328)
at hudson.remoting.InterceptingExecutorService$1.call(InterceptingExecutorService.java:72)
at java.util.concurrent.FutureTask.run(FutureTask.java:262)
at java.util.concurrent.ThreadPoolExecutor.runWorker(ThreadPoolExecutor.java:1145)
at java.util.concurrent.ThreadPoolExecutor$Worker.run(ThreadPoolExecutor.java:615)
at java.lang.Thread.run(Thread.java:744)
Caused by: java.lang.Exception: java.lang.reflect.InvocationTargetException
at org.jvnet.hudson.maven3.agent.Maven3Main.launch(Maven3Main.java:161)
at hudson.maven.Maven3Builder.call(Maven3Builder.java:104)
... 9 more
Caused by: java.lang.reflect.InvocationTargetException
at sun.reflect.NativeMethodAccessorImpl.invoke0(Native Method)
at sun.reflect.NativeMethodAccessorImpl.invoke(NativeMethodAccessorImpl.java:57)
at sun.reflect.DelegatingMethodAccessorImpl.invoke(DelegatingMethodAccessorImpl.java:43)
at java.lang.reflect.Method.invoke(Method.java:606)
at org.codehaus.plexus.classworlds.launcher.Launcher.launchStandard(Launcher.java:330)
at org.codehaus.plexus.classworlds.launcher.Launcher.launch(Launcher.java:238)
at org.jvnet.hudson.maven3.agent.Maven3Main.launch(Maven3Main.java:158)
... 10 more
Caused by: java.lang.NoClassDefFoundError: org/apache/maven/cli/MavenLoggerManager
at org.jvnet.hudson.maven3.launcher.Maven3Launcher.main(Maven3Launcher.java:73)
... 17 more
Caused by: java.lang.ClassNotFoundException: org.apache.maven.cli.MavenLoggerManager
at org.codehaus.plexus.classworlds.strategy.SelfFirstStrategy.loadClass(SelfFirstStrategy.java:50)
at org.codehaus.plexus.classworlds.realm.ClassRealm.unsynchronizedLoadClass(ClassRealm.java:259)
at org.codehaus.plexus.classworlds.realm.ClassRealm.loadClass(ClassRealm.java:235)
at org.codehaus.plexus.classworlds.realm.ClassRealm.loadClass(ClassRealm.java:227)
... 18 more
Jenkins build is back to normal : jclouds » jclouds-labs-aws #848
Posted by BuildHive <bu...@cloudbees.com>.
See <https://buildhive.cloudbees.com/job/jclouds/job/jclouds-labs-aws/848/>
Build failed in Jenkins: jclouds » jclouds-labs-aws #847
Posted by BuildHive <bu...@cloudbees.com>.
See <https://buildhive.cloudbees.com/job/jclouds/job/jclouds-labs-aws/847/>
------------------------------------------
Started by user Ryan Campbell
Building remotely on s-f9999424 in workspace <https://buildhive.cloudbees.com/job/jclouds/job/jclouds-labs-aws/ws/>
Fetching changes from the remote Git repository
Fetching upstream changes from git://github.com/jclouds/jclouds-labs-aws.git
Checking out Revision ca269db8b3d6ff93e61ac9c7410c3c2d99406de2 (origin/master)
Cleaning workspace
Resetting working tree
Parsing POMs
Modules changed, recalculating dependency graph
[jclouds-labs-aws] $ /usr/bin/tenant-isolate /opt/jdk/jdk1.7.latest/bin/java -XX:MaxPermSize=256m -cp /scratch/jenkins/maven3-agent.jar:/opt/maven/latest/boot/plexus-classworlds-2.5.1.jar org.jvnet.hudson.maven3.agent.Maven3Main /opt/maven/latest /scratch/jenkins/slave.jar /scratch/jenkins/maven3-interceptor.jar 42147
<===[JENKINS REMOTING CAPACITY]===> channel started
log4j:WARN No appenders could be found for logger (org.apache.commons.beanutils.converters.BooleanConverter).
log4j:WARN Please initialize the log4j system properly.
Executing Maven: -B -f <https://buildhive.cloudbees.com/job/jclouds/job/jclouds-labs-aws/ws/pom.xml> clean verify -U -e -Dmaven.javadoc.skip=true
java.lang.reflect.InvocationTargetException
at sun.reflect.NativeMethodAccessorImpl.invoke0(Native Method)
at sun.reflect.NativeMethodAccessorImpl.invoke(NativeMethodAccessorImpl.java:57)
at sun.reflect.DelegatingMethodAccessorImpl.invoke(DelegatingMethodAccessorImpl.java:43)
at java.lang.reflect.Method.invoke(Method.java:606)
at org.codehaus.plexus.classworlds.launcher.Launcher.launchStandard(Launcher.java:330)
at org.codehaus.plexus.classworlds.launcher.Launcher.launch(Launcher.java:238)
at org.jvnet.hudson.maven3.agent.Maven3Main.launch(Maven3Main.java:158)
at hudson.maven.Maven3Builder.call(Maven3Builder.java:104)
at hudson.maven.Maven3Builder.call(Maven3Builder.java:70)
at hudson.remoting.UserRequest.perform(UserRequest.java:118)
at hudson.remoting.UserRequest.perform(UserRequest.java:48)
at hudson.remoting.Request$2.run(Request.java:328)
at hudson.remoting.InterceptingExecutorService$1.call(InterceptingExecutorService.java:72)
at java.util.concurrent.FutureTask.run(FutureTask.java:262)
at java.util.concurrent.ThreadPoolExecutor.runWorker(ThreadPoolExecutor.java:1145)
at java.util.concurrent.ThreadPoolExecutor$Worker.run(ThreadPoolExecutor.java:615)
at java.lang.Thread.run(Thread.java:744)
Caused by: java.lang.NoClassDefFoundError: org/apache/maven/cli/MavenLoggerManager
at org.jvnet.hudson.maven3.launcher.Maven3Launcher.main(Maven3Launcher.java:73)
... 17 more
Caused by: java.lang.ClassNotFoundException: org.apache.maven.cli.MavenLoggerManager
at org.codehaus.plexus.classworlds.strategy.SelfFirstStrategy.loadClass(SelfFirstStrategy.java:50)
at org.codehaus.plexus.classworlds.realm.ClassRealm.unsynchronizedLoadClass(ClassRealm.java:259)
at org.codehaus.plexus.classworlds.realm.ClassRealm.loadClass(ClassRealm.java:235)
at org.codehaus.plexus.classworlds.realm.ClassRealm.loadClass(ClassRealm.java:227)
... 18 more
channel stopped
ERROR: Failed to parse POMs
hudson.util.IOException2: java.lang.reflect.InvocationTargetException
at hudson.maven.Maven3Builder.call(Maven3Builder.java:158)
at hudson.maven.Maven3Builder.call(Maven3Builder.java:70)
at hudson.remoting.UserRequest.perform(UserRequest.java:118)
at hudson.remoting.UserRequest.perform(UserRequest.java:48)
at hudson.remoting.Request$2.run(Request.java:328)
at hudson.remoting.InterceptingExecutorService$1.call(InterceptingExecutorService.java:72)
at java.util.concurrent.FutureTask.run(FutureTask.java:262)
at java.util.concurrent.ThreadPoolExecutor.runWorker(ThreadPoolExecutor.java:1145)
at java.util.concurrent.ThreadPoolExecutor$Worker.run(ThreadPoolExecutor.java:615)
at java.lang.Thread.run(Thread.java:744)
Caused by: java.lang.Exception: java.lang.reflect.InvocationTargetException
at org.jvnet.hudson.maven3.agent.Maven3Main.launch(Maven3Main.java:161)
at hudson.maven.Maven3Builder.call(Maven3Builder.java:104)
... 9 more
Caused by: java.lang.reflect.InvocationTargetException
at sun.reflect.NativeMethodAccessorImpl.invoke0(Native Method)
at sun.reflect.NativeMethodAccessorImpl.invoke(NativeMethodAccessorImpl.java:57)
at sun.reflect.DelegatingMethodAccessorImpl.invoke(DelegatingMethodAccessorImpl.java:43)
at java.lang.reflect.Method.invoke(Method.java:606)
at org.codehaus.plexus.classworlds.launcher.Launcher.launchStandard(Launcher.java:330)
at org.codehaus.plexus.classworlds.launcher.Launcher.launch(Launcher.java:238)
at org.jvnet.hudson.maven3.agent.Maven3Main.launch(Maven3Main.java:158)
... 10 more
Caused by: java.lang.NoClassDefFoundError: org/apache/maven/cli/MavenLoggerManager
at org.jvnet.hudson.maven3.launcher.Maven3Launcher.main(Maven3Launcher.java:73)
... 17 more
Caused by: java.lang.ClassNotFoundException: org.apache.maven.cli.MavenLoggerManager
at org.codehaus.plexus.classworlds.strategy.SelfFirstStrategy.loadClass(SelfFirstStrategy.java:50)
at org.codehaus.plexus.classworlds.realm.ClassRealm.unsynchronizedLoadClass(ClassRealm.java:259)
at org.codehaus.plexus.classworlds.realm.ClassRealm.loadClass(ClassRealm.java:235)
at org.codehaus.plexus.classworlds.realm.ClassRealm.loadClass(ClassRealm.java:227)
... 18 more
Build failed in Jenkins: jclouds » jclouds-labs-aws #846
Posted by BuildHive <bu...@cloudbees.com>.
See <https://buildhive.cloudbees.com/job/jclouds/job/jclouds-labs-aws/846/changes>
Changes:
[gaul] JCLOUDS-457: Created the skeleton of the Glacier API.
------------------------------------------
Started by GitHub push by jclouds-mirror
Building remotely on s-5df3827f in workspace <https://buildhive.cloudbees.com/job/jclouds/job/jclouds-labs-aws/ws/>
Fetching changes from the remote Git repository
Fetching upstream changes from git://github.com/jclouds/jclouds-labs-aws.git
Checking out Revision ca269db8b3d6ff93e61ac9c7410c3c2d99406de2 (origin/master)
Cleaning workspace
Resetting working tree
Parsing POMs
Discovered a new module org.apache.jclouds.labs:glacier jclouds glacier api
Modules changed, recalculating dependency graph
[jclouds-labs-aws] $ /usr/bin/tenant-isolate /opt/jdk/jdk1.7.latest/bin/java -XX:MaxPermSize=256m -cp /scratch/jenkins/maven3-agent.jar:/opt/maven/latest/boot/plexus-classworlds-2.5.1.jar org.jvnet.hudson.maven3.agent.Maven3Main /opt/maven/latest /scratch/jenkins/slave.jar /scratch/jenkins/maven3-interceptor.jar 35077
<===[JENKINS REMOTING CAPACITY]===> channel started
log4j:WARN No appenders could be found for logger (org.apache.commons.beanutils.converters.BooleanConverter).
log4j:WARN Please initialize the log4j system properly.
Executing Maven: -B -f <https://buildhive.cloudbees.com/job/jclouds/job/jclouds-labs-aws/ws/pom.xml> clean verify -U -e -Dmaven.javadoc.skip=true
java.lang.reflect.InvocationTargetException
at sun.reflect.NativeMethodAccessorImpl.invoke0(Native Method)
at sun.reflect.NativeMethodAccessorImpl.invoke(NativeMethodAccessorImpl.java:57)
at sun.reflect.DelegatingMethodAccessorImpl.invoke(DelegatingMethodAccessorImpl.java:43)
at java.lang.reflect.Method.invoke(Method.java:606)
at org.codehaus.plexus.classworlds.launcher.Launcher.launchStandard(Launcher.java:330)
at org.codehaus.plexus.classworlds.launcher.Launcher.launch(Launcher.java:238)
at org.jvnet.hudson.maven3.agent.Maven3Main.launch(Maven3Main.java:158)
at hudson.maven.Maven3Builder.call(Maven3Builder.java:104)
at hudson.maven.Maven3Builder.call(Maven3Builder.java:70)
at hudson.remoting.UserRequest.perform(UserRequest.java:118)
at hudson.remoting.UserRequest.perform(UserRequest.java:48)
at hudson.remoting.Request$2.run(Request.java:328)
at hudson.remoting.InterceptingExecutorService$1.call(InterceptingExecutorService.java:72)
at java.util.concurrent.FutureTask.run(FutureTask.java:262)
at java.util.concurrent.ThreadPoolExecutor.runWorker(ThreadPoolExecutor.java:1145)
at java.util.concurrent.ThreadPoolExecutor$Worker.run(ThreadPoolExecutor.java:615)
at java.lang.Thread.run(Thread.java:744)
Caused by: java.lang.NoClassDefFoundError: org/apache/maven/cli/MavenLoggerManager
at org.jvnet.hudson.maven3.launcher.Maven3Launcher.main(Maven3Launcher.java:73)
... 17 more
Caused by: java.lang.ClassNotFoundException: org.apache.maven.cli.MavenLoggerManager
at org.codehaus.plexus.classworlds.strategy.SelfFirstStrategy.loadClass(SelfFirstStrategy.java:50)
at org.codehaus.plexus.classworlds.realm.ClassRealm.unsynchronizedLoadClass(ClassRealm.java:259)
at org.codehaus.plexus.classworlds.realm.ClassRealm.loadClass(ClassRealm.java:235)
at org.codehaus.plexus.classworlds.realm.ClassRealm.loadClass(ClassRealm.java:227)
... 18 more
channel stopped
ERROR: Failed to parse POMs
hudson.util.IOException2: java.lang.reflect.InvocationTargetException
at hudson.maven.Maven3Builder.call(Maven3Builder.java:158)
at hudson.maven.Maven3Builder.call(Maven3Builder.java:70)
at hudson.remoting.UserRequest.perform(UserRequest.java:118)
at hudson.remoting.UserRequest.perform(UserRequest.java:48)
at hudson.remoting.Request$2.run(Request.java:328)
at hudson.remoting.InterceptingExecutorService$1.call(InterceptingExecutorService.java:72)
at java.util.concurrent.FutureTask.run(FutureTask.java:262)
at java.util.concurrent.ThreadPoolExecutor.runWorker(ThreadPoolExecutor.java:1145)
at java.util.concurrent.ThreadPoolExecutor$Worker.run(ThreadPoolExecutor.java:615)
at java.lang.Thread.run(Thread.java:744)
Caused by: java.lang.Exception: java.lang.reflect.InvocationTargetException
at org.jvnet.hudson.maven3.agent.Maven3Main.launch(Maven3Main.java:161)
at hudson.maven.Maven3Builder.call(Maven3Builder.java:104)
... 9 more
Caused by: java.lang.reflect.InvocationTargetException
at sun.reflect.NativeMethodAccessorImpl.invoke0(Native Method)
at sun.reflect.NativeMethodAccessorImpl.invoke(NativeMethodAccessorImpl.java:57)
at sun.reflect.DelegatingMethodAccessorImpl.invoke(DelegatingMethodAccessorImpl.java:43)
at java.lang.reflect.Method.invoke(Method.java:606)
at org.codehaus.plexus.classworlds.launcher.Launcher.launchStandard(Launcher.java:330)
at org.codehaus.plexus.classworlds.launcher.Launcher.launch(Launcher.java:238)
at org.jvnet.hudson.maven3.agent.Maven3Main.launch(Maven3Main.java:158)
... 10 more
Caused by: java.lang.NoClassDefFoundError: org/apache/maven/cli/MavenLoggerManager
at org.jvnet.hudson.maven3.launcher.Maven3Launcher.main(Maven3Launcher.java:73)
... 17 more
Caused by: java.lang.ClassNotFoundException: org.apache.maven.cli.MavenLoggerManager
at org.codehaus.plexus.classworlds.strategy.SelfFirstStrategy.loadClass(SelfFirstStrategy.java:50)
at org.codehaus.plexus.classworlds.realm.ClassRealm.unsynchronizedLoadClass(ClassRealm.java:259)
at org.codehaus.plexus.classworlds.realm.ClassRealm.loadClass(ClassRealm.java:235)
at org.codehaus.plexus.classworlds.realm.ClassRealm.loadClass(ClassRealm.java:227)
... 18 more
Build failed in Jenkins: jclouds » jclouds-labs-aws #845
Posted by BuildHive <bu...@cloudbees.com>.
See <https://buildhive.cloudbees.com/job/jclouds/job/jclouds-labs-aws/845/changes>
Changes:
[romancoedo] JCLOUDS-457: Created the skeleton of the Glacier API.
------------------------------------------
GitHub pull request #3 to jclouds/jclouds-labs-aws
Building remotely on s-5df3827f in workspace <https://buildhive.cloudbees.com/job/jclouds/job/jclouds-labs-aws/ws/>
Fetching changes from the remote Git repository
Fetching upstream changes from git://github.com/jclouds/jclouds-labs-aws.git
Opening connection
Done: 0
Counting objects
Done: 35
Finding sources
Done: 35
Getting sizes
Done: 31
Compressing objects
Done: 1192
Writing objects
Done: 35
remote: Resolving deltas
remote: Updating references
Merging refs/tags/changes/845
Checking out Revision 3f0474fd7f2db44bc3c6842cebce851a46bd8215 (master)
Cleaning workspace
Resetting working tree
Parsing POMs
Modules changed, recalculating dependency graph
[jclouds-labs-aws] $ /usr/bin/tenant-isolate /opt/jdk/jdk1.7.latest/bin/java -XX:MaxPermSize=256m -cp /scratch/jenkins/maven3-agent.jar:/opt/maven/latest/boot/plexus-classworlds-2.5.1.jar org.jvnet.hudson.maven3.agent.Maven3Main /opt/maven/latest /scratch/jenkins/slave.jar /scratch/jenkins/maven3-interceptor.jar 38619
<===[JENKINS REMOTING CAPACITY]===> channel started
log4j:WARN No appenders could be found for logger (org.apache.commons.beanutils.converters.BooleanConverter).
log4j:WARN Please initialize the log4j system properly.
Executing Maven: -B -f <https://buildhive.cloudbees.com/job/jclouds/job/jclouds-labs-aws/ws/pom.xml> clean verify -U -e -Dmaven.javadoc.skip=true
java.lang.reflect.InvocationTargetException
at sun.reflect.NativeMethodAccessorImpl.invoke0(Native Method)
at sun.reflect.NativeMethodAccessorImpl.invoke(NativeMethodAccessorImpl.java:57)
at sun.reflect.DelegatingMethodAccessorImpl.invoke(DelegatingMethodAccessorImpl.java:43)
at java.lang.reflect.Method.invoke(Method.java:606)
at org.codehaus.plexus.classworlds.launcher.Launcher.launchStandard(Launcher.java:330)
at org.codehaus.plexus.classworlds.launcher.Launcher.launch(Launcher.java:238)
at org.jvnet.hudson.maven3.agent.Maven3Main.launch(Maven3Main.java:158)
at hudson.maven.Maven3Builder.call(Maven3Builder.java:104)
at hudson.maven.Maven3Builder.call(Maven3Builder.java:70)
at hudson.remoting.UserRequest.perform(UserRequest.java:118)
at hudson.remoting.UserRequest.perform(UserRequest.java:48)
at hudson.remoting.Request$2.run(Request.java:328)
at hudson.remoting.InterceptingExecutorService$1.call(InterceptingExecutorService.java:72)
at java.util.concurrent.FutureTask.run(FutureTask.java:262)
at java.util.concurrent.ThreadPoolExecutor.runWorker(ThreadPoolExecutor.java:1145)
at java.util.concurrent.ThreadPoolExecutor$Worker.run(ThreadPoolExecutor.java:615)
at java.lang.Thread.run(Thread.java:744)
Caused by: java.lang.NoClassDefFoundError: org/apache/maven/cli/MavenLoggerManager
at org.jvnet.hudson.maven3.launcher.Maven3Launcher.main(Maven3Launcher.java:73)
... 17 more
Caused by: java.lang.ClassNotFoundException: org.apache.maven.cli.MavenLoggerManager
at org.codehaus.plexus.classworlds.strategy.SelfFirstStrategy.loadClass(SelfFirstStrategy.java:50)
at org.codehaus.plexus.classworlds.realm.ClassRealm.unsynchronizedLoadClass(ClassRealm.java:259)
at org.codehaus.plexus.classworlds.realm.ClassRealm.loadClass(ClassRealm.java:235)
at org.codehaus.plexus.classworlds.realm.ClassRealm.loadClass(ClassRealm.java:227)
... 18 more
channel stopped
ERROR: Failed to parse POMs
hudson.util.IOException2: java.lang.reflect.InvocationTargetException
at hudson.maven.Maven3Builder.call(Maven3Builder.java:158)
at hudson.maven.Maven3Builder.call(Maven3Builder.java:70)
at hudson.remoting.UserRequest.perform(UserRequest.java:118)
at hudson.remoting.UserRequest.perform(UserRequest.java:48)
at hudson.remoting.Request$2.run(Request.java:328)
at hudson.remoting.InterceptingExecutorService$1.call(InterceptingExecutorService.java:72)
at java.util.concurrent.FutureTask.run(FutureTask.java:262)
at java.util.concurrent.ThreadPoolExecutor.runWorker(ThreadPoolExecutor.java:1145)
at java.util.concurrent.ThreadPoolExecutor$Worker.run(ThreadPoolExecutor.java:615)
at java.lang.Thread.run(Thread.java:744)
Caused by: java.lang.Exception: java.lang.reflect.InvocationTargetException
at org.jvnet.hudson.maven3.agent.Maven3Main.launch(Maven3Main.java:161)
at hudson.maven.Maven3Builder.call(Maven3Builder.java:104)
... 9 more
Caused by: java.lang.reflect.InvocationTargetException
at sun.reflect.NativeMethodAccessorImpl.invoke0(Native Method)
at sun.reflect.NativeMethodAccessorImpl.invoke(NativeMethodAccessorImpl.java:57)
at sun.reflect.DelegatingMethodAccessorImpl.invoke(DelegatingMethodAccessorImpl.java:43)
at java.lang.reflect.Method.invoke(Method.java:606)
at org.codehaus.plexus.classworlds.launcher.Launcher.launchStandard(Launcher.java:330)
at org.codehaus.plexus.classworlds.launcher.Launcher.launch(Launcher.java:238)
at org.jvnet.hudson.maven3.agent.Maven3Main.launch(Maven3Main.java:158)
... 10 more
Caused by: java.lang.NoClassDefFoundError: org/apache/maven/cli/MavenLoggerManager
at org.jvnet.hudson.maven3.launcher.Maven3Launcher.main(Maven3Launcher.java:73)
... 17 more
Caused by: java.lang.ClassNotFoundException: org.apache.maven.cli.MavenLoggerManager
at org.codehaus.plexus.classworlds.strategy.SelfFirstStrategy.loadClass(SelfFirstStrategy.java:50)
at org.codehaus.plexus.classworlds.realm.ClassRealm.unsynchronizedLoadClass(ClassRealm.java:259)
at org.codehaus.plexus.classworlds.realm.ClassRealm.loadClass(ClassRealm.java:235)
at org.codehaus.plexus.classworlds.realm.ClassRealm.loadClass(ClassRealm.java:227)
... 18 more
Build failed in Jenkins: jclouds » jclouds-labs-aws #844
Posted by BuildHive <bu...@cloudbees.com>.
See <https://buildhive.cloudbees.com/job/jclouds/job/jclouds-labs-aws/844/>
------------------------------------------
Started by upstream project "jclouds/jclouds" build number 1106
originally caused by:
GitHub pull request #369 to jclouds/jclouds
Building remotely on s-97ba2f8f in workspace <https://buildhive.cloudbees.com/job/jclouds/job/jclouds-labs-aws/ws/>
Fetching changes from the remote Git repository
Fetching upstream changes from git://github.com/jclouds/jclouds-labs-aws.git
Checking out Revision ed6d635e98bb3181ec6259e61e2e45601449847a (origin/master)
Cleaning workspace
Resetting working tree
Parsing POMs
Modules changed, recalculating dependency graph
[jclouds-labs-aws] $ /usr/bin/tenant-isolate /opt/jdk/jdk1.7.latest/bin/java -XX:MaxPermSize=256m -cp /scratch/jenkins/maven3-agent.jar:/opt/maven/latest/boot/plexus-classworlds-2.5.1.jar org.jvnet.hudson.maven3.agent.Maven3Main /opt/maven/latest /scratch/jenkins/slave.jar /scratch/jenkins/maven3-interceptor.jar 59319
<===[JENKINS REMOTING CAPACITY]===> channel started
log4j:WARN No appenders could be found for logger (org.apache.commons.beanutils.converters.BooleanConverter).
log4j:WARN Please initialize the log4j system properly.
Executing Maven: -B -f <https://buildhive.cloudbees.com/job/jclouds/job/jclouds-labs-aws/ws/pom.xml> clean verify -U -e -Dmaven.javadoc.skip=true
java.lang.reflect.InvocationTargetException
at sun.reflect.NativeMethodAccessorImpl.invoke0(Native Method)
at sun.reflect.NativeMethodAccessorImpl.invoke(NativeMethodAccessorImpl.java:57)
at sun.reflect.DelegatingMethodAccessorImpl.invoke(DelegatingMethodAccessorImpl.java:43)
at java.lang.reflect.Method.invoke(Method.java:606)
at org.codehaus.plexus.classworlds.launcher.Launcher.launchStandard(Launcher.java:330)
at org.codehaus.plexus.classworlds.launcher.Launcher.launch(Launcher.java:238)
at org.jvnet.hudson.maven3.agent.Maven3Main.launch(Maven3Main.java:158)
at hudson.maven.Maven3Builder.call(Maven3Builder.java:104)
at hudson.maven.Maven3Builder.call(Maven3Builder.java:70)
at hudson.remoting.UserRequest.perform(UserRequest.java:118)
at hudson.remoting.UserRequest.perform(UserRequest.java:48)
at hudson.remoting.Request$2.run(Request.java:328)
at hudson.remoting.InterceptingExecutorService$1.call(InterceptingExecutorService.java:72)
at java.util.concurrent.FutureTask.run(FutureTask.java:262)
at java.util.concurrent.ThreadPoolExecutor.runWorker(ThreadPoolExecutor.java:1145)
at java.util.concurrent.ThreadPoolExecutor$Worker.run(ThreadPoolExecutor.java:615)
at java.lang.Thread.run(Thread.java:744)
Caused by: java.lang.NoClassDefFoundError: org/apache/maven/cli/MavenLoggerManager
at org.jvnet.hudson.maven3.launcher.Maven3Launcher.main(Maven3Launcher.java:73)
... 17 more
Caused by: java.lang.ClassNotFoundException: org.apache.maven.cli.MavenLoggerManager
at org.codehaus.plexus.classworlds.strategy.SelfFirstStrategy.loadClass(SelfFirstStrategy.java:50)
at org.codehaus.plexus.classworlds.realm.ClassRealm.unsynchronizedLoadClass(ClassRealm.java:259)
at org.codehaus.plexus.classworlds.realm.ClassRealm.loadClass(ClassRealm.java:235)
at org.codehaus.plexus.classworlds.realm.ClassRealm.loadClass(ClassRealm.java:227)
... 18 more
channel stopped
ERROR: Failed to parse POMs
hudson.util.IOException2: java.lang.reflect.InvocationTargetException
at hudson.maven.Maven3Builder.call(Maven3Builder.java:158)
at hudson.maven.Maven3Builder.call(Maven3Builder.java:70)
at hudson.remoting.UserRequest.perform(UserRequest.java:118)
at hudson.remoting.UserRequest.perform(UserRequest.java:48)
at hudson.remoting.Request$2.run(Request.java:328)
at hudson.remoting.InterceptingExecutorService$1.call(InterceptingExecutorService.java:72)
at java.util.concurrent.FutureTask.run(FutureTask.java:262)
at java.util.concurrent.ThreadPoolExecutor.runWorker(ThreadPoolExecutor.java:1145)
at java.util.concurrent.ThreadPoolExecutor$Worker.run(ThreadPoolExecutor.java:615)
at java.lang.Thread.run(Thread.java:744)
Caused by: java.lang.Exception: java.lang.reflect.InvocationTargetException
at org.jvnet.hudson.maven3.agent.Maven3Main.launch(Maven3Main.java:161)
at hudson.maven.Maven3Builder.call(Maven3Builder.java:104)
... 9 more
Caused by: java.lang.reflect.InvocationTargetException
at sun.reflect.NativeMethodAccessorImpl.invoke0(Native Method)
at sun.reflect.NativeMethodAccessorImpl.invoke(NativeMethodAccessorImpl.java:57)
at sun.reflect.DelegatingMethodAccessorImpl.invoke(DelegatingMethodAccessorImpl.java:43)
at java.lang.reflect.Method.invoke(Method.java:606)
at org.codehaus.plexus.classworlds.launcher.Launcher.launchStandard(Launcher.java:330)
at org.codehaus.plexus.classworlds.launcher.Launcher.launch(Launcher.java:238)
at org.jvnet.hudson.maven3.agent.Maven3Main.launch(Maven3Main.java:158)
... 10 more
Caused by: java.lang.NoClassDefFoundError: org/apache/maven/cli/MavenLoggerManager
at org.jvnet.hudson.maven3.launcher.Maven3Launcher.main(Maven3Launcher.java:73)
... 17 more
Caused by: java.lang.ClassNotFoundException: org.apache.maven.cli.MavenLoggerManager
at org.codehaus.plexus.classworlds.strategy.SelfFirstStrategy.loadClass(SelfFirstStrategy.java:50)
at org.codehaus.plexus.classworlds.realm.ClassRealm.unsynchronizedLoadClass(ClassRealm.java:259)
at org.codehaus.plexus.classworlds.realm.ClassRealm.loadClass(ClassRealm.java:235)
at org.codehaus.plexus.classworlds.realm.ClassRealm.loadClass(ClassRealm.java:227)
... 18 more