You are viewing a plain text version of this content. The canonical link for it is here.
Posted to dev@camel.apache.org by Apache Jenkins Server <je...@builds.apache.org> on 2011/07/08 11:24:30 UTC
Build failed in Jenkins: Camel #1268
See <https://builds.apache.org/job/Camel/1268/changes>
Changes:
[ningjiang] CAMEL-4192 upgraded Axiom version to 1.2.12
[gnodet] [CAMEL-4187] The ProcessorFactory interface isn't usable in scala
[dkulp] [CAMEL-4186] Pull cxf stuff out of camel-cxf feature. Use version range
for cxf version in feature.
[davsclaus] CAMEL-4184: Fixed adviceWith 2 or more routes and using a context scoped onException, may cause the onException to appear route scoped. Tigthten up OnException to be aware of its initial scope.
[davsclaus] CAMEL-4044: Added unit test for better code coverage.
[ningjiang] CAMEL-4183 Set the ApplicationContextClassLoad before calling the AtomUtils.parseDocument()
[davsclaus] CAMEL-3894: Improved javadoc due recent change in API
[davsclaus] CAMEL-4176: camel-http4 added support for setting scheme to use for proxy. Will use the same scheme on the proxy as the endpoint if not explicit configured.
[davsclaus] CAMEL-4181: Removing a route should remove the route from the internal startup route list of DefaultCamelContext.
[davsclaus] Added test based on user forum issue
[davsclaus] CAMEL-3894: Fixed test writing into target dir only
[davsclaus] Polished
[janstey] CAMEL-4177 - fix issue when using dependency:go-offline
[davsclaus] CAMEL-4170: Fixed broken unit tests.
[ningjiang] CAMEL-4172: Upgrade to karaf 2.2.2, camel-itest-karaf reads the karaf version from system properties
[davsclaus] CAMEL-4167: Added label to marshal/unmarshal so its shown in tracer
[davsclaus] CAMEL-4167: Reverted changes in unit tests that was a mistake
[davsclaus] CAMEL-4168: added routeId to jpa trace event message.
[davsclaus] CAMEL-4172: Upgrade to karaf 2.2.2.
------------------------------------------
[...truncated 9260 lines...]
[INFO] Checking legal files in: apache-camel-2.8-SNAPSHOT-src.zip
[INFO] [install:install {execution: default-install}]
[INFO] Installing <https://builds.apache.org/job/Camel/ws/camel-trunk/apache-camel/pom.xml> to <https://builds.apache.org/job/Camel/ws/.repository/org/apache/camel/apache-camel/2.8-SNAPSHOT/apache-camel-2.8-SNAPSHOT.pom>
[INFO] Installing <https://builds.apache.org/job/Camel/ws/camel-trunk/apache-camel/target/apache-camel-2.8-SNAPSHOT.tar.gz> to <https://builds.apache.org/job/Camel/ws/.repository/org/apache/camel/apache-camel/2.8-SNAPSHOT/apache-camel-2.8-SNAPSHOT.tar.gz>
[INFO] Installing <https://builds.apache.org/job/Camel/ws/camel-trunk/apache-camel/target/apache-camel-2.8-SNAPSHOT.zip> to <https://builds.apache.org/job/Camel/ws/.repository/org/apache/camel/apache-camel/2.8-SNAPSHOT/apache-camel-2.8-SNAPSHOT.zip>
[INFO] Installing <https://builds.apache.org/job/Camel/ws/camel-trunk/apache-camel/target/apache-camel-2.8-SNAPSHOT-src.zip> to <https://builds.apache.org/job/Camel/ws/.repository/org/apache/camel/apache-camel/2.8-SNAPSHOT/apache-camel-2.8-SNAPSHOT-src.zip>
[JENKINS] Archiving <https://builds.apache.org/job/Camel/ws/camel-trunk/apache-camel/pom.xml> to /home/hudson/hudson/jobs/Camel/modules/org.apache.camel$apache-camel/builds/2011-07-08_08-56-52/archive/org.apache.camel/apache-camel/2.8-SNAPSHOT/apache-camel-2.8-SNAPSHOT.pom
[JENKINS] Archiving <https://builds.apache.org/job/Camel/ws/camel-trunk/apache-camel/target/apache-camel-2.8-SNAPSHOT.tar.gz> to /home/hudson/hudson/jobs/Camel/modules/org.apache.camel$apache-camel/builds/2011-07-08_08-56-52/archive/org.apache.camel/apache-camel/2.8-SNAPSHOT/apache-camel-2.8-SNAPSHOT.tar.gz
[JENKINS] Archiving <https://builds.apache.org/job/Camel/ws/camel-trunk/apache-camel/target/apache-camel-2.8-SNAPSHOT.zip> to /home/hudson/hudson/jobs/Camel/modules/org.apache.camel$apache-camel/builds/2011-07-08_08-56-52/archive/org.apache.camel/apache-camel/2.8-SNAPSHOT/apache-camel-2.8-SNAPSHOT.zip
[JENKINS] Archiving <https://builds.apache.org/job/Camel/ws/camel-trunk/apache-camel/target/apache-camel-2.8-SNAPSHOT-src.zip> to /home/hudson/hudson/jobs/Camel/modules/org.apache.camel$apache-camel/builds/2011-07-08_08-56-52/archive/org.apache.camel/apache-camel/2.8-SNAPSHOT/apache-camel-2.8-SNAPSHOT-src.zip
[INFO]
[INFO]
[INFO] ------------------------------------------------------------------------
[INFO] Reactor Summary:
[INFO] ------------------------------------------------------------------------
[INFO] Camel ................................................. SUCCESS [9.051s]
[INFO] Apache :: Camel Buildtools ............................ SUCCESS [2.503s]
[INFO] Camel :: Parent ....................................... SUCCESS [1.430s]
[INFO] Camel :: Core ......................................... SUCCESS [21.452s]
[INFO] Camel :: Core XML ..................................... SUCCESS [2.607s]
[INFO] Camel :: Core OSGi .................................... SUCCESS [2.912s]
[INFO] Camel :: Spring ....................................... SUCCESS [11.980s]
[INFO] Camel :: Test ......................................... SUCCESS [2.533s]
[INFO] Camel :: TestNG ....................................... SUCCESS [2.400s]
[INFO] Camel :: Blueprint .................................... SUCCESS [4.497s]
[INFO] Camel :: JUEL ......................................... SUCCESS [3.829s]
[INFO] Camel :: BAM .......................................... SUCCESS [3.322s]
[INFO] Camel :: Groovy ....................................... SUCCESS [3.148s]
[INFO] Camel :: JXPath ....................................... SUCCESS [1.999s]
[INFO] Camel :: Velocity ..................................... SUCCESS [2.479s]
[INFO] Camel :: Scala ........................................ SUCCESS [30.866s]
[INFO] Camel :: HTTP ......................................... SUCCESS [2.877s]
[INFO] Camel :: HTTP4 (HttpClient 4.x) ....................... SUCCESS [3.159s]
[INFO] Camel :: Jetty ........................................ SUCCESS [3.904s]
[INFO] Camel :: CXF :: Transport ............................. SUCCESS [10.128s]
[INFO] Camel :: CXF .......................................... SUCCESS [9.694s]
[INFO] Camel :: Components ................................... SUCCESS [0.397s]
[INFO] Camel :: Web .......................................... FAILED [3.845s]
[INFO] Camel :: Web :: Standalone ............................ SKIPPED (dependency build failed or was skipped)
[INFO] Camel :: JMS .......................................... SUCCESS [4.908s]
[INFO] Camel :: AHC .......................................... SUCCESS [2.518s]
[INFO] Camel :: AMQP ......................................... SUCCESS [4.250s]
[INFO] Camel :: APNS ......................................... SUCCESS [2.805s]
[INFO] Camel :: Atom ......................................... SUCCESS [5.016s]
[INFO] Camel :: AWS .......................................... SUCCESS [3.161s]
[INFO] Camel :: Bean validator ............................... SUCCESS [2.711s]
[INFO] Camel :: Bindy ........................................ SUCCESS [3.475s]
[INFO] Camel :: Cache ........................................ SUCCESS [2.460s]
[INFO] Camel :: Castor ....................................... SUCCESS [2.003s]
[INFO] Camel :: Stream ....................................... SUCCESS [2.364s]
[INFO] Camel :: Cometd ....................................... SUCCESS [2.603s]
[INFO] Camel :: Context ...................................... SUCCESS [1.874s]
[INFO] Camel :: Crypto ....................................... SUCCESS [3.074s]
[INFO] Camel :: CSV .......................................... SUCCESS [2.241s]
[INFO] Camel :: DNS .......................................... SUCCESS [2.256s]
[INFO] Camel :: Dozer ........................................ SUCCESS [2.074s]
[INFO] Camel :: Eclipse ...................................... SUCCESS [1.113s]
[INFO] Camel :: EJB .......................................... SUCCESS [2.761s]
[INFO] Camel :: Event Admin .................................. SUCCESS [1.239s]
[INFO] Camel :: Exec ......................................... SUCCESS [3.024s]
[INFO] Camel :: FlatPack ..................................... SUCCESS [2.575s]
[INFO] Camel :: Freemarker ................................... SUCCESS [2.119s]
[INFO] Camel :: FTP .......................................... SUCCESS [4.207s]
[INFO] Camel :: Servlet ...................................... SUCCESS [2.561s]
[INFO] Camel :: GAE .......................................... SUCCESS [3.624s]
[INFO] Camel :: Guice ........................................ SUCCESS [2.143s]
[INFO] Camel :: HawtDB ....................................... SUCCESS [2.290s]
[INFO] Camel :: HazelCast .................................... SUCCESS [2.700s]
[INFO] Camel :: HDFS ......................................... SUCCESS [4.267s]
[INFO] Camel :: MINA ......................................... SUCCESS [2.972s]
[INFO] Camel :: HL7 .......................................... SUCCESS [2.882s]
[INFO] Camel :: iBatis ....................................... SUCCESS [2.240s]
[INFO] Camel :: IRC .......................................... SUCCESS [2.485s]
[INFO] Camel :: Jackson ...................................... SUCCESS [2.137s]
[INFO] Camel :: Javaspace .................................... SUCCESS [2.505s]
[INFO] Camel :: Spring JavaConfig ............................ SUCCESS [2.114s]
[INFO] Camel :: JAXB ......................................... SUCCESS [3.662s]
[INFO] Camel :: Jasypt ....................................... SUCCESS [3.184s]
[INFO] Camel :: JCR .......................................... SUCCESS [2.723s]
[INFO] Camel :: JDBC ......................................... SUCCESS [2.163s]
[INFO] Camel :: Jibx ......................................... SUCCESS [10.513s]
[INFO] Camel :: Jing ......................................... SUCCESS [2.269s]
[INFO] Camel :: JMX .......................................... SUCCESS [3.875s]
[INFO] Camel :: JoSQL ........................................ SUCCESS [2.214s]
[INFO] Camel :: JPA .......................................... SUCCESS [4.088s]
[INFO] Camel :: Java Toolbox for AS/400 ...................... SUCCESS [2.340s]
[INFO] Camel :: Kestrel ...................................... SUCCESS [2.432s]
[INFO] Camel :: LDAP ......................................... SUCCESS [3.178s]
[INFO] Camel :: Lucene ....................................... SUCCESS [2.177s]
[INFO] Camel :: Mail ......................................... SUCCESS [2.898s]
[INFO] Camel :: MSV .......................................... SUCCESS [2.124s]
[INFO] Camel :: MVEL ......................................... SUCCESS [1.956s]
[INFO] Camel :: MyBatis ...................................... SUCCESS [2.286s]
[INFO] Camel :: Nagios ....................................... SUCCESS [2.762s]
[INFO] Camel :: Netty ........................................ SUCCESS [2.813s]
[INFO] Camel :: OGNL ......................................... SUCCESS [2.306s]
[INFO] Camel :: Pax Logging .................................. SUCCESS [2.275s]
[INFO] Camel :: Printer ...................................... SUCCESS [2.087s]
[INFO] Camel :: Protobuf ..................................... SUCCESS [2.273s]
[INFO] Camel :: Quartz ....................................... SUCCESS [2.743s]
[INFO] Camel :: QuickFIX/J ................................... SUCCESS [3.402s]
[INFO] Camel :: Restlet ...................................... SUCCESS [2.480s]
[INFO] Camel :: RMI .......................................... SUCCESS [2.080s]
[INFO] Camel :: Routebox ..................................... SUCCESS [2.392s]
[INFO] Camel :: Ruby ......................................... SUCCESS [2.411s]
[INFO] Camel :: RSS .......................................... SUCCESS [3.630s]
[INFO] Camel :: SAXON ........................................ SUCCESS [2.651s]
[INFO] Camel :: Script ....................................... SUCCESS [2.425s]
[INFO] Camel :: Shiro ........................................ SUCCESS [2.059s]
[INFO] Camel :: SIP .......................................... SUCCESS [2.096s]
[INFO] Camel :: SMPP ......................................... SUCCESS [2.865s]
[INFO] Camel :: SNMP ......................................... SUCCESS [2.220s]
[INFO] Camel :: SOAP ......................................... SUCCESS [7.097s]
[INFO] Camel :: Spring Integration ........................... SUCCESS [2.559s]
[INFO] Camel :: Spring Security .............................. SUCCESS [2.359s]
[INFO] Camel :: Spring Web Services .......................... SUCCESS [3.262s]
[INFO] Camel :: SQL .......................................... SUCCESS [2.694s]
[INFO] Camel :: StringTemplate ............................... SUCCESS [2.119s]
[INFO] Camel :: Syslog ....................................... SUCCESS [3.126s]
[INFO] Camel :: TagSoup ...................................... SUCCESS [2.069s]
[INFO] Camel :: XMLBeans ..................................... SUCCESS [3.146s]
[INFO] Camel :: XML Security ................................. SUCCESS [2.291s]
[INFO] Camel :: XMPP ......................................... SUCCESS [2.387s]
[INFO] Camel :: XStream ...................................... SUCCESS [2.285s]
[INFO] Camel :: Platforms .................................... SUCCESS [0.288s]
[INFO] Camel :: Platforms :: Apache Karaf .................... SUCCESS [0.260s]
[INFO] Camel :: Platforms :: Apache Karaf :: Commands ........ SUCCESS [1.597s]
[INFO] Camel :: Platforms :: Apache Karaf :: Features ........ SUCCESS [0.538s]
[INFO] Camel :: Maven Plugins ................................ SUCCESS [5.893s]
[INFO] Camel :: Maven Camel Plugin ........................... SUCCESS [3.191s]
[INFO] Camel :: Maven Guice Plugin ........................... SUCCESS [2.298s]
[INFO] Camel :: Html to Pdf Plugin ........................... SUCCESS [1.678s]
[INFO] Camel :: Archetypes ................................... SUCCESS [0.279s]
[INFO] Camel :: Archetypes :: Camel Router with ActiveMQ ..... SUCCESS [1.110s]
[INFO] Camel :: Archetypes :: Blueprint (OSGi) Based Router .. SUCCESS [0.493s]
[INFO] Camel :: Archetypes :: Component ...................... SUCCESS [0.509s]
[INFO] Camel :: Archetypes :: Router ......................... SUCCESS [0.434s]
[INFO] Camel :: Archetypes :: Scala Router ................... SUCCESS [0.464s]
[INFO] Camel :: Archetypes :: Spring XML Based Router ........ SUCCESS [0.502s]
[INFO] Camel :: Archetypes :: Spring DM (OSGi) Based Router .. SUCCESS [0.584s]
[INFO] Camel :: Archetypes :: Camel Routes WAR ............... SUCCESS [0.441s]
[INFO] Camel :: Archetypes :: Camel Router with web console .. SUCCESS [0.348s]
[INFO] Camel :: Manual ....................................... SUCCESS [2.879s]
[INFO] Camel :: Tooling ...................................... SUCCESS [0.251s]
[INFO] Camel :: Tests Bundles ................................ SUCCESS [1.655s]
[INFO] Camel :: Test Bundles: mock-javamail-1.7 .............. SUCCESS [1.518s]
[INFO] Camel :: Integration Tests :: Standalone .............. SUCCESS [1.555s]
[INFO] Camel :: Integration Tests ............................ SUCCESS [18.068s]
[INFO] Camel :: Partial Classpath Tests ...................... SUCCESS [1.808s]
[INFO] Camel :: OSGi Integration Tests ....................... SUCCESS [19.538s]
[INFO] Camel :: Tests ........................................ SUCCESS [0.391s]
[INFO] Camel :: Examples ..................................... SUCCESS [0.270s]
[INFO] Camel :: Example :: Aggregate ......................... SUCCESS [1.342s]
[INFO] Camel :: Example :: Axis .............................. SUCCESS [4.928s]
[INFO] Camel :: Example :: BAM ............................... SUCCESS [1.903s]
[INFO] Camel :: Example :: Cafe .............................. SUCCESS [2.082s]
[INFO] Camel :: Example :: CXF ............................... SUCCESS [6.462s]
[INFO] Camel :: Example :: CXF :: Blueprint .................. SUCCESS [5.043s]
[INFO] Camel :: Example :: CXF :: OSGI ....................... SUCCESS [5.124s]
[INFO] Camel :: Example :: CXF Proxy ......................... SUCCESS [5.338s]
[INFO] Camel :: Example :: CXF Tomcat ........................ SUCCESS [3.123s]
[INFO] Camel :: Example :: Docs .............................. SUCCESS [2.150s]
[INFO] Camel :: Example :: ETL ............................... SUCCESS [5.859s]
[INFO] Camel :: Example :: GAE ............................... SUCCESS [7.636s]
[INFO] Camel :: Example :: GAuth ............................. SUCCESS [7.739s]
[INFO] Camel :: Example :: Guice :: JMS ...................... SUCCESS [2.066s]
[INFO] Camel :: Example :: JMX ............................... SUCCESS [1.393s]
[INFO] Camel :: Example :: JMS-File .......................... SUCCESS [1.951s]
[INFO] Camel :: Example :: Loadbalancer camel-mina ........... SUCCESS [1.531s]
[INFO] Camel :: Example :: Loan-Broker ....................... SUCCESS [2.692s]
[INFO] Camel :: Example :: Management ........................ SUCCESS [1.879s]
[INFO] Camel :: Example :: OSGi .............................. SUCCESS [1.376s]
[INFO] Camel :: Example :: OSGi RMI .......................... SUCCESS [1.903s]
[INFO] Camel :: Example :: POJO Messaging .................... SUCCESS [1.851s]
[INFO] Camel :: Example :: Report Incident ................... SUCCESS [7.961s]
[INFO] Camel :: Example :: Report Incident :: WS-Security .... SUCCESS [5.860s]
[INFO] Camel :: Example :: Route :: Throttling ............... SUCCESS [1.353s]
[INFO] Camel :: Example :: Servlet Tomcat .................... SUCCESS [1.644s]
[INFO] Camel :: Example :: Simple Jira Bot ................... SUCCESS [0.434s]
[INFO] Camel :: Example :: Simple Jira Bot :: Java DSL ....... SUCCESS [1.306s]
[INFO] Camel :: Example :: Simple Jira Bot :: XML Configuration SUCCESS [0.825s]
[INFO] Camel :: Example :: Spring ............................ SUCCESS [1.876s]
[INFO] Camel :: Example :: Spring :: JavaConfig .............. SUCCESS [2.002s]
[INFO] Camel :: Example :: Spring :: JMS ..................... SUCCESS [2.078s]
[INFO] Camel :: Example :: Spring Web Services ............... SUCCESS [2.940s]
[INFO] Camel :: Example :: Spring :: XQuery .................. SUCCESS [0.714s]
[INFO] Camel :: Example :: Spring Security ................... SUCCESS [2.134s]
[INFO] Camel :: Example :: Tracer ............................ SUCCESS [1.435s]
[INFO] Camel :: Assembly ..................................... SUCCESS [3:02.507s]
[INFO] ------------------------------------------------------------------------
[INFO] Error for project: Camel :: Web (during install)
[INFO] ------------------------------------------------------------------------
[INFO] Compilation failure
error: error reading <https://builds.apache.org/job/Camel/ws/.repository/org/codehaus/jackson/jackson-xc/1.7.1/jackson-xc-1.7.1.jar;> error in opening zip file
[INFO] ------------------------------------------------------------------------
[INFO] Trace
org.apache.maven.BuildFailureException: Compilation failure
error: error reading <https://builds.apache.org/job/Camel/ws/.repository/org/codehaus/jackson/jackson-xc/1.7.1/jackson-xc-1.7.1.jar;> error in opening zip file
at org.apache.maven.lifecycle.DefaultLifecycleExecutor.executeGoals(DefaultLifecycleExecutor.java:715)
at org.apache.maven.lifecycle.DefaultLifecycleExecutor.executeGoalWithLifecycle(DefaultLifecycleExecutor.java:556)
at org.apache.maven.lifecycle.DefaultLifecycleExecutor.executeGoal(DefaultLifecycleExecutor.java:535)
at org.apache.maven.lifecycle.DefaultLifecycleExecutor.executeGoalAndHandleFailures(DefaultLifecycleExecutor.java:387)
at org.apache.maven.lifecycle.DefaultLifecycleExecutor.executeTaskSegments(DefaultLifecycleExecutor.java:348)
at org.apache.maven.lifecycle.DefaultLifecycleExecutor.execute(DefaultLifecycleExecutor.java:180)
at org.apache.maven.lifecycle.LifecycleExecutorInterceptor.execute(LifecycleExecutorInterceptor.java:65)
at org.apache.maven.DefaultMaven.doExecute(DefaultMaven.java:328)
at org.apache.maven.DefaultMaven.execute(DefaultMaven.java:138)
at org.apache.maven.cli.MavenCli.main(MavenCli.java:362)
at sun.reflect.NativeMethodAccessorImpl.invoke0(Native Method)
at sun.reflect.NativeMethodAccessorImpl.invoke(NativeMethodAccessorImpl.java:39)
at sun.reflect.DelegatingMethodAccessorImpl.invoke(DelegatingMethodAccessorImpl.java:25)
at java.lang.reflect.Method.invoke(Method.java:597)
at org.codehaus.classworlds.Launcher.launchEnhanced(Launcher.java:315)
at org.codehaus.classworlds.Launcher.launch(Launcher.java:255)
at hudson.maven.agent.Main.launch(Main.java:185)
at hudson.maven.MavenBuilder.call(MavenBuilder.java:164)
at hudson.maven.MavenModuleSetBuild$Builder.call(MavenModuleSetBuild.java:987)
at hudson.maven.MavenModuleSetBuild$Builder.call(MavenModuleSetBuild.java:918)
at hudson.remoting.UserRequest.perform(UserRequest.java:118)
at hudson.remoting.UserRequest.perform(UserRequest.java:48)
at hudson.remoting.Request$2.run(Request.java:270)
at java.util.concurrent.Executors$RunnableAdapter.call(Executors.java:441)
at java.util.concurrent.FutureTask$Sync.innerRun(FutureTask.java:303)
at java.util.concurrent.FutureTask.run(FutureTask.java:138)
at java.util.concurrent.ThreadPoolExecutor$Worker.runTask(ThreadPoolExecutor.java:886)
at java.util.concurrent.ThreadPoolExecutor$Worker.run(ThreadPoolExecutor.java:908)
at java.lang.Thread.run(Thread.java:619)
Caused by: org.apache.maven.plugin.CompilationFailureException: Compilation failure
error: error reading <https://builds.apache.org/job/Camel/ws/.repository/org/codehaus/jackson/jackson-xc/1.7.1/jackson-xc-1.7.1.jar;> error in opening zip file
at org.apache.maven.plugin.AbstractCompilerMojo.execute(AbstractCompilerMojo.java:656)
at org.apache.maven.plugin.CompilerMojo.execute(CompilerMojo.java:128)
at org.apache.maven.plugin.DefaultPluginManager.executeMojo(DefaultPluginManager.java:490)
at hudson.maven.agent.PluginManagerInterceptor.executeMojo(PluginManagerInterceptor.java:182)
at org.apache.maven.lifecycle.DefaultLifecycleExecutor.executeGoals(DefaultLifecycleExecutor.java:694)
... 28 more
[INFO] ------------------------------------------------------------------------
[INFO] BUILD ERRORS
[INFO] ------------------------------------------------------------------------
[INFO] Total time: 27 minutes 7 seconds
[INFO] Finished at: Fri Jul 08 09:24:27 UTC 2011
[INFO] Final Memory: 236M/657M
[INFO] ------------------------------------------------------------------------
Sending e-mails to: dev@camel.apache.org
channel stopped
[locks-and-latches] Releasing all the locks
[locks-and-latches] All the locks released
Jenkins build is back to normal : Camel #1273
Posted by Apache Jenkins Server <je...@builds.apache.org>.
See <https://builds.apache.org/job/Camel/1273/changes>
Build failed in Jenkins: Camel #1272
Posted by Apache Jenkins Server <je...@builds.apache.org>.
See <https://builds.apache.org/job/Camel/1272/changes>
Changes:
[davsclaus] CAMEL-4215: camel-ftp will now honor stepwise option when deleting files. Thanks to dsmw for the patch.
[rickette] CAMEL-4093: introduced 'mapMailMessage' option to provide access to the underlying javax.mail.Message. Thanks to Dr. Martin Menzel, I was able to use some parts of his original patch.
[davsclaus] CAMEL-4218: Simple languge now supports using chained [] index for list/map.
[davsclaus] Disabled failing test on CI
[ningjiang] clean up the code of CxfBlueprintEndpoint
[boday] cleaned up the CxfRsConsumerTest to correspond with updates to the camel-cxfrs documentation
[davsclaus] Polished readme.txt in examples.
[davsclaus] Polished
[davsclaus] CAMEL-4211: endpoint uris now support multiple values for the same key.
[davsclaus] CAMEL-4211: endpoint uris now support multiple values for the same key.
------------------------------------------
[...truncated 14852 lines...]
Try downloading the file manually from the project website.
Then, install it using the command:
mvn install:install-file -DgroupId=tomcat -DartifactId=jasper-runtime -Dversion=5.5.12 -Dpackaging=jar -Dfile=/path/to/file
Alternatively, if you host your own repository you can deploy the file there:
mvn deploy:deploy-file -DgroupId=tomcat -DartifactId=jasper-runtime -Dversion=5.5.12 -Dpackaging=jar -Dfile=/path/to/file -Durl=[url] -DrepositoryId=[id]
Path to dependency:
1) org.apache.camel:camel-hdfs:bundle:2.8-SNAPSHOT
2) org.apache.hadoop:hadoop-core:jar:0.20.203.0
3) tomcat:jasper-runtime:jar:5.5.12
3) net.java.dev.jets3t:jets3t:jar:0.7.1
Try downloading the file manually from the project website.
Then, install it using the command:
mvn install:install-file -DgroupId=net.java.dev.jets3t -DartifactId=jets3t -Dversion=0.7.1 -Dpackaging=jar -Dfile=/path/to/file
Alternatively, if you host your own repository you can deploy the file there:
mvn deploy:deploy-file -DgroupId=net.java.dev.jets3t -DartifactId=jets3t -Dversion=0.7.1 -Dpackaging=jar -Dfile=/path/to/file -Durl=[url] -DrepositoryId=[id]
Path to dependency:
1) org.apache.camel:camel-hdfs:bundle:2.8-SNAPSHOT
2) org.apache.hadoop:hadoop-core:jar:0.20.203.0
3) net.java.dev.jets3t:jets3t:jar:0.7.1
4) commons-net:commons-net:jar:1.4.1
Try downloading the file manually from the project website.
Then, install it using the command:
mvn install:install-file -DgroupId=commons-net -DartifactId=commons-net -Dversion=1.4.1 -Dpackaging=jar -Dfile=/path/to/file
Alternatively, if you host your own repository you can deploy the file there:
mvn deploy:deploy-file -DgroupId=commons-net -DartifactId=commons-net -Dversion=1.4.1 -Dpackaging=jar -Dfile=/path/to/file -Durl=[url] -DrepositoryId=[id]
Path to dependency:
1) org.apache.camel:camel-hdfs:bundle:2.8-SNAPSHOT
2) org.apache.hadoop:hadoop-core:jar:0.20.203.0
3) commons-net:commons-net:jar:1.4.1
----------
4 required artifacts are missing.
for artifact:
org.apache.camel:camel-hdfs:bundle:2.8-SNAPSHOT
from the specified remote repositories:
central (http://repo1.maven.org/maven2),
Nexus (http://repository.apache.org/snapshots)
[INFO] ------------------------------------------------------------------------
[INFO] Trace
org.apache.maven.lifecycle.LifecycleExecutionException: Missing:
----------
1) org.apache.commons:commons-math:jar:2.1
Try downloading the file manually from the project website.
Then, install it using the command:
mvn install:install-file -DgroupId=org.apache.commons -DartifactId=commons-math -Dversion=2.1 -Dpackaging=jar -Dfile=/path/to/file
Alternatively, if you host your own repository you can deploy the file there:
mvn deploy:deploy-file -DgroupId=org.apache.commons -DartifactId=commons-math -Dversion=2.1 -Dpackaging=jar -Dfile=/path/to/file -Durl=[url] -DrepositoryId=[id]
Path to dependency:
1) org.apache.camel:camel-hdfs:bundle:2.8-SNAPSHOT
2) org.apache.hadoop:hadoop-core:jar:0.20.203.0
3) org.apache.commons:commons-math:jar:2.1
2) tomcat:jasper-runtime:jar:5.5.12
Try downloading the file manually from the project website.
Then, install it using the command:
mvn install:install-file -DgroupId=tomcat -DartifactId=jasper-runtime -Dversion=5.5.12 -Dpackaging=jar -Dfile=/path/to/file
Alternatively, if you host your own repository you can deploy the file there:
mvn deploy:deploy-file -DgroupId=tomcat -DartifactId=jasper-runtime -Dversion=5.5.12 -Dpackaging=jar -Dfile=/path/to/file -Durl=[url] -DrepositoryId=[id]
Path to dependency:
1) org.apache.camel:camel-hdfs:bundle:2.8-SNAPSHOT
2) org.apache.hadoop:hadoop-core:jar:0.20.203.0
3) tomcat:jasper-runtime:jar:5.5.12
3) net.java.dev.jets3t:jets3t:jar:0.7.1
Try downloading the file manually from the project website.
Then, install it using the command:
mvn install:install-file -DgroupId=net.java.dev.jets3t -DartifactId=jets3t -Dversion=0.7.1 -Dpackaging=jar -Dfile=/path/to/file
Alternatively, if you host your own repository you can deploy the file there:
mvn deploy:deploy-file -DgroupId=net.java.dev.jets3t -DartifactId=jets3t -Dversion=0.7.1 -Dpackaging=jar -Dfile=/path/to/file -Durl=[url] -DrepositoryId=[id]
Path to dependency:
1) org.apache.camel:camel-hdfs:bundle:2.8-SNAPSHOT
2) org.apache.hadoop:hadoop-core:jar:0.20.203.0
3) net.java.dev.jets3t:jets3t:jar:0.7.1
4) commons-net:commons-net:jar:1.4.1
Try downloading the file manually from the project website.
Then, install it using the command:
mvn install:install-file -DgroupId=commons-net -DartifactId=commons-net -Dversion=1.4.1 -Dpackaging=jar -Dfile=/path/to/file
Alternatively, if you host your own repository you can deploy the file there:
mvn deploy:deploy-file -DgroupId=commons-net -DartifactId=commons-net -Dversion=1.4.1 -Dpackaging=jar -Dfile=/path/to/file -Durl=[url] -DrepositoryId=[id]
Path to dependency:
1) org.apache.camel:camel-hdfs:bundle:2.8-SNAPSHOT
2) org.apache.hadoop:hadoop-core:jar:0.20.203.0
3) commons-net:commons-net:jar:1.4.1
----------
4 required artifacts are missing.
for artifact:
org.apache.camel:camel-hdfs:bundle:2.8-SNAPSHOT
from the specified remote repositories:
central (http://repo1.maven.org/maven2),
Nexus (http://repository.apache.org/snapshots)
at org.apache.maven.lifecycle.DefaultLifecycleExecutor.executeGoals(DefaultLifecycleExecutor.java:711)
at org.apache.maven.lifecycle.DefaultLifecycleExecutor.executeGoalWithLifecycle(DefaultLifecycleExecutor.java:556)
at org.apache.maven.lifecycle.DefaultLifecycleExecutor.executeGoal(DefaultLifecycleExecutor.java:535)
at org.apache.maven.lifecycle.DefaultLifecycleExecutor.executeGoalAndHandleFailures(DefaultLifecycleExecutor.java:387)
at org.apache.maven.lifecycle.DefaultLifecycleExecutor.executeTaskSegments(DefaultLifecycleExecutor.java:348)
at org.apache.maven.lifecycle.DefaultLifecycleExecutor.execute(DefaultLifecycleExecutor.java:180)
at org.apache.maven.lifecycle.LifecycleExecutorInterceptor.execute(LifecycleExecutorInterceptor.java:65)
at org.apache.maven.DefaultMaven.doExecute(DefaultMaven.java:328)
at org.apache.maven.DefaultMaven.execute(DefaultMaven.java:138)
at org.apache.maven.cli.MavenCli.main(MavenCli.java:362)
at sun.reflect.NativeMethodAccessorImpl.invoke0(Native Method)
at sun.reflect.NativeMethodAccessorImpl.invoke(NativeMethodAccessorImpl.java:39)
at sun.reflect.DelegatingMethodAccessorImpl.invoke(DelegatingMethodAccessorImpl.java:25)
at java.lang.reflect.Method.invoke(Method.java:597)
at org.codehaus.classworlds.Launcher.launchEnhanced(Launcher.java:315)
at org.codehaus.classworlds.Launcher.launch(Launcher.java:255)
at hudson.maven.agent.Main.launch(Main.java:185)
at hudson.maven.MavenBuilder.call(MavenBuilder.java:164)
at hudson.maven.MavenModuleSetBuild$Builder.call(MavenModuleSetBuild.java:987)
at hudson.maven.MavenModuleSetBuild$Builder.call(MavenModuleSetBuild.java:918)
at hudson.remoting.UserRequest.perform(UserRequest.java:118)
at hudson.remoting.UserRequest.perform(UserRequest.java:48)
at hudson.remoting.Request$2.run(Request.java:270)
at java.util.concurrent.Executors$RunnableAdapter.call(Executors.java:441)
at java.util.concurrent.FutureTask$Sync.innerRun(FutureTask.java:303)
at java.util.concurrent.FutureTask.run(FutureTask.java:138)
at java.util.concurrent.ThreadPoolExecutor$Worker.runTask(ThreadPoolExecutor.java:886)
at java.util.concurrent.ThreadPoolExecutor$Worker.run(ThreadPoolExecutor.java:908)
at java.lang.Thread.run(Thread.java:619)
Caused by: org.apache.maven.artifact.resolver.MultipleArtifactsNotFoundException: Missing:
----------
1) org.apache.commons:commons-math:jar:2.1
Try downloading the file manually from the project website.
Then, install it using the command:
mvn install:install-file -DgroupId=org.apache.commons -DartifactId=commons-math -Dversion=2.1 -Dpackaging=jar -Dfile=/path/to/file
Alternatively, if you host your own repository you can deploy the file there:
mvn deploy:deploy-file -DgroupId=org.apache.commons -DartifactId=commons-math -Dversion=2.1 -Dpackaging=jar -Dfile=/path/to/file -Durl=[url] -DrepositoryId=[id]
Path to dependency:
1) org.apache.camel:camel-hdfs:bundle:2.8-SNAPSHOT
2) org.apache.hadoop:hadoop-core:jar:0.20.203.0
3) org.apache.commons:commons-math:jar:2.1
2) tomcat:jasper-runtime:jar:5.5.12
Try downloading the file manually from the project website.
Then, install it using the command:
mvn install:install-file -DgroupId=tomcat -DartifactId=jasper-runtime -Dversion=5.5.12 -Dpackaging=jar -Dfile=/path/to/file
Alternatively, if you host your own repository you can deploy the file there:
mvn deploy:deploy-file -DgroupId=tomcat -DartifactId=jasper-runtime -Dversion=5.5.12 -Dpackaging=jar -Dfile=/path/to/file -Durl=[url] -DrepositoryId=[id]
Path to dependency:
1) org.apache.camel:camel-hdfs:bundle:2.8-SNAPSHOT
2) org.apache.hadoop:hadoop-core:jar:0.20.203.0
3) tomcat:jasper-runtime:jar:5.5.12
3) net.java.dev.jets3t:jets3t:jar:0.7.1
Try downloading the file manually from the project website.
Then, install it using the command:
mvn install:install-file -DgroupId=net.java.dev.jets3t -DartifactId=jets3t -Dversion=0.7.1 -Dpackaging=jar -Dfile=/path/to/file
Alternatively, if you host your own repository you can deploy the file there:
mvn deploy:deploy-file -DgroupId=net.java.dev.jets3t -DartifactId=jets3t -Dversion=0.7.1 -Dpackaging=jar -Dfile=/path/to/file -Durl=[url] -DrepositoryId=[id]
Path to dependency:
1) org.apache.camel:camel-hdfs:bundle:2.8-SNAPSHOT
2) org.apache.hadoop:hadoop-core:jar:0.20.203.0
3) net.java.dev.jets3t:jets3t:jar:0.7.1
4) commons-net:commons-net:jar:1.4.1
Try downloading the file manually from the project website.
Then, install it using the command:
mvn install:install-file -DgroupId=commons-net -DartifactId=commons-net -Dversion=1.4.1 -Dpackaging=jar -Dfile=/path/to/file
Alternatively, if you host your own repository you can deploy the file there:
mvn deploy:deploy-file -DgroupId=commons-net -DartifactId=commons-net -Dversion=1.4.1 -Dpackaging=jar -Dfile=/path/to/file -Durl=[url] -DrepositoryId=[id]
Path to dependency:
1) org.apache.camel:camel-hdfs:bundle:2.8-SNAPSHOT
2) org.apache.hadoop:hadoop-core:jar:0.20.203.0
3) commons-net:commons-net:jar:1.4.1
----------
4 required artifacts are missing.
for artifact:
org.apache.camel:camel-hdfs:bundle:2.8-SNAPSHOT
from the specified remote repositories:
central (http://repo1.maven.org/maven2),
Nexus (http://repository.apache.org/snapshots)
at org.apache.maven.artifact.resolver.DefaultArtifactResolver.resolveTransitively(DefaultArtifactResolver.java:360)
at org.apache.maven.artifact.resolver.DefaultArtifactResolver.resolveTransitively(DefaultArtifactResolver.java:304)
at org.apache.maven.plugin.DefaultPluginManager.resolveTransitiveDependencies(DefaultPluginManager.java:1499)
at org.apache.maven.plugin.DefaultPluginManager.executeMojo(DefaultPluginManager.java:442)
at hudson.maven.agent.PluginManagerInterceptor.executeMojo(PluginManagerInterceptor.java:182)
at org.apache.maven.lifecycle.DefaultLifecycleExecutor.executeGoals(DefaultLifecycleExecutor.java:694)
... 28 more
[INFO] ------------------------------------------------------------------------
[INFO] BUILD ERRORS
[INFO] ------------------------------------------------------------------------
[INFO] Total time: 39 minutes 20 seconds
[INFO] Finished at: Wed Jul 13 09:41:55 UTC 2011
[INFO] Final Memory: 240M/505M
[INFO] ------------------------------------------------------------------------
channel stopped
[locks-and-latches] Releasing all the locks
[locks-and-latches] All the locks released
Build failed in Jenkins: Camel #1271
Posted by Apache Jenkins Server <je...@builds.apache.org>.
See <https://builds.apache.org/job/Camel/1271/changes>
Changes:
[ningjiang] CAME-4210 ported the patch to camel-example-cxf-blueprint
[davsclaus] Polished readme.txt in examples.
[davsclaus] Fixed test due CI issues
[ningjiang] CAME-4210 Add unit test on camel-example-cxf-osgi
[davsclaus] Fixed test due CI failures.
[davsclaus] CAMEL-4206: The scala maven archetype upgraded to Scala 2.9
[ningjiang] CAMEL-4186 make feature validate plugin happay about the change
[ningjiang] CAMEL-4207 using ExtensionManagerBus instead of CXFBusImpl to setup bus instance
[davsclaus] Upgraded scalate to 1.5.0 that supports Scala 2.9.
------------------------------------------
[...truncated 1534 lines...]
[INFO] Camel :: JDBC ......................................... SKIPPED (dependency build failed or was skipped)
[INFO] Camel :: Jibx ......................................... SKIPPED (dependency build failed or was skipped)
[INFO] Camel :: Jing ......................................... SKIPPED (dependency build failed or was skipped)
[INFO] Camel :: JMX .......................................... SKIPPED (dependency build failed or was skipped)
[INFO] Camel :: JoSQL ........................................ SKIPPED (dependency build failed or was skipped)
[INFO] Camel :: JPA .......................................... SKIPPED (dependency build failed or was skipped)
[INFO] Camel :: Java Toolbox for AS/400 ...................... SKIPPED (dependency build failed or was skipped)
[INFO] Camel :: Kestrel ...................................... SKIPPED (dependency build failed or was skipped)
[INFO] Camel :: LDAP ......................................... SKIPPED (dependency build failed or was skipped)
[INFO] Camel :: Lucene ....................................... SKIPPED (dependency build failed or was skipped)
[INFO] Camel :: Mail ......................................... SKIPPED (dependency build failed or was skipped)
[INFO] Camel :: MSV .......................................... SKIPPED (dependency build failed or was skipped)
[INFO] Camel :: MVEL ......................................... SKIPPED (dependency build failed or was skipped)
[INFO] Camel :: MyBatis ...................................... SKIPPED (dependency build failed or was skipped)
[INFO] Camel :: Nagios ....................................... SKIPPED (dependency build failed or was skipped)
[INFO] Camel :: Netty ........................................ SKIPPED (dependency build failed or was skipped)
[INFO] Camel :: OGNL ......................................... SKIPPED (dependency build failed or was skipped)
[INFO] Camel :: Pax Logging .................................. SKIPPED (dependency build failed or was skipped)
[INFO] Camel :: Printer ...................................... SKIPPED (dependency build failed or was skipped)
[INFO] Camel :: Protobuf ..................................... SKIPPED (dependency build failed or was skipped)
[INFO] Camel :: Quartz ....................................... SKIPPED (dependency build failed or was skipped)
[INFO] Camel :: QuickFIX/J ................................... SKIPPED (dependency build failed or was skipped)
[INFO] Camel :: Restlet ...................................... SKIPPED (dependency build failed or was skipped)
[INFO] Camel :: RMI .......................................... SKIPPED (dependency build failed or was skipped)
[INFO] Camel :: Routebox ..................................... SKIPPED (dependency build failed or was skipped)
[INFO] Camel :: Ruby ......................................... SKIPPED (dependency build failed or was skipped)
[INFO] Camel :: RSS .......................................... SKIPPED (dependency build failed or was skipped)
[INFO] Camel :: SAXON ........................................ SKIPPED (dependency build failed or was skipped)
[INFO] Camel :: Script ....................................... SKIPPED (dependency build failed or was skipped)
[INFO] Camel :: Shiro ........................................ SKIPPED (dependency build failed or was skipped)
[INFO] Camel :: SIP .......................................... SKIPPED (dependency build failed or was skipped)
[INFO] Camel :: SMPP ......................................... SKIPPED (dependency build failed or was skipped)
[INFO] Camel :: SNMP ......................................... SKIPPED (dependency build failed or was skipped)
[INFO] Camel :: SOAP ......................................... SKIPPED (dependency build failed or was skipped)
[INFO] Camel :: Spring Integration ........................... SKIPPED (dependency build failed or was skipped)
[INFO] Camel :: Spring Security .............................. SKIPPED (dependency build failed or was skipped)
[INFO] Camel :: Spring Web Services .......................... SKIPPED (dependency build failed or was skipped)
[INFO] Camel :: SQL .......................................... SKIPPED (dependency build failed or was skipped)
[INFO] Camel :: StringTemplate ............................... SKIPPED (dependency build failed or was skipped)
[INFO] Camel :: Syslog ....................................... SKIPPED (dependency build failed or was skipped)
[INFO] Camel :: TagSoup ...................................... SKIPPED (dependency build failed or was skipped)
[INFO] Camel :: XMLBeans ..................................... SKIPPED (dependency build failed or was skipped)
[INFO] Camel :: XML Security ................................. SKIPPED (dependency build failed or was skipped)
[INFO] Camel :: XMPP ......................................... SKIPPED (dependency build failed or was skipped)
[INFO] Camel :: XStream ...................................... SKIPPED (dependency build failed or was skipped)
[INFO] Camel :: Platforms .................................... SKIPPED (dependency build failed or was skipped)
[INFO] Camel :: Platforms :: Apache Karaf .................... SKIPPED (dependency build failed or was skipped)
[INFO] Camel :: Platforms :: Apache Karaf :: Commands ........ SKIPPED (dependency build failed or was skipped)
[INFO] Camel :: Platforms :: Apache Karaf :: Features ........ SKIPPED (dependency build failed or was skipped)
[INFO] Camel :: Maven Plugins ................................ SKIPPED (dependency build failed or was skipped)
[INFO] Camel :: Maven Camel Plugin ........................... SKIPPED (dependency build failed or was skipped)
[INFO] Camel :: Maven Guice Plugin ........................... SKIPPED (dependency build failed or was skipped)
[INFO] Camel :: Html to Pdf Plugin ........................... SKIPPED (dependency build failed or was skipped)
[INFO] Camel :: Archetypes ................................... SKIPPED (dependency build failed or was skipped)
[INFO] Camel :: Archetypes :: Camel Router with ActiveMQ ..... SKIPPED (dependency build failed or was skipped)
[INFO] Camel :: Archetypes :: Blueprint (OSGi) Based Router .. SKIPPED (dependency build failed or was skipped)
[INFO] Camel :: Archetypes :: Component ...................... SKIPPED (dependency build failed or was skipped)
[INFO] Camel :: Archetypes :: Router ......................... SKIPPED (dependency build failed or was skipped)
[INFO] Camel :: Archetypes :: Scala Router ................... SKIPPED (dependency build failed or was skipped)
[INFO] Camel :: Archetypes :: Spring XML Based Router ........ SKIPPED (dependency build failed or was skipped)
[INFO] Camel :: Archetypes :: Spring DM (OSGi) Based Router .. SKIPPED (dependency build failed or was skipped)
[INFO] Camel :: Archetypes :: Camel Routes WAR ............... SKIPPED (dependency build failed or was skipped)
[INFO] Camel :: Archetypes :: Camel Router with web console .. SKIPPED (dependency build failed or was skipped)
[INFO] Camel :: Manual ....................................... SKIPPED (dependency build failed or was skipped)
[INFO] Camel :: Tooling ...................................... SKIPPED (dependency build failed or was skipped)
[INFO] Camel :: Tests Bundles ................................ SKIPPED (dependency build failed or was skipped)
[INFO] Camel :: Test Bundles: mock-javamail-1.7 .............. SKIPPED (dependency build failed or was skipped)
[INFO] Camel :: Integration Tests :: Standalone .............. SKIPPED (dependency build failed or was skipped)
[INFO] Camel :: Integration Tests ............................ SKIPPED (dependency build failed or was skipped)
[INFO] Camel :: Partial Classpath Tests ...................... SKIPPED (dependency build failed or was skipped)
[INFO] Camel :: OSGi Integration Tests ....................... SKIPPED (dependency build failed or was skipped)
[INFO] Camel :: Tests ........................................ SKIPPED (dependency build failed or was skipped)
[INFO] Camel :: Examples ..................................... SKIPPED (dependency build failed or was skipped)
[INFO] Camel :: Example :: Aggregate ......................... SKIPPED (dependency build failed or was skipped)
[INFO] Camel :: Example :: Axis .............................. SKIPPED (dependency build failed or was skipped)
[INFO] Camel :: Example :: BAM ............................... SKIPPED (dependency build failed or was skipped)
[INFO] Camel :: Example :: Cafe .............................. SKIPPED (dependency build failed or was skipped)
[INFO] Camel :: Example :: CXF ............................... SKIPPED (dependency build failed or was skipped)
[INFO] Camel :: Example :: CXF :: Blueprint .................. SKIPPED (dependency build failed or was skipped)
[INFO] Camel :: Example :: CXF :: OSGI ....................... SKIPPED (dependency build failed or was skipped)
[INFO] Camel :: Example :: CXF Proxy ......................... SKIPPED (dependency build failed or was skipped)
[INFO] Camel :: Example :: CXF Tomcat ........................ SKIPPED (dependency build failed or was skipped)
[INFO] Camel :: Example :: Docs .............................. SKIPPED (dependency build failed or was skipped)
[INFO] Camel :: Example :: ETL ............................... SKIPPED (dependency build failed or was skipped)
[INFO] Camel :: Example :: GAE ............................... SKIPPED (dependency build failed or was skipped)
[INFO] Camel :: Example :: GAuth ............................. SKIPPED (dependency build failed or was skipped)
[INFO] Camel :: Example :: Guice :: JMS ...................... SKIPPED (dependency build failed or was skipped)
[INFO] Camel :: Example :: JMX ............................... SKIPPED (dependency build failed or was skipped)
[INFO] Camel :: Example :: JMS-File .......................... SKIPPED (dependency build failed or was skipped)
[INFO] Camel :: Example :: Loadbalancer camel-mina ........... SKIPPED (dependency build failed or was skipped)
[INFO] Camel :: Example :: Loan-Broker ....................... SKIPPED (dependency build failed or was skipped)
[INFO] Camel :: Example :: Management ........................ SKIPPED (dependency build failed or was skipped)
[INFO] Camel :: Example :: OSGi .............................. SKIPPED (dependency build failed or was skipped)
[INFO] Camel :: Example :: OSGi RMI .......................... SKIPPED (dependency build failed or was skipped)
[INFO] Camel :: Example :: POJO Messaging .................... SKIPPED (dependency build failed or was skipped)
[INFO] Camel :: Example :: Report Incident ................... SKIPPED (dependency build failed or was skipped)
[INFO] Camel :: Example :: Report Incident :: WS-Security .... SKIPPED (dependency build failed or was skipped)
[INFO] Camel :: Example :: Route :: Throttling ............... SKIPPED (dependency build failed or was skipped)
[INFO] Camel :: Example :: Servlet Tomcat .................... SKIPPED (dependency build failed or was skipped)
[INFO] Camel :: Example :: Simple Jira Bot ................... SKIPPED (dependency build failed or was skipped)
[INFO] Camel :: Example :: Simple Jira Bot :: Java DSL ....... SKIPPED (dependency build failed or was skipped)
[INFO] Camel :: Example :: Simple Jira Bot :: XML Configuration SKIPPED (dependency build failed or was skipped)
[INFO] Camel :: Example :: Spring ............................ SKIPPED (dependency build failed or was skipped)
[INFO] Camel :: Example :: Spring :: JavaConfig .............. SKIPPED (dependency build failed or was skipped)
[INFO] Camel :: Example :: Spring :: JMS ..................... SKIPPED (dependency build failed or was skipped)
[INFO] Camel :: Example :: Spring Web Services ............... SKIPPED (dependency build failed or was skipped)
[INFO] Camel :: Example :: Spring :: XQuery .................. SKIPPED (dependency build failed or was skipped)
[INFO] Camel :: Example :: Spring Security ................... SKIPPED (dependency build failed or was skipped)
[INFO] Camel :: Example :: Tracer ............................ SKIPPED (dependency build failed or was skipped)
[INFO] Camel :: Assembly ..................................... SKIPPED (dependency build failed or was skipped)
[INFO] ------------------------------------------------------------------------
[INFO] Error for project: Camel (during install)
[INFO] ------------------------------------------------------------------------
[INFO] Failed to resolve artifact.
Missing:
----------
1) velocity:velocity:jar:1.4
Try downloading the file manually from the project website.
Then, install it using the command:
mvn install:install-file -DgroupId=velocity -DartifactId=velocity -Dversion=1.4 -Dpackaging=jar -Dfile=/path/to/file
Alternatively, if you host your own repository you can deploy the file there:
mvn deploy:deploy-file -DgroupId=velocity -DartifactId=velocity -Dversion=1.4 -Dpackaging=jar -Dfile=/path/to/file -Durl=[url] -DrepositoryId=[id]
Path to dependency:
1) org.apache.maven.plugins:maven-remote-resources-plugin:maven-plugin:1.1
2) org.codehaus.plexus:plexus-velocity:jar:1.1.3
3) velocity:velocity:jar:1.4
----------
1 required artifact is missing.
for artifact:
org.apache.maven.plugins:maven-remote-resources-plugin:maven-plugin:1.1
from the specified remote repositories:
central (http://repo1.maven.org/maven2),
Nexus (http://repository.apache.org/snapshots)
[INFO] ------------------------------------------------------------------------
[INFO] Trace
org.apache.maven.lifecycle.LifecycleExecutionException: Missing:
----------
1) velocity:velocity:jar:1.4
Try downloading the file manually from the project website.
Then, install it using the command:
mvn install:install-file -DgroupId=velocity -DartifactId=velocity -Dversion=1.4 -Dpackaging=jar -Dfile=/path/to/file
Alternatively, if you host your own repository you can deploy the file there:
mvn deploy:deploy-file -DgroupId=velocity -DartifactId=velocity -Dversion=1.4 -Dpackaging=jar -Dfile=/path/to/file -Durl=[url] -DrepositoryId=[id]
Path to dependency:
1) org.apache.maven.plugins:maven-remote-resources-plugin:maven-plugin:1.1
2) org.codehaus.plexus:plexus-velocity:jar:1.1.3
3) velocity:velocity:jar:1.4
----------
1 required artifact is missing.
for artifact:
org.apache.maven.plugins:maven-remote-resources-plugin:maven-plugin:1.1
from the specified remote repositories:
central (http://repo1.maven.org/maven2),
Nexus (http://repository.apache.org/snapshots)
at org.apache.maven.lifecycle.DefaultLifecycleExecutor.executeGoals(DefaultLifecycleExecutor.java:711)
at org.apache.maven.lifecycle.DefaultLifecycleExecutor.executeGoalWithLifecycle(DefaultLifecycleExecutor.java:556)
at org.apache.maven.lifecycle.DefaultLifecycleExecutor.executeGoal(DefaultLifecycleExecutor.java:535)
at org.apache.maven.lifecycle.DefaultLifecycleExecutor.executeGoalAndHandleFailures(DefaultLifecycleExecutor.java:387)
at org.apache.maven.lifecycle.DefaultLifecycleExecutor.executeTaskSegments(DefaultLifecycleExecutor.java:348)
at org.apache.maven.lifecycle.DefaultLifecycleExecutor.execute(DefaultLifecycleExecutor.java:180)
at org.apache.maven.lifecycle.LifecycleExecutorInterceptor.execute(LifecycleExecutorInterceptor.java:65)
at org.apache.maven.DefaultMaven.doExecute(DefaultMaven.java:328)
at org.apache.maven.DefaultMaven.execute(DefaultMaven.java:138)
at org.apache.maven.cli.MavenCli.main(MavenCli.java:362)
at sun.reflect.NativeMethodAccessorImpl.invoke0(Native Method)
at sun.reflect.NativeMethodAccessorImpl.invoke(NativeMethodAccessorImpl.java:39)
at sun.reflect.DelegatingMethodAccessorImpl.invoke(DelegatingMethodAccessorImpl.java:25)
at java.lang.reflect.Method.invoke(Method.java:597)
at org.codehaus.classworlds.Launcher.launchEnhanced(Launcher.java:315)
at org.codehaus.classworlds.Launcher.launch(Launcher.java:255)
at hudson.maven.agent.Main.launch(Main.java:185)
at hudson.maven.MavenBuilder.call(MavenBuilder.java:164)
at hudson.maven.MavenModuleSetBuild$Builder.call(MavenModuleSetBuild.java:987)
at hudson.maven.MavenModuleSetBuild$Builder.call(MavenModuleSetBuild.java:918)
at hudson.remoting.UserRequest.perform(UserRequest.java:118)
at hudson.remoting.UserRequest.perform(UserRequest.java:48)
at hudson.remoting.Request$2.run(Request.java:270)
at java.util.concurrent.Executors$RunnableAdapter.call(Executors.java:441)
at java.util.concurrent.FutureTask$Sync.innerRun(FutureTask.java:303)
at java.util.concurrent.FutureTask.run(FutureTask.java:138)
at java.util.concurrent.ThreadPoolExecutor$Worker.runTask(ThreadPoolExecutor.java:886)
at java.util.concurrent.ThreadPoolExecutor$Worker.run(ThreadPoolExecutor.java:908)
at java.lang.Thread.run(Thread.java:619)
Caused by: org.apache.maven.artifact.resolver.MultipleArtifactsNotFoundException: Missing:
----------
1) velocity:velocity:jar:1.4
Try downloading the file manually from the project website.
Then, install it using the command:
mvn install:install-file -DgroupId=velocity -DartifactId=velocity -Dversion=1.4 -Dpackaging=jar -Dfile=/path/to/file
Alternatively, if you host your own repository you can deploy the file there:
mvn deploy:deploy-file -DgroupId=velocity -DartifactId=velocity -Dversion=1.4 -Dpackaging=jar -Dfile=/path/to/file -Durl=[url] -DrepositoryId=[id]
Path to dependency:
1) org.apache.maven.plugins:maven-remote-resources-plugin:maven-plugin:1.1
2) org.codehaus.plexus:plexus-velocity:jar:1.1.3
3) velocity:velocity:jar:1.4
----------
1 required artifact is missing.
for artifact:
org.apache.maven.plugins:maven-remote-resources-plugin:maven-plugin:1.1
from the specified remote repositories:
central (http://repo1.maven.org/maven2),
Nexus (http://repository.apache.org/snapshots)
at org.apache.maven.artifact.resolver.DefaultArtifactResolver.resolveTransitively(DefaultArtifactResolver.java:360)
at org.apache.maven.artifact.resolver.DefaultArtifactResolver.resolveTransitively(DefaultArtifactResolver.java:304)
at org.apache.maven.plugin.DefaultPluginManager.ensurePluginContainerIsComplete(DefaultPluginManager.java:835)
at org.apache.maven.plugin.DefaultPluginManager.getConfiguredMojo(DefaultPluginManager.java:647)
at org.apache.maven.plugin.DefaultPluginManager.executeMojo(DefaultPluginManager.java:468)
at hudson.maven.agent.PluginManagerInterceptor.executeMojo(PluginManagerInterceptor.java:182)
at org.apache.maven.lifecycle.DefaultLifecycleExecutor.executeGoals(DefaultLifecycleExecutor.java:694)
... 28 more
[INFO] ------------------------------------------------------------------------
[INFO] BUILD ERRORS
[INFO] ------------------------------------------------------------------------
[INFO] Total time: 1 minute 19 seconds
[INFO] Finished at: Tue Jul 12 09:58:13 UTC 2011
[INFO] Final Memory: 70M/322M
[INFO] ------------------------------------------------------------------------
channel stopped
[locks-and-latches] Releasing all the locks
[locks-and-latches] All the locks released
Build failed in Jenkins: Camel #1270
Posted by Apache Jenkins Server <je...@builds.apache.org>.
See <https://builds.apache.org/job/Camel/1270/changes>
Changes:
[davsclaus] CAMEL-4206: Upgrade to scala 2.9.0
[davsclaus] Upgraded to restlet 2.0.8
[davsclaus] Upgraded parent version in pom.xml
[davsclaus] CAMEL-4205: Added whenDoneByIndex to NotifyBuilder.
[davsclaus] Fixed test due CI error
------------------------------------------
[...truncated 1495 lines...]
[WARNING] Warning building bundle org.apache.camel:camel-cxf-transport:bundle:2.8-SNAPSHOT : Did not find matching referal for org.apache.mina.*
[WARNING] Warning building bundle org.apache.camel:camel-cxf-transport:bundle:2.8-SNAPSHOT : Did not find matching referal for org.apache.qpid.*
[WARNING] Warning building bundle org.apache.camel:camel-cxf-transport:bundle:2.8-SNAPSHOT : Did not find matching referal for org.apache.velocity.*
[WARNING] Warning building bundle org.apache.camel:camel-cxf-transport:bundle:2.8-SNAPSHOT : Did not find matching referal for org.apache.xmlbeans.*
[WARNING] Warning building bundle org.apache.camel:camel-cxf-transport:bundle:2.8-SNAPSHOT : Did not find matching referal for org.ccil.cowan.tagsoup.*
[WARNING] Warning building bundle org.apache.camel:camel-cxf-transport:bundle:2.8-SNAPSHOT : Did not find matching referal for org.eclipse.jetty.*
[WARNING] Warning building bundle org.apache.camel:camel-cxf-transport:bundle:2.8-SNAPSHOT : Did not find matching referal for org.jivesoftware.smack.*
[WARNING] Warning building bundle org.apache.camel:camel-cxf-transport:bundle:2.8-SNAPSHOT : Did not find matching referal for org.mortbay.cometd.*
[WARNING] Warning building bundle org.apache.camel:camel-cxf-transport:bundle:2.8-SNAPSHOT : Exporting packages that are not on the Bundle-Classpath[Jar:dot]: [META-INF.cxf.camel]
[INFO] [ianal:verify-legal-files {execution: default}]
[INFO] Checking legal files in: camel-cxf-transport-2.8-SNAPSHOT.jar
[INFO] [install:install {execution: default-install}]
[INFO] Installing <https://builds.apache.org/job/Camel/ws/camel-trunk/components/camel-cxf-transport/target/camel-cxf-transport-2.8-SNAPSHOT.jar> to <https://builds.apache.org/job/Camel/ws/.repository/org/apache/camel/camel-cxf-transport/2.8-SNAPSHOT/camel-cxf-transport-2.8-SNAPSHOT.jar>
[INFO] [bundle:install {execution: default-install}]
[INFO] Parsing <https://builds.apache.org/job/Camel/ws/.repository/repository.xml>
[INFO] Installing org/apache/camel/camel-cxf-transport/2.8-SNAPSHOT/camel-cxf-transport-2.8-SNAPSHOT.jar
[INFO] Writing OBR metadata
[JENKINS] Archiving <https://builds.apache.org/job/Camel/ws/camel-trunk/components/camel-cxf-transport/pom.xml> to /home/hudson/hudson/jobs/Camel/modules/org.apache.camel$camel-cxf-transport/builds/2011-07-11_02-40-24/archive/org.apache.camel/camel-cxf-transport/2.8-SNAPSHOT/camel-cxf-transport-2.8-SNAPSHOT.pom
[JENKINS] Archiving <https://builds.apache.org/job/Camel/ws/camel-trunk/components/camel-cxf-transport/target/camel-cxf-transport-2.8-SNAPSHOT.jar> to /home/hudson/hudson/jobs/Camel/modules/org.apache.camel$camel-cxf-transport/builds/2011-07-11_02-40-24/archive/org.apache.camel/camel-cxf-transport/2.8-SNAPSHOT/camel-cxf-transport-2.8-SNAPSHOT.jar
[INFO] ------------------------------------------------------------------------
[INFO] Building Camel :: CXF
[INFO] task-segment: [clean, install]
[INFO] ------------------------------------------------------------------------
[INFO] [clean:clean {execution: default-clean}]
[INFO] Deleting <https://builds.apache.org/job/Camel/ws/camel-trunk/components/camel-cxf/target>
[INFO] snapshot org.apache.camel:camel-cxf-transport:2.8-SNAPSHOT: checking for updates from apache.snapshots
[INFO] snapshot org.apache.camel:camel-blueprint:2.8-SNAPSHOT: checking for updates from apache.snapshots
[INFO] [antrun:run {execution: create-prop}]
[INFO] Executing tasks
[echo] Maven version: 2.8-SNAPSHOT
[echo] OSGi version: 2.8.0.SNAPSHOT
[mkdir] Created dir: <https://builds.apache.org/job/Camel/ws/camel-trunk/components/camel-cxf/target>
[INFO] Executed tasks
[INFO] [properties:read-project-properties {execution: default}]
[INFO] [cxf-codegen:wsdl2java {execution: generate-test-sources}]
[INFO] Running wsdl2java in fork mode...
[INFO] Building jar: /tmp/cxf-tmp-67198/cxf-codegen7185910071125498272.jar
[INFO] [remote-resources:process {execution: default}]
[INFO] [resources:resources {execution: default-resources}]
[INFO] Using 'UTF-8' encoding to copy filtered resources.
[INFO] Copying 13 resources
[INFO] Copying 3 resources
[INFO] [compiler:compile {execution: default-compile}]
[INFO] Compiling 114 source files to <https://builds.apache.org/job/Camel/ws/camel-trunk/components/camel-cxf/target/classes>
[INFO] [resources:testResources {execution: default-testResources}]
[INFO] Using 'UTF-8' encoding to copy filtered resources.
[INFO] Copying 78 resources
[INFO] Copying 3 resources
[INFO] [compiler:testCompile {execution: default-testCompile}]
[INFO] Compiling 142 source files to <https://builds.apache.org/job/Camel/ws/camel-trunk/components/camel-cxf/target/test-classes>
[INFO] [surefire:test {execution: default-test}]
[INFO] Tests are skipped.
[INFO] [bundle:bundle {execution: default-bundle}]
[WARNING] Warning building bundle org.apache.camel:camel-cxf:bundle:2.8-SNAPSHOT : Did not find matching referal for !META-INF.cxf.camel
[WARNING] Warning building bundle org.apache.camel:camel-cxf:bundle:2.8-SNAPSHOT : Did not find matching referal for com.thoughtworks.xstream.*
[WARNING] Warning building bundle org.apache.camel:camel-cxf:bundle:2.8-SNAPSHOT : Did not find matching referal for freemarker.*
[WARNING] Warning building bundle org.apache.camel:camel-cxf:bundle:2.8-SNAPSHOT : Did not find matching referal for javax.persistence.*
[WARNING] Warning building bundle org.apache.camel:camel-cxf:bundle:2.8-SNAPSHOT : Did not find matching referal for net.sf.flatpack.*
[WARNING] Warning building bundle org.apache.camel:camel-cxf:bundle:2.8-SNAPSHOT : Did not find matching referal for org.antlr.stringtemplate.*
[WARNING] Warning building bundle org.apache.camel:camel-cxf:bundle:2.8-SNAPSHOT : Did not find matching referal for org.apache.abdera.*
[WARNING] Warning building bundle org.apache.camel:camel-cxf:bundle:2.8-SNAPSHOT : Did not find matching referal for org.apache.commons.httpclient.*
[WARNING] Warning building bundle org.apache.camel:camel-cxf:bundle:2.8-SNAPSHOT : Did not find matching referal for org.apache.commons.logging.*
[WARNING] Warning building bundle org.apache.camel:camel-cxf:bundle:2.8-SNAPSHOT : Did not find matching referal for org.apache.mina.*
[WARNING] Warning building bundle org.apache.camel:camel-cxf:bundle:2.8-SNAPSHOT : Did not find matching referal for org.apache.qpid.*
[WARNING] Warning building bundle org.apache.camel:camel-cxf:bundle:2.8-SNAPSHOT : Did not find matching referal for org.apache.velocity.*
[WARNING] Warning building bundle org.apache.camel:camel-cxf:bundle:2.8-SNAPSHOT : Did not find matching referal for org.apache.xmlbeans.*
[WARNING] Warning building bundle org.apache.camel:camel-cxf:bundle:2.8-SNAPSHOT : Did not find matching referal for org.ccil.cowan.tagsoup.*
[WARNING] Warning building bundle org.apache.camel:camel-cxf:bundle:2.8-SNAPSHOT : Did not find matching referal for org.eclipse.jetty.*
[WARNING] Warning building bundle org.apache.camel:camel-cxf:bundle:2.8-SNAPSHOT : Did not find matching referal for org.jivesoftware.smack.*
[WARNING] Warning building bundle org.apache.camel:camel-cxf:bundle:2.8-SNAPSHOT : Did not find matching referal for org.mortbay.cometd.*
[INFO] [build-helper:attach-artifact {execution: attach-artifacts}]
[INFO] [ianal:verify-legal-files {execution: default}]
[INFO] Checking legal files in: camel-cxf-2.8-SNAPSHOT.jar
[INFO] [install:install {execution: default-install}]
[INFO] Installing <https://builds.apache.org/job/Camel/ws/camel-trunk/components/camel-cxf/target/camel-cxf-2.8-SNAPSHOT.jar> to <https://builds.apache.org/job/Camel/ws/.repository/org/apache/camel/camel-cxf/2.8-SNAPSHOT/camel-cxf-2.8-SNAPSHOT.jar>
[INFO] Installing <https://builds.apache.org/job/Camel/ws/camel-trunk/components/camel-cxf/src/main/resources/schema/cxfEndpoint.xsd> to <https://builds.apache.org/job/Camel/ws/.repository/org/apache/camel/camel-cxf/2.8-SNAPSHOT/camel-cxf-2.8-SNAPSHOT.xsd>
[INFO] [bundle:install {execution: default-install}]
[INFO] Parsing <https://builds.apache.org/job/Camel/ws/.repository/repository.xml>
[INFO] Installing org/apache/camel/camel-cxf/2.8-SNAPSHOT/camel-cxf-2.8-SNAPSHOT.jar
[INFO] Writing OBR metadata
[JENKINS] Archiving <https://builds.apache.org/job/Camel/ws/camel-trunk/components/camel-cxf/pom.xml> to /home/hudson/hudson/jobs/Camel/modules/org.apache.camel$camel-cxf/builds/2011-07-11_02-40-24/archive/org.apache.camel/camel-cxf/2.8-SNAPSHOT/camel-cxf-2.8-SNAPSHOT.pom
[JENKINS] Archiving <https://builds.apache.org/job/Camel/ws/camel-trunk/components/camel-cxf/target/camel-cxf-2.8-SNAPSHOT.jar> to /home/hudson/hudson/jobs/Camel/modules/org.apache.camel$camel-cxf/builds/2011-07-11_02-40-24/archive/org.apache.camel/camel-cxf/2.8-SNAPSHOT/camel-cxf-2.8-SNAPSHOT.jar
[JENKINS] Archiving <https://builds.apache.org/job/Camel/ws/camel-trunk/components/camel-cxf/src/main/resources/schema/cxfEndpoint.xsd> to /home/hudson/hudson/jobs/Camel/modules/org.apache.camel$camel-cxf/builds/2011-07-11_02-40-24/archive/org.apache.camel/camel-cxf/2.8-SNAPSHOT/camel-cxf-2.8-SNAPSHOT.xsd
[INFO] ------------------------------------------------------------------------
[INFO] Building Camel :: Components
[INFO] task-segment: [clean, install]
[INFO] ------------------------------------------------------------------------
[INFO] [clean:clean {execution: default-clean}]
[INFO] Deleting <https://builds.apache.org/job/Camel/ws/camel-trunk/components/target>
[INFO] [antrun:run {execution: create-prop}]
[INFO] Executing tasks
[echo] Maven version: 2.8-SNAPSHOT
[echo] OSGi version: 2.8.0.SNAPSHOT
[mkdir] Created dir: <https://builds.apache.org/job/Camel/ws/camel-trunk/components/target>
[INFO] Executed tasks
[INFO] [properties:read-project-properties {execution: default}]
[INFO] [remote-resources:process {execution: default}]
[INFO] [site:attach-descriptor {execution: default-attach-descriptor}]
[INFO] [ianal:verify-legal-files {execution: default}]
[INFO] [install:install {execution: default-install}]
[INFO] Installing <https://builds.apache.org/job/Camel/ws/camel-trunk/components/pom.xml> to <https://builds.apache.org/job/Camel/ws/.repository/org/apache/camel/components/2.8-SNAPSHOT/components-2.8-SNAPSHOT.pom>
[JENKINS] Archiving <https://builds.apache.org/job/Camel/ws/camel-trunk/components/pom.xml> to /home/hudson/hudson/jobs/Camel/modules/org.apache.camel$components/builds/2011-07-11_02-40-24/archive/org.apache.camel/components/2.8-SNAPSHOT/components-2.8-SNAPSHOT.pom
[INFO] ------------------------------------------------------------------------
[INFO] Building Camel :: Web
[INFO] task-segment: [clean, install]
[INFO] ------------------------------------------------------------------------
Downloading: http://download.java.net/maven/2//com/sun/jersey/contribs/maven-wadl-plugin/1.8/maven-wadl-plugin-1.8.pom
5K downloaded (maven-wadl-plugin-1.8.pom)
Downloading: http://download.java.net/maven/2//com/sun/jersey/contribs/jersey-contribs/1.8/jersey-contribs-1.8.pom
3K downloaded (jersey-contribs-1.8.pom)
Downloading: http://download.java.net/maven/2//com/sun/jersey/jersey-project/1.8/jersey-project-1.8.pom
16K downloaded (jersey-project-1.8.pom)
Downloading: http://download.java.net/maven/2//com/sun/jersey/contribs/maven-wadl-plugin/1.8/maven-wadl-plugin-1.8.jar
17K downloaded (maven-wadl-plugin-1.8.jar)
[INFO] [clean:clean {execution: default-clean}]
[INFO] Deleting <https://builds.apache.org/job/Camel/ws/camel-trunk/components/camel-web/target>
Downloading: http://maven.glassfish.org/content/groups/glassfish/com/sun/jersey/contribs/jersey-spring/1.8/jersey-spring-1.8.pom
20K downloaded (jersey-spring-1.8.pom)
Downloading: http://maven.glassfish.org/content/groups/glassfish/com/sun/jersey/jersey-server/1.8/jersey-server-1.8.pom
11K downloaded (jersey-server-1.8.pom)
Downloading: http://maven.glassfish.org/content/groups/glassfish/com/sun/jersey/jersey-core/1.8/jersey-core-1.8.pom
9K downloaded (jersey-core-1.8.pom)
Downloading: http://maven.glassfish.org/content/groups/glassfish/com/sun/jersey/jersey-json/1.8/jersey-json-1.8.pom
10K downloaded (jersey-json-1.8.pom)
Downloading: http://maven.glassfish.org/content/groups/glassfish/com/sun/jersey/jersey-atom/1.8/jersey-atom-1.8.pom
6K downloaded (jersey-atom-1.8.pom)
Downloading: http://maven.glassfish.org/content/groups/glassfish/com/sun/jersey/jersey-client/1.8/jersey-client-1.8.pom
5K downloaded (jersey-client-1.8.pom)
Downloading: http://maven.glassfish.org/content/groups/glassfish/com/sun/jersey/jersey-server/1.8/jersey-server-1.8.jar
Downloading: http://maven.glassfish.org/content/groups/glassfish/com/sun/jersey/contribs/jersey-spring/1.8/jersey-spring-1.8.jar
16K downloaded (jersey-spring-1.8.jar)
678K downloaded (jersey-server-1.8.jar)
Downloading: http://maven.glassfish.org/content/groups/glassfish/com/sun/jersey/jersey-core/1.8/jersey-core-1.8.jar
447K downloaded (jersey-core-1.8.jar)
Downloading: http://maven.glassfish.org/content/groups/glassfish/com/sun/jersey/jersey-json/1.8/jersey-json-1.8.jar
144K downloaded (jersey-json-1.8.jar)
Downloading: http://maven.glassfish.org/content/groups/glassfish/com/sun/jersey/jersey-atom/1.8/jersey-atom-1.8.jar
10K downloaded (jersey-atom-1.8.jar)
Downloading: http://maven.glassfish.org/content/groups/glassfish/com/sun/jersey/jersey-client/1.8/jersey-client-1.8.jar
126K downloaded (jersey-client-1.8.jar)
[INFO] [antrun:run {execution: create-prop}]
[INFO] Executing tasks
[echo] Maven version: 2.8-SNAPSHOT
[echo] OSGi version: 2.8.0.SNAPSHOT
[mkdir] Created dir: <https://builds.apache.org/job/Camel/ws/camel-trunk/components/camel-web/target>
[INFO] Executed tasks
[INFO] [properties:read-project-properties {execution: default}]
[INFO] [antrun:run {execution: process-sources}]
[INFO] Executing tasks
[echo] Copying to code together for the XSD generation
[mkdir] Created dir: <https://builds.apache.org/job/Camel/ws/camel-trunk/components/camel-web/target/schema-src>
[mkdir] Created dir: <https://builds.apache.org/job/Camel/ws/camel-trunk/components/camel-web/target/schema>
[copy] Copying 5 files to <https://builds.apache.org/job/Camel/ws/camel-trunk/components/camel-web/target/schema-src>
[echo] Generating XSD schema
[schemagen] Generating schema from 5 source files
Note: Writing <https://builds.apache.org/job/Camel/ws/camel-trunk/components/camel-web/target/schema/camel-web.xsd>
[INFO] Executed tasks
[INFO] [remote-resources:process {execution: default}]
[INFO] [resources:resources {execution: default-resources}]
[INFO] Using 'UTF-8' encoding to copy filtered resources.
[INFO] Copying 7 resources
[INFO] Copying 3 resources
[INFO] [compiler:compile {execution: default-compile}]
[INFO] Compiling 28 source files to <https://builds.apache.org/job/Camel/ws/camel-trunk/components/camel-web/target/classes>
Processing Configuration for child elements
Processing child [project]
Processing child [warSourceDirectory]
Processing child [resourcesSourceDirectory]
Processing child [targetDirectory]
Processing child [classesDirectory]
Processing child [classPathElements]
[INFO] [scalate:precompile {execution: default}]
[INFO] Precompiling Scalate Templates into Scala classes...
[INFO] processing <https://builds.apache.org/job/Camel/ws/camel-trunk/components/camel-web/src/main/webapp/WEB-INF/scalate/layouts/default.scaml>
[JENKINS] Archiving <https://builds.apache.org/job/Camel/ws/camel-trunk/components/camel-web/pom.xml> to /home/hudson/hudson/jobs/Camel/modules/org.apache.camel$camel-web/builds/2011-07-11_02-40-24/archive/org.apache.camel/camel-web/2.8-SNAPSHOT/camel-web-2.8-SNAPSHOT.pom
[INFO] ------------------------------------------------------------------------
[ERROR] FATAL ERROR
[INFO] ------------------------------------------------------------------------
[INFO] assertion failed: List(object Byte, object Byte)
[INFO] ------------------------------------------------------------------------
[INFO] Trace
org.fusesource.scalate.TemplateException: assertion failed: List(object Byte, object Byte)
at org.fusesource.scalate.TemplateEngine.compileAndLoad(TemplateEngine.scala:775)
at org.fusesource.scalate.TemplateEngine.compileAndLoadEntry(TemplateEngine.scala:637)
at org.fusesource.scalate.TemplateEngine.liftedTree1$1(TemplateEngine.scala:368)
at org.fusesource.scalate.TemplateEngine.load(TemplateEngine.scala:362)
at org.fusesource.scalate.TemplateEngine.load(TemplateEngine.scala:432)
at org.fusesource.scalate.support.Precompiler$$anonfun$execute$3.apply(Precompiler.scala:92)
at org.fusesource.scalate.support.Precompiler$$anonfun$execute$3.apply(Precompiler.scala:87)
at scala.collection.LinearSeqOptimized$class.foreach(LinearSeqOptimized.scala:61)
at scala.collection.immutable.List.foreach(List.scala:45)
at org.fusesource.scalate.support.Precompiler.execute(Precompiler.scala:87)
at sun.reflect.NativeMethodAccessorImpl.invoke0(Native Method)
at sun.reflect.NativeMethodAccessorImpl.invoke(NativeMethodAccessorImpl.java:39)
at sun.reflect.DelegatingMethodAccessorImpl.invoke(DelegatingMethodAccessorImpl.java:25)
at java.lang.reflect.Method.invoke(Method.java:597)
at org.fusesource.scalate.maven.PrecompileMojo.execute(PrecompileMojo.scala:125)
at org.apache.maven.plugin.DefaultPluginManager.executeMojo(DefaultPluginManager.java:490)
at hudson.maven.agent.PluginManagerInterceptor.executeMojo(PluginManagerInterceptor.java:182)
at org.apache.maven.lifecycle.DefaultLifecycleExecutor.executeGoals(DefaultLifecycleExecutor.java:694)
at org.apache.maven.lifecycle.DefaultLifecycleExecutor.executeGoalWithLifecycle(DefaultLifecycleExecutor.java:556)
at org.apache.maven.lifecycle.DefaultLifecycleExecutor.executeGoal(DefaultLifecycleExecutor.java:535)
at org.apache.maven.lifecycle.DefaultLifecycleExecutor.executeGoalAndHandleFailures(DefaultLifecycleExecutor.java:387)
at org.apache.maven.lifecycle.DefaultLifecycleExecutor.executeTaskSegments(DefaultLifecycleExecutor.java:348)
at org.apache.maven.lifecycle.DefaultLifecycleExecutor.execute(DefaultLifecycleExecutor.java:180)
at org.apache.maven.lifecycle.LifecycleExecutorInterceptor.execute(LifecycleExecutorInterceptor.java:65)
at org.apache.maven.DefaultMaven.doExecute(DefaultMaven.java:328)
at org.apache.maven.DefaultMaven.execute(DefaultMaven.java:138)
at org.apache.maven.cli.MavenCli.main(MavenCli.java:362)
at sun.reflect.NativeMethodAccessorImpl.invoke0(Native Method)
at sun.reflect.NativeMethodAccessorImpl.invoke(NativeMethodAccessorImpl.java:39)
at sun.reflect.DelegatingMethodAccessorImpl.invoke(DelegatingMethodAccessorImpl.java:25)
at java.lang.reflect.Method.invoke(Method.java:597)
at org.codehaus.classworlds.Launcher.launchEnhanced(Launcher.java:315)
at org.codehaus.classworlds.Launcher.launch(Launcher.java:255)
at hudson.maven.agent.Main.launch(Main.java:185)
at hudson.maven.MavenBuilder.call(MavenBuilder.java:164)
at hudson.maven.MavenModuleSetBuild$Builder.call(MavenModuleSetBuild.java:987)
at hudson.maven.MavenModuleSetBuild$Builder.call(MavenModuleSetBuild.java:918)
at hudson.remoting.UserRequest.perform(UserRequest.java:118)
at hudson.remoting.UserRequest.perform(UserRequest.java:48)
at hudson.remoting.Request$2.run(Request.java:270)
at java.util.concurrent.Executors$RunnableAdapter.call(Executors.java:441)
at java.util.concurrent.FutureTask$Sync.innerRun(FutureTask.java:303)
at java.util.concurrent.FutureTask.run(FutureTask.java:138)
at java.util.concurrent.ThreadPoolExecutor$Worker.runTask(ThreadPoolExecutor.java:886)
at java.util.concurrent.ThreadPoolExecutor$Worker.run(ThreadPoolExecutor.java:908)
at java.lang.Thread.run(Thread.java:619)
Caused by: java.lang.AssertionError: assertion failed: List(object Byte, object Byte)
at scala.tools.nsc.symtab.Symbols$Symbol.suchThat(Symbols.scala:1056)
at scala.tools.nsc.symtab.Symbols$Symbol.companionModule0(Symbols.scala:1271)
at scala.tools.nsc.symtab.Symbols$Symbol.companionModule(Symbols.scala:1281)
at scala.tools.nsc.symtab.Symbols$Symbol.linkedClassOfClass(Symbols.scala:1302)
at scala.tools.nsc.symtab.Definitions$definitions$.addModuleMethod$1(Definitions.scala:711)
at scala.tools.nsc.symtab.Definitions$definitions$.initValueClasses(Definitions.scala:714)
at scala.tools.nsc.symtab.Definitions$definitions$.init(Definitions.scala:791)
at scala.tools.nsc.Global$Run.<init>(Global.scala:604)
at org.fusesource.scalate.support.ScalaCompiler.compile(ScalaCompiler.scala:80)
at org.fusesource.scalate.TemplateEngine.compileAndLoad(TemplateEngine.scala:691)
... 45 more
[INFO] ------------------------------------------------------------------------
[INFO] Total time: 3 minutes 37 seconds
[INFO] Finished at: Sun Jul 10 19:44:28 PDT 2011
[INFO] Final Memory: 143M/360M
[INFO] ------------------------------------------------------------------------
Sending e-mails to: dev@camel.apache.org
channel stopped
[locks-and-latches] Releasing all the locks
[locks-and-latches] All the locks released
Build failed in Jenkins: Camel #1269
Posted by Apache Jenkins Server <je...@builds.apache.org>.
See <https://builds.apache.org/job/Camel/1269/changes>
Changes:
[davsclaus] CAMEL-4201: Added time it took to execute the test method being logged, when using the test kits.
[davsclaus] Fixed test that uses topics and may rarely fail otherwise.
[davsclaus] Removed test that causes trouble on CI servers
[davsclaus] CAMEL-4199: Added not() to ValueBuilder.
[jbonofre] [CAMEL-2197] Use released version of ServiceMix Hadoop bundle.
[davsclaus] Upgrade to jersey 1.8 in camel-web
[janstey] add note about updating CXF version range in Karaf features file
[dkulp] [CAMEL-4195] Remove commons-pool from cxf feature
Tighten cxf version range
[davsclaus] Added unit test based on user forum issue.
[davsclaus] CAMEL-4197: scheduled route policy should not start quartz scheduler itself, but rely on QuartzComponent doing that. Polished logging.
[davsclaus] CAMEL-4176: Fixed fallback to use http4 or http4s for proxy scheme when configured as property on CamelContext properties.
[davsclaus] CAMEL-4197: scheduled route policy should not start quartz scheduler itself, but rely on QuartzComponent doing that. Polished unit tests.
[davsclaus] CAMEL-4196: scheduled route policy should fail if misconfigured instead of WARN logging.
[ningjiang] CAMEL-4195 use servicemix commons-pool bundle in camel-cxf feature
[davsclaus] Use final modifier if possible
[davsclaus] CAMEL-4194: jmx topic endpoints should be non-singleton.
[ningjiang] Fixed the CS error of MailConsumer
[davsclaus] Some osgi tests cannot run anymore.
------------------------------------------
[...truncated 9256 lines...]
[INFO] Checking legal files in: apache-camel-2.8-SNAPSHOT-src.zip
[INFO] [install:install {execution: default-install}]
[INFO] Installing <https://builds.apache.org/job/Camel/ws/camel-trunk/apache-camel/pom.xml> to <https://builds.apache.org/job/Camel/ws/.repository/org/apache/camel/apache-camel/2.8-SNAPSHOT/apache-camel-2.8-SNAPSHOT.pom>
[INFO] Installing <https://builds.apache.org/job/Camel/ws/camel-trunk/apache-camel/target/apache-camel-2.8-SNAPSHOT.tar.gz> to <https://builds.apache.org/job/Camel/ws/.repository/org/apache/camel/apache-camel/2.8-SNAPSHOT/apache-camel-2.8-SNAPSHOT.tar.gz>
[INFO] Installing <https://builds.apache.org/job/Camel/ws/camel-trunk/apache-camel/target/apache-camel-2.8-SNAPSHOT.zip> to <https://builds.apache.org/job/Camel/ws/.repository/org/apache/camel/apache-camel/2.8-SNAPSHOT/apache-camel-2.8-SNAPSHOT.zip>
[INFO] Installing <https://builds.apache.org/job/Camel/ws/camel-trunk/apache-camel/target/apache-camel-2.8-SNAPSHOT-src.zip> to <https://builds.apache.org/job/Camel/ws/.repository/org/apache/camel/apache-camel/2.8-SNAPSHOT/apache-camel-2.8-SNAPSHOT-src.zip>
[JENKINS] Archiving <https://builds.apache.org/job/Camel/ws/camel-trunk/apache-camel/pom.xml> to /home/hudson/hudson/jobs/Camel/modules/org.apache.camel$apache-camel/builds/2011-07-10_08-09-16/archive/org.apache.camel/apache-camel/2.8-SNAPSHOT/apache-camel-2.8-SNAPSHOT.pom
[JENKINS] Archiving <https://builds.apache.org/job/Camel/ws/camel-trunk/apache-camel/target/apache-camel-2.8-SNAPSHOT.tar.gz> to /home/hudson/hudson/jobs/Camel/modules/org.apache.camel$apache-camel/builds/2011-07-10_08-09-16/archive/org.apache.camel/apache-camel/2.8-SNAPSHOT/apache-camel-2.8-SNAPSHOT.tar.gz
[JENKINS] Archiving <https://builds.apache.org/job/Camel/ws/camel-trunk/apache-camel/target/apache-camel-2.8-SNAPSHOT.zip> to /home/hudson/hudson/jobs/Camel/modules/org.apache.camel$apache-camel/builds/2011-07-10_08-09-16/archive/org.apache.camel/apache-camel/2.8-SNAPSHOT/apache-camel-2.8-SNAPSHOT.zip
[JENKINS] Archiving <https://builds.apache.org/job/Camel/ws/camel-trunk/apache-camel/target/apache-camel-2.8-SNAPSHOT-src.zip> to /home/hudson/hudson/jobs/Camel/modules/org.apache.camel$apache-camel/builds/2011-07-10_08-09-16/archive/org.apache.camel/apache-camel/2.8-SNAPSHOT/apache-camel-2.8-SNAPSHOT-src.zip
[INFO]
[INFO]
[INFO] ------------------------------------------------------------------------
[INFO] Reactor Summary:
[INFO] ------------------------------------------------------------------------
[INFO] Camel ................................................. SUCCESS [8.940s]
[INFO] Apache :: Camel Buildtools ............................ SUCCESS [2.520s]
[INFO] Camel :: Parent ....................................... SUCCESS [1.657s]
[INFO] Camel :: Core ......................................... SUCCESS [23.320s]
[INFO] Camel :: Core XML ..................................... SUCCESS [2.452s]
[INFO] Camel :: Core OSGi .................................... SUCCESS [2.853s]
[INFO] Camel :: Spring ....................................... SUCCESS [11.917s]
[INFO] Camel :: Test ......................................... SUCCESS [2.446s]
[INFO] Camel :: TestNG ....................................... SUCCESS [2.416s]
[INFO] Camel :: Blueprint .................................... SUCCESS [4.580s]
[INFO] Camel :: JUEL ......................................... SUCCESS [2.464s]
[INFO] Camel :: BAM .......................................... SUCCESS [3.332s]
[INFO] Camel :: Groovy ....................................... SUCCESS [2.842s]
[INFO] Camel :: JXPath ....................................... SUCCESS [2.035s]
[INFO] Camel :: Velocity ..................................... SUCCESS [2.510s]
[INFO] Camel :: Scala ........................................ SUCCESS [30.951s]
[INFO] Camel :: HTTP ......................................... SUCCESS [2.856s]
[INFO] Camel :: HTTP4 (HttpClient 4.x) ....................... SUCCESS [2.906s]
[INFO] Camel :: Jetty ........................................ SUCCESS [4.068s]
[INFO] Camel :: CXF :: Transport ............................. SUCCESS [9.967s]
[INFO] Camel :: CXF .......................................... SUCCESS [10.078s]
[INFO] Camel :: Components ................................... SUCCESS [0.282s]
[INFO] Camel :: Web .......................................... FAILED [6.579s]
[INFO] Camel :: Web :: Standalone ............................ SKIPPED (dependency build failed or was skipped)
[INFO] Camel :: JMS .......................................... SUCCESS [5.109s]
[INFO] Camel :: AHC .......................................... SUCCESS [2.807s]
[INFO] Camel :: AMQP ......................................... SUCCESS [4.011s]
[INFO] Camel :: APNS ......................................... SUCCESS [2.538s]
[INFO] Camel :: Atom ......................................... SUCCESS [2.567s]
[INFO] Camel :: AWS .......................................... SUCCESS [4.267s]
[INFO] Camel :: Bean validator ............................... SUCCESS [2.570s]
[INFO] Camel :: Bindy ........................................ SUCCESS [3.613s]
[INFO] Camel :: Cache ........................................ SUCCESS [2.735s]
[INFO] Camel :: Castor ....................................... SUCCESS [3.143s]
[INFO] Camel :: Stream ....................................... SUCCESS [2.065s]
[INFO] Camel :: Cometd ....................................... SUCCESS [2.473s]
[INFO] Camel :: Context ...................................... SUCCESS [2.060s]
[INFO] Camel :: Crypto ....................................... SUCCESS [2.871s]
[INFO] Camel :: CSV .......................................... SUCCESS [1.965s]
[INFO] Camel :: DNS .......................................... SUCCESS [2.417s]
[INFO] Camel :: Dozer ........................................ SUCCESS [2.347s]
[INFO] Camel :: Eclipse ...................................... SUCCESS [1.165s]
[INFO] Camel :: EJB .......................................... SUCCESS [2.522s]
[INFO] Camel :: Event Admin .................................. SUCCESS [1.976s]
[INFO] Camel :: Exec ......................................... SUCCESS [2.384s]
[INFO] Camel :: FlatPack ..................................... SUCCESS [2.328s]
[INFO] Camel :: Freemarker ................................... SUCCESS [2.180s]
[INFO] Camel :: FTP .......................................... SUCCESS [4.324s]
[INFO] Camel :: Servlet ...................................... SUCCESS [2.454s]
[INFO] Camel :: GAE .......................................... SUCCESS [4.070s]
[INFO] Camel :: Guice ........................................ SUCCESS [2.215s]
[INFO] Camel :: HawtDB ....................................... SUCCESS [2.247s]
[INFO] Camel :: HazelCast .................................... SUCCESS [3.502s]
[INFO] Camel :: HDFS ......................................... SUCCESS [3.376s]
[INFO] Camel :: MINA ......................................... SUCCESS [2.784s]
[INFO] Camel :: HL7 .......................................... SUCCESS [2.886s]
[INFO] Camel :: iBatis ....................................... SUCCESS [2.209s]
[INFO] Camel :: IRC .......................................... SUCCESS [2.339s]
[INFO] Camel :: Jackson ...................................... SUCCESS [2.066s]
[INFO] Camel :: Javaspace .................................... SUCCESS [2.656s]
[INFO] Camel :: Spring JavaConfig ............................ SUCCESS [2.379s]
[INFO] Camel :: JAXB ......................................... SUCCESS [3.702s]
[INFO] Camel :: Jasypt ....................................... SUCCESS [2.404s]
[INFO] Camel :: JCR .......................................... SUCCESS [2.563s]
[INFO] Camel :: JDBC ......................................... SUCCESS [2.113s]
[INFO] Camel :: Jibx ......................................... SUCCESS [9.092s]
[INFO] Camel :: Jing ......................................... SUCCESS [2.228s]
[INFO] Camel :: JMX .......................................... SUCCESS [3.926s]
[INFO] Camel :: JoSQL ........................................ SUCCESS [2.563s]
[INFO] Camel :: JPA .......................................... SUCCESS [3.962s]
[INFO] Camel :: Java Toolbox for AS/400 ...................... SUCCESS [2.446s]
[INFO] Camel :: Kestrel ...................................... SUCCESS [2.154s]
[INFO] Camel :: LDAP ......................................... SUCCESS [3.060s]
[INFO] Camel :: Lucene ....................................... SUCCESS [2.310s]
[INFO] Camel :: Mail ......................................... SUCCESS [2.772s]
[INFO] Camel :: MSV .......................................... SUCCESS [2.938s]
[INFO] Camel :: MVEL ......................................... SUCCESS [1.857s]
[INFO] Camel :: MyBatis ...................................... SUCCESS [3.048s]
[INFO] Camel :: Nagios ....................................... SUCCESS [1.978s]
[INFO] Camel :: Netty ........................................ SUCCESS [2.787s]
[INFO] Camel :: OGNL ......................................... SUCCESS [2.306s]
[INFO] Camel :: Pax Logging .................................. SUCCESS [1.211s]
[INFO] Camel :: Printer ...................................... SUCCESS [2.036s]
[INFO] Camel :: Protobuf ..................................... SUCCESS [2.313s]
[INFO] Camel :: Quartz ....................................... SUCCESS [2.590s]
[INFO] Camel :: QuickFIX/J ................................... SUCCESS [3.124s]
[INFO] Camel :: Restlet ...................................... SUCCESS [2.505s]
[INFO] Camel :: RMI .......................................... SUCCESS [2.350s]
[INFO] Camel :: Routebox ..................................... SUCCESS [2.266s]
[INFO] Camel :: Ruby ......................................... SUCCESS [2.454s]
[INFO] Camel :: RSS .......................................... SUCCESS [2.824s]
[INFO] Camel :: SAXON ........................................ SUCCESS [2.659s]
[INFO] Camel :: Script ....................................... SUCCESS [2.390s]
[INFO] Camel :: Shiro ........................................ SUCCESS [1.940s]
[INFO] Camel :: SIP .......................................... SUCCESS [2.143s]
[INFO] Camel :: SMPP ......................................... SUCCESS [2.671s]
[INFO] Camel :: SNMP ......................................... SUCCESS [2.194s]
[INFO] Camel :: SOAP ......................................... SUCCESS [7.245s]
[INFO] Camel :: Spring Integration ........................... SUCCESS [2.403s]
[INFO] Camel :: Spring Security .............................. SUCCESS [2.450s]
[INFO] Camel :: Spring Web Services .......................... SUCCESS [3.055s]
[INFO] Camel :: SQL .......................................... SUCCESS [2.683s]
[INFO] Camel :: StringTemplate ............................... SUCCESS [2.030s]
[INFO] Camel :: Syslog ....................................... SUCCESS [2.491s]
[INFO] Camel :: TagSoup ...................................... SUCCESS [1.984s]
[INFO] Camel :: XMLBeans ..................................... SUCCESS [2.996s]
[INFO] Camel :: XML Security ................................. SUCCESS [2.400s]
[INFO] Camel :: XMPP ......................................... SUCCESS [2.313s]
[INFO] Camel :: XStream ...................................... SUCCESS [2.197s]
[INFO] Camel :: Platforms .................................... SUCCESS [0.335s]
[INFO] Camel :: Platforms :: Apache Karaf .................... SUCCESS [0.266s]
[INFO] Camel :: Platforms :: Apache Karaf :: Commands ........ SUCCESS [1.636s]
[INFO] Camel :: Platforms :: Apache Karaf :: Features ........ SUCCESS [0.539s]
[INFO] Camel :: Maven Plugins ................................ SUCCESS [0.584s]
[INFO] Camel :: Maven Camel Plugin ........................... SUCCESS [3.148s]
[INFO] Camel :: Maven Guice Plugin ........................... SUCCESS [2.137s]
[INFO] Camel :: Html to Pdf Plugin ........................... SUCCESS [1.778s]
[INFO] Camel :: Archetypes ................................... SUCCESS [0.307s]
[INFO] Camel :: Archetypes :: Camel Router with ActiveMQ ..... SUCCESS [1.886s]
[INFO] Camel :: Archetypes :: Blueprint (OSGi) Based Router .. SUCCESS [0.509s]
[INFO] Camel :: Archetypes :: Component ...................... SUCCESS [0.650s]
[INFO] Camel :: Archetypes :: Router ......................... SUCCESS [0.464s]
[INFO] Camel :: Archetypes :: Scala Router ................... SUCCESS [0.393s]
[INFO] Camel :: Archetypes :: Spring XML Based Router ........ SUCCESS [0.364s]
[INFO] Camel :: Archetypes :: Spring DM (OSGi) Based Router .. SUCCESS [0.452s]
[INFO] Camel :: Archetypes :: Camel Routes WAR ............... SUCCESS [0.480s]
[INFO] Camel :: Archetypes :: Camel Router with web console .. SUCCESS [0.383s]
[INFO] Camel :: Manual ....................................... SUCCESS [2.872s]
[INFO] Camel :: Tooling ...................................... SUCCESS [0.244s]
[INFO] Camel :: Tests Bundles ................................ SUCCESS [2.143s]
[INFO] Camel :: Test Bundles: mock-javamail-1.7 .............. SUCCESS [1.565s]
[INFO] Camel :: Integration Tests :: Standalone .............. SUCCESS [1.629s]
[INFO] Camel :: Integration Tests ............................ SUCCESS [17.298s]
[INFO] Camel :: Partial Classpath Tests ...................... SUCCESS [1.985s]
[INFO] Camel :: OSGi Integration Tests ....................... SUCCESS [18.927s]
[INFO] Camel :: Tests ........................................ SUCCESS [0.272s]
[INFO] Camel :: Examples ..................................... SUCCESS [0.252s]
[INFO] Camel :: Example :: Aggregate ......................... SUCCESS [1.306s]
[INFO] Camel :: Example :: Axis .............................. SUCCESS [4.969s]
[INFO] Camel :: Example :: BAM ............................... SUCCESS [1.795s]
[INFO] Camel :: Example :: Cafe .............................. SUCCESS [2.220s]
[INFO] Camel :: Example :: CXF ............................... SUCCESS [6.384s]
[INFO] Camel :: Example :: CXF :: Blueprint .................. SUCCESS [5.111s]
[INFO] Camel :: Example :: CXF :: OSGI ....................... SUCCESS [5.240s]
[INFO] Camel :: Example :: CXF Proxy ......................... SUCCESS [5.338s]
[INFO] Camel :: Example :: CXF Tomcat ........................ SUCCESS [3.245s]
[INFO] Camel :: Example :: Docs .............................. SUCCESS [2.133s]
[INFO] Camel :: Example :: ETL ............................... SUCCESS [5.542s]
[INFO] Camel :: Example :: GAE ............................... SUCCESS [6.442s]
[INFO] Camel :: Example :: GAuth ............................. SUCCESS [7.653s]
[INFO] Camel :: Example :: Guice :: JMS ...................... SUCCESS [2.053s]
[INFO] Camel :: Example :: JMX ............................... SUCCESS [1.425s]
[INFO] Camel :: Example :: JMS-File .......................... SUCCESS [1.986s]
[INFO] Camel :: Example :: Loadbalancer camel-mina ........... SUCCESS [1.541s]
[INFO] Camel :: Example :: Loan-Broker ....................... SUCCESS [2.711s]
[INFO] Camel :: Example :: Management ........................ SUCCESS [1.906s]
[INFO] Camel :: Example :: OSGi .............................. SUCCESS [1.318s]
[INFO] Camel :: Example :: OSGi RMI .......................... SUCCESS [1.970s]
[INFO] Camel :: Example :: POJO Messaging .................... SUCCESS [2.014s]
[INFO] Camel :: Example :: Report Incident ................... SUCCESS [8.556s]
[INFO] Camel :: Example :: Report Incident :: WS-Security .... SUCCESS [5.900s]
[INFO] Camel :: Example :: Route :: Throttling ............... SUCCESS [1.341s]
[INFO] Camel :: Example :: Servlet Tomcat .................... SUCCESS [1.641s]
[INFO] Camel :: Example :: Simple Jira Bot ................... SUCCESS [0.551s]
[INFO] Camel :: Example :: Simple Jira Bot :: Java DSL ....... SUCCESS [1.316s]
[INFO] Camel :: Example :: Simple Jira Bot :: XML Configuration SUCCESS [0.822s]
[INFO] Camel :: Example :: Spring ............................ SUCCESS [1.899s]
[INFO] Camel :: Example :: Spring :: JavaConfig .............. SUCCESS [2.097s]
[INFO] Camel :: Example :: Spring :: JMS ..................... SUCCESS [2.124s]
[INFO] Camel :: Example :: Spring Web Services ............... SUCCESS [2.995s]
[INFO] Camel :: Example :: Spring :: XQuery .................. SUCCESS [0.629s]
[INFO] Camel :: Example :: Spring Security ................... SUCCESS [2.194s]
[INFO] Camel :: Example :: Tracer ............................ SUCCESS [1.470s]
[INFO] Camel :: Assembly ..................................... SUCCESS [3:08.513s]
[INFO] ------------------------------------------------------------------------
[INFO] Error for project: Camel :: Web (during install)
[INFO] ------------------------------------------------------------------------
[INFO] Compilation failure
error: error reading <https://builds.apache.org/job/Camel/ws/.repository/org/codehaus/jackson/jackson-xc/1.7.1/jackson-xc-1.7.1.jar;> error in opening zip file
[INFO] ------------------------------------------------------------------------
[INFO] Trace
org.apache.maven.BuildFailureException: Compilation failure
error: error reading <https://builds.apache.org/job/Camel/ws/.repository/org/codehaus/jackson/jackson-xc/1.7.1/jackson-xc-1.7.1.jar;> error in opening zip file
at org.apache.maven.lifecycle.DefaultLifecycleExecutor.executeGoals(DefaultLifecycleExecutor.java:715)
at org.apache.maven.lifecycle.DefaultLifecycleExecutor.executeGoalWithLifecycle(DefaultLifecycleExecutor.java:556)
at org.apache.maven.lifecycle.DefaultLifecycleExecutor.executeGoal(DefaultLifecycleExecutor.java:535)
at org.apache.maven.lifecycle.DefaultLifecycleExecutor.executeGoalAndHandleFailures(DefaultLifecycleExecutor.java:387)
at org.apache.maven.lifecycle.DefaultLifecycleExecutor.executeTaskSegments(DefaultLifecycleExecutor.java:348)
at org.apache.maven.lifecycle.DefaultLifecycleExecutor.execute(DefaultLifecycleExecutor.java:180)
at org.apache.maven.lifecycle.LifecycleExecutorInterceptor.execute(LifecycleExecutorInterceptor.java:65)
at org.apache.maven.DefaultMaven.doExecute(DefaultMaven.java:328)
at org.apache.maven.DefaultMaven.execute(DefaultMaven.java:138)
at org.apache.maven.cli.MavenCli.main(MavenCli.java:362)
at sun.reflect.NativeMethodAccessorImpl.invoke0(Native Method)
at sun.reflect.NativeMethodAccessorImpl.invoke(NativeMethodAccessorImpl.java:39)
at sun.reflect.DelegatingMethodAccessorImpl.invoke(DelegatingMethodAccessorImpl.java:25)
at java.lang.reflect.Method.invoke(Method.java:597)
at org.codehaus.classworlds.Launcher.launchEnhanced(Launcher.java:315)
at org.codehaus.classworlds.Launcher.launch(Launcher.java:255)
at hudson.maven.agent.Main.launch(Main.java:185)
at hudson.maven.MavenBuilder.call(MavenBuilder.java:164)
at hudson.maven.MavenModuleSetBuild$Builder.call(MavenModuleSetBuild.java:987)
at hudson.maven.MavenModuleSetBuild$Builder.call(MavenModuleSetBuild.java:918)
at hudson.remoting.UserRequest.perform(UserRequest.java:118)
at hudson.remoting.UserRequest.perform(UserRequest.java:48)
at hudson.remoting.Request$2.run(Request.java:270)
at java.util.concurrent.Executors$RunnableAdapter.call(Executors.java:441)
at java.util.concurrent.FutureTask$Sync.innerRun(FutureTask.java:303)
at java.util.concurrent.FutureTask.run(FutureTask.java:138)
at java.util.concurrent.ThreadPoolExecutor$Worker.runTask(ThreadPoolExecutor.java:886)
at java.util.concurrent.ThreadPoolExecutor$Worker.run(ThreadPoolExecutor.java:908)
at java.lang.Thread.run(Thread.java:619)
Caused by: org.apache.maven.plugin.CompilationFailureException: Compilation failure
error: error reading <https://builds.apache.org/job/Camel/ws/.repository/org/codehaus/jackson/jackson-xc/1.7.1/jackson-xc-1.7.1.jar;> error in opening zip file
at org.apache.maven.plugin.AbstractCompilerMojo.execute(AbstractCompilerMojo.java:656)
at org.apache.maven.plugin.CompilerMojo.execute(CompilerMojo.java:128)
at org.apache.maven.plugin.DefaultPluginManager.executeMojo(DefaultPluginManager.java:490)
at hudson.maven.agent.PluginManagerInterceptor.executeMojo(PluginManagerInterceptor.java:182)
at org.apache.maven.lifecycle.DefaultLifecycleExecutor.executeGoals(DefaultLifecycleExecutor.java:694)
... 28 more
[INFO] ------------------------------------------------------------------------
[INFO] BUILD ERRORS
[INFO] ------------------------------------------------------------------------
[INFO] Total time: 26 minutes 35 seconds
[INFO] Finished at: Sun Jul 10 08:36:21 UTC 2011
[INFO] Final Memory: 234M/656M
[INFO] ------------------------------------------------------------------------
Sending e-mails to: dev@camel.apache.org
channel stopped
[locks-and-latches] Releasing all the locks
[locks-and-latches] All the locks released