You are viewing a plain text version of this content. The canonical link for it is here.
Posted to builds@mesos.apache.org by Apache Jenkins Server <je...@builds.apache.org> on 2016/10/28 23:03:13 UTC
Build failed in Jenkins: mesos-reviewbot #15863
See <https://builds.apache.org/job/mesos-reviewbot/15863/changes>
Changes:
[joris.van.remoortere] Added MESOS-4638 and MESOS-6502 to 1.0.2 CHANGELOG.
------------------------------------------
[...truncated 200847 lines...]
I1028 23:02:39.206504 29452 slave.cpp:208] Mesos agent started on @172.17.0.2:54916
I1028 23:02:39.206485 29447 hierarchical.cpp:1018] Recovered disk(default-role):2048; cpus(*):2; mem(*):2048; ports(*):[31000-32000]; disk(default-role)[id1:path1]:2048 (total: cpus(*):2; mem(*):2048; disk(default-role):2048; ports(*):[31000-32000]; disk(default-role)[id1:path1]:2048, allocated: {}) on agent 9a8df36e-6d74-4b48-b85d-59508b937a83-S0 from framework 9a8df36e-6d74-4b48-b85d-59508b937a83-0000
I1028 23:02:39.206595 29447 hierarchical.cpp:1055] Framework 9a8df36e-6d74-4b48-b85d-59508b937a83-0000 filtered agent 9a8df36e-6d74-4b48-b85d-59508b937a83-S0 for 5secs
I1028 23:02:39.206797 29447 hierarchical.cpp:584] Agent 9a8df36e-6d74-4b48-b85d-59508b937a83-S0 deactivated
I1028 23:02:39.206552 29452 slave.cpp:209] Flags at startup: --acls="" --appc_simple_discovery_uri_prefix="http://" --appc_store_dir="/tmp/mesos/store/appc" --authenticate_http_readonly="true" --authenticate_http_readwrite="true" --authenticatee="crammd5" --authentication_backoff_factor="1secs" --authorizer="local" --cgroups_cpu_enable_pids_and_tids_count="false" --cgroups_enable_cfs="false" --cgroups_hierarchy="/sys/fs/cgroup" --cgroups_limit_swap="false" --cgroups_root="mesos" --container_disk_watch_interval="15secs" --containerizers="mesos" --credential="/tmp/DiskResource_PersistentVolumeTest_IncompatibleCheckpointedResources_0_Bddauy/credential" --default_role="*" --disk_watch_interval="1mins" --docker="docker" --docker_kill_orphans="true" --docker_registry="https://registry-1.docker.io" --docker_remove_delay="6hrs" --docker_socket="/var/run/docker.sock" --docker_stop_timeout="0ns" --docker_store_dir="/tmp/mesos/store/docker" --docker_volume_checkpoint_dir="/var/run/mesos/isolators/docker/volume" --enforce_container_disk_quota="false" --executor_registration_timeout="1mins" --executor_shutdown_grace_period="5secs" --fetcher_cache_dir="/tmp/DiskResource_PersistentVolumeTest_IncompatibleCheckpointedResources_0_Bddauy/fetch" --fetcher_cache_size="2GB" --frameworks_home="" --gc_delay="1weeks" --gc_disk_headroom="0.1" --hadoop_home="" --help="false" --hostname_lookup="true" --http_authenticators="basic" --http_command_executor="false" --http_credentials="/tmp/DiskResource_PersistentVolumeTest_IncompatibleCheckpointedResources_0_Bddauy/http_credentials" --image_provisioner_backend="copy" --initialize_driver_logging="true" --isolation="posix/cpu,posix/mem" --launcher="posix" --launcher_dir="/mesos/mesos-1.2.0/_build/src" --logbufsecs="0" --logging_level="INFO" --max_completed_executors_per_framework="150" --oversubscribed_resources_interval="15secs" --perf_duration="10secs" --perf_interval="1mins" --qos_correction_interval_min="0ns" --quiet="false" --recover="reconnect" --recovery_timeout="15mins" --registration_backoff_factor="10ms" --resources="disk:1024" --revocable_cpu_low_priority="true" --runtime_dir="/tmp/DiskResource_PersistentVolumeTest_IncompatibleCheckpointedResources_0_Bddauy" --sandbox_directory="/mnt/mesos/sandbox" --strict="true" --switch_user="true" --systemd_enable_support="true" --systemd_runtime_directory="/run/systemd/system" --version="false" --work_dir="/tmp/DiskResource_PersistentVolumeTest_IncompatibleCheckpointedResources_0_YKUvbr"
I1028 23:02:39.207093 29452 credentials.hpp:86] Loading credential for authentication from '/tmp/DiskResource_PersistentVolumeTest_IncompatibleCheckpointedResources_0_Bddauy/credential'
I1028 23:02:39.207258 29452 slave.cpp:346] Agent using credential for: test-principal
I1028 23:02:39.207280 29452 credentials.hpp:37] Loading credentials for authentication from '/tmp/DiskResource_PersistentVolumeTest_IncompatibleCheckpointedResources_0_Bddauy/http_credentials'
I1028 23:02:39.207542 29452 http.cpp:887] Using default 'basic' HTTP authenticator for realm 'mesos-agent-readonly'
I1028 23:02:39.207700 29452 http.cpp:887] Using default 'basic' HTTP authenticator for realm 'mesos-agent-readwrite'
I1028 23:02:39.208843 29452 slave.cpp:533] Agent resources: disk(*):1024; cpus(*):16; mem(*):47270; ports(*):[31000-32000]
I1028 23:02:39.208940 29452 slave.cpp:541] Agent attributes: [ ]
I1028 23:02:39.208953 29452 slave.cpp:546] Agent hostname: 866f3de28f74
I1028 23:02:39.210580 29450 state.cpp:57] Recovering state from '/tmp/DiskResource_PersistentVolumeTest_IncompatibleCheckpointedResources_0_YKUvbr/meta'
I1028 23:02:39.210999 29450 state.cpp:88] Agent host rebooted
I1028 23:02:39.212407 29458 slave.cpp:787] Agent terminating
I1028 23:02:39.212555 29427 sched.cpp:2002] Asked to stop the driver
I1028 23:02:39.212898 29460 sched.cpp:1187] Stopping framework 9a8df36e-6d74-4b48-b85d-59508b937a83-0000
I1028 23:02:39.213279 29461 master.cpp:7155] Processing TEARDOWN call for framework 9a8df36e-6d74-4b48-b85d-59508b937a83-0000 (default) at scheduler-e534a6fa-8f94-40e8-87e3-87b09772e507@172.17.0.2:54916
I1028 23:02:39.213318 29461 master.cpp:7167] Removing framework 9a8df36e-6d74-4b48-b85d-59508b937a83-0000 (default) at scheduler-e534a6fa-8f94-40e8-87e3-87b09772e507@172.17.0.2:54916
I1028 23:02:39.213783 29448 hierarchical.cpp:386] Deactivated framework 9a8df36e-6d74-4b48-b85d-59508b937a83-0000
I1028 23:02:39.214108 29454 hierarchical.cpp:337] Removed framework 9a8df36e-6d74-4b48-b85d-59508b937a83-0000
I1028 23:02:39.218427 29427 master.cpp:1097] Master terminating
I1028 23:02:39.219563 29450 hierarchical.cpp:517] Removed agent 9a8df36e-6d74-4b48-b85d-59508b937a83-S0
[ OK ] DiskResource/PersistentVolumeTest.IncompatibleCheckpointedResources/0 (93 ms)
[ RUN ] DiskResource/PersistentVolumeTest.IncompatibleCheckpointedResources/1
I1028 23:02:39.229898 29427 cluster.cpp:158] Creating default 'local' authorizer
I1028 23:02:39.233109 29427 leveldb.cpp:174] Opened db in 2.910858ms
I1028 23:02:39.233893 29427 leveldb.cpp:181] Compacted db in 748274ns
I1028 23:02:39.233947 29427 leveldb.cpp:196] Created db iterator in 21050ns
I1028 23:02:39.233968 29427 leveldb.cpp:202] Seeked to beginning of db in 2575ns
I1028 23:02:39.233979 29427 leveldb.cpp:271] Iterated through 0 keys in the db in 473ns
I1028 23:02:39.234016 29427 replica.cpp:776] Replica recovered with log positions 0 -> 0 with 1 holes and 0 unlearned
I1028 23:02:39.234581 29456 recover.cpp:451] Starting replica recovery
I1028 23:02:39.234968 29460 recover.cpp:477] Replica is in EMPTY status
I1028 23:02:39.236245 29458 replica.cpp:673] Replica in EMPTY status received a broadcasted recover request from __req_res__(7515)@172.17.0.2:54916
I1028 23:02:39.236758 29449 recover.cpp:197] Received a recover response from a replica in EMPTY status
I1028 23:02:39.237360 29453 recover.cpp:568] Updating replica status to STARTING
I1028 23:02:39.238224 29447 leveldb.cpp:304] Persisting metadata (8 bytes) to leveldb took 655325ns
I1028 23:02:39.238255 29447 replica.cpp:320] Persisted replica status to STARTING
I1028 23:02:39.238324 29446 master.cpp:380] Master 3c091598-975e-405f-bb8e-46df66c244c1 (866f3de28f74) started on 172.17.0.2:54916
I1028 23:02:39.238591 29454 recover.cpp:477] Replica is in STARTING status
I1028 23:02:39.238349 29446 master.cpp:382] Flags at startup: --acls="" --agent_ping_timeout="15secs" --agent_reregister_timeout="10mins" --allocation_interval="1secs" --allocator="HierarchicalDRF" --authenticate_agents="true" --authenticate_frameworks="true" --authenticate_http_frameworks="true" --authenticate_http_readonly="true" --authenticate_http_readwrite="true" --authenticators="crammd5" --authorizers="local" --credentials="/tmp/dxRhZ1/credentials" --framework_sorter="drf" --help="false" --hostname_lookup="true" --http_authenticators="basic" --http_framework_authenticators="basic" --initialize_driver_logging="true" --log_auto_initialize="true" --logbufsecs="0" --logging_level="INFO" --max_agent_ping_timeouts="5" --max_completed_frameworks="50" --max_completed_tasks_per_framework="1000" --quiet="false" --recovery_agent_removal_limit="100%" --registry="replicated_log" --registry_fetch_timeout="1mins" --registry_gc_interval="15mins" --registry_max_agent_age="2weeks" --registry_max_agent_count="102400" --registry_store_timeout="100secs" --registry_strict="false" --root_submissions="true" --user_sorter="drf" --version="false" --webui_dir="/mesos/mesos-1.2.0/_inst/share/mesos/webui" --work_dir="/tmp/dxRhZ1/master" --zk_session_timeout="10secs"
I1028 23:02:39.238804 29446 master.cpp:432] Master only allowing authenticated frameworks to register
I1028 23:02:39.238827 29446 master.cpp:446] Master only allowing authenticated agents to register
I1028 23:02:39.238837 29446 master.cpp:459] Master only allowing authenticated HTTP frameworks to register
I1028 23:02:39.238845 29446 credentials.hpp:37] Loading credentials for authentication from '/tmp/dxRhZ1/credentials'
I1028 23:02:39.239148 29446 master.cpp:504] Using default 'crammd5' authenticator
I1028 23:02:39.239289 29446 http.cpp:887] Using default 'basic' HTTP authenticator for realm 'mesos-master-readonly'
I1028 23:02:39.239504 29446 http.cpp:887] Using default 'basic' HTTP authenticator for realm 'mesos-master-readwrite'
I1028 23:02:39.239811 29446 http.cpp:887] Using default 'basic' HTTP authenticator for realm 'mesos-master-scheduler'
I1028 23:02:39.239899 29460 replica.cpp:673] Replica in STARTING status received a broadcasted recover request from __req_res__(7516)@172.17.0.2:54916
I1028 23:02:39.240178 29446 master.cpp:584] Authorization enabled
I1028 23:02:39.240203 29451 recover.cpp:197] Received a recover response from a replica in STARTING status
I1028 23:02:39.240556 29449 hierarchical.cpp:149] Initialized hierarchical allocator process
I1028 23:02:39.240556 29448 whitelist_watcher.cpp:77] No whitelist given
I1028 23:02:39.240787 29447 recover.cpp:568] Updating replica status to VOTING
I1028 23:02:39.241377 29455 leveldb.cpp:304] Persisting metadata (8 bytes) to leveldb took 319527ns
I1028 23:02:39.241405 29455 replica.cpp:320] Persisted replica status to VOTING
I1028 23:02:39.241524 29454 recover.cpp:582] Successfully joined the Paxos group
I1028 23:02:39.241799 29454 recover.cpp:466] Recover process terminated
I1028 23:02:39.243283 29455 master.cpp:2033] Elected as the leading master!
I1028 23:02:39.243310 29455 master.cpp:1560] Recovering from registrar
I1028 23:02:39.243475 29451 registrar.cpp:329] Recovering registrar
I1028 23:02:39.244308 29457 log.cpp:553] Attempting to start the writer
I1028 23:02:39.246224 29450 replica.cpp:493] Replica received implicit promise request from __req_res__(7517)@172.17.0.2:54916 with proposal 1
I1028 23:02:39.246768 29450 leveldb.cpp:304] Persisting metadata (8 bytes) to leveldb took 507549ns
I1028 23:02:39.246798 29450 replica.cpp:342] Persisted promised to 1
I1028 23:02:39.247998 29453 coordinator.cpp:238] Coordinator attempting to fill missing positions
I1028 23:02:39.250037 29459 replica.cpp:388] Replica received explicit promise request from __req_res__(7518)@172.17.0.2:54916 for position 0 with proposal 2
I1028 23:02:39.250527 29459 leveldb.cpp:341] Persisting action (8 bytes) to leveldb took 442339ns
I1028 23:02:39.250565 29459 replica.cpp:708] Persisted action NOP at position 0
I1028 23:02:39.252225 29451 replica.cpp:537] Replica received write request for position 0 from __req_res__(7519)@172.17.0.2:54916
I1028 23:02:39.252303 29451 leveldb.cpp:436] Reading position from leveldb took 35517ns
I1028 23:02:39.252831 29451 leveldb.cpp:341] Persisting action (14 bytes) to leveldb took 478191ns
I1028 23:02:39.252864 29451 replica.cpp:708] Persisted action NOP at position 0
I1028 23:02:39.253608 29450 replica.cpp:691] Replica received learned notice for position 0 from @0.0.0.0:0
I1028 23:02:39.253840 29450 leveldb.cpp:341] Persisting action (16 bytes) to leveldb took 193388ns
I1028 23:02:39.253875 29450 replica.cpp:708] Persisted action NOP at position 0
I1028 23:02:39.254778 29459 log.cpp:569] Writer started with ending position 0
I1028 23:02:39.256072 29454 leveldb.cpp:436] Reading position from leveldb took 35819ns
I1028 23:02:39.257496 29461 registrar.cpp:362] Successfully fetched the registry (0B) in 13.963776ms
I1028 23:02:39.257601 29461 registrar.cpp:461] Applied 1 operations in 16982ns; attempting to update the registry
I1028 23:02:39.258558 29456 log.cpp:577] Attempting to append 168 bytes to the log
I1028 23:02:39.258682 29448 coordinator.cpp:348] Coordinator attempting to write APPEND action at position 1
I1028 23:02:39.260056 29456 replica.cpp:537] Replica received write request for position 1 from __req_res__(7520)@172.17.0.2:54916
I1028 23:02:39.260565 29456 leveldb.cpp:341] Persisting action (187 bytes) to leveldb took 460926ns
I1028 23:02:39.260596 29456 replica.cpp:708] Persisted action APPEND at position 1
I1028 23:02:39.261396 29456 replica.cpp:691] Replica received learned notice for position 1 from @0.0.0.0:0
I1028 23:02:39.261615 29456 leveldb.cpp:341] Persisting action (189 bytes) to leveldb took 182456ns
I1028 23:02:39.261641 29456 replica.cpp:708] Persisted action APPEND at position 1
I1028 23:02:39.262970 29451 registrar.cpp:506] Successfully updated the registry in 5.30688ms
I1028 23:02:39.263119 29451 registrar.cpp:392] Successfully recovered registrar
I1028 23:02:39.263229 29453 log.cpp:596] Attempting to truncate the log to 1
I1028 23:02:39.263380 29457 coordinator.cpp:348] Coordinator attempting to write TRUNCATE action at position 2
I1028 23:02:39.263841 29450 master.cpp:1676] Recovered 0 agents from the registry (129B); allowing 10mins for agents to re-register
I1028 23:02:39.263947 29456 hierarchical.cpp:176] Skipping recovery of hierarchical allocator: nothing to recover
I1028 23:02:39.264750 29454 replica.cpp:537] Replica received write request for position 2 from __req_res__(7521)@172.17.0.2:54916
I1028 23:02:39.265225 29454 leveldb.cpp:341] Persisting action (16 bytes) to leveldb took 435250ns
I1028 23:02:39.265256 29454 replica.cpp:708] Persisted action TRUNCATE at position 2
I1028 23:02:39.265990 29448 replica.cpp:691] Replica received learned notice for position 2 from @0.0.0.0:0
I1028 23:02:39.266183 29448 leveldb.cpp:341] Persisting action (18 bytes) to leveldb took 156417ns
I1028 23:02:39.266243 29448 leveldb.cpp:399] Deleting ~1 keys from leveldb took 32554ns
I1028 23:02:39.266264 29448 replica.cpp:708] Persisted action TRUNCATE at position 2
I1028 23:02:39.272210 29452 slave.cpp:208] Mesos agent started on @172.17.0.2:54916
I1028 23:02:39.272235 29452 slave.cpp:209] Flags at startup: --acls="" --appc_simple_discovery_uri_prefix="http://" --appc_store_dir="/tmp/mesos/store/appc" --authenticate_http_readonly="true" --authenticate_http_readwrite="true" --authenticatee="crammd5" --authentication_backoff_factor="1secs" --authorizer="local" --cgroups_cpu_enable_pids_and_tids_count="false" --cgroups_enable_cfs="false" --cgroups_hierarchy="/sys/fs/cgroup" --cgroups_limit_swap="false" --cgroups_root="mesos" --container_disk_watch_interval="15secs" --containerizers="mesos" --credential="/tmp/DiskResource_PersistentVolumeTest_IncompatibleCheckpointedResources_1_WcbMwo/credential" --default_role="*" --disk_watch_interval="1mins" --docker="docker" --docker_kill_orphans="true" --docker_registry="https://registry-1.docker.io" --docker_remove_delay="6hrs" --docker_socket="/var/run/docker.sock" --docker_stop_timeout="0ns" --docker_store_dir="/tmp/mesos/store/docker" --docker_volume_checkpoint_dir="/var/run/mesos/isolators/docker/volume" --enforce_container_disk_quota="false" --executor_registration_timeout="1mins" --executor_shutdown_grace_period="5secs" --fetcher_cache_dir="/tmp/DiskResource_PersistentVolumeTest_IncompatibleCheckpointedResources_1_WcbMwo/fetch" --fetcher_cache_size="2GB" --frameworks_home="" --gc_delay="1weeks" --gc_disk_headroom="0.1" --hadoop_home="" --help="false" --hostname_lookup="true" --http_authenticators="basic" --http_command_executor="false" --http_credentials="/tmp/DiskResource_PersistentVolumeTest_IncompatibleCheckpointedResources_1_WcbMwo/http_credentials" --image_provisioner_backend="copy" --initialize_driver_logging="true" --isolation="posix/cpu,posix/mem" --launcher="posix" --launcher_dir="/mesos/mesos-1.2.0/_build/src" --logbufsecs="0" --logging_level="INFO" --max_completed_executors_per_framework="150" --oversubscribed_resources_interval="15secs" --perf_duration="10secs" --perf_interval="1mins" --qos_correction_interval_min="0ns" --quiet="false" --recover="reconnect" --recovery_timeout="15mins" --registration_backoff_factor="10ms" --resources="[{"name":"cpus","role":"*","scalar":{"value":2.0},"type":"SCALAR"},{"name":"mem","role":"*","scalar":{"value":2048.0},"type":"SCALAR"},{"disk":{"source":{"path":{"root":"\/tmp\/DiskResource_PersistentVolumeTest_IncompatibleCheckpointedResources_1_cMgHq9\/disk1"},"type":"PATH"}},"name":"disk","role":"default-role","scalar":{"value":2048.0},"type":"SCALAR"},{"disk":{"source":{"path":{"root":"\/tmp\/DiskResource_PersistentVolumeTest_IncompatibleCheckpointedResources_1_cMgHq9\/disk2"},"type":"PATH"}},"name":"disk","role":"default-role","scalar":{"value":2048.0},"type":"SCALAR"}]" --revocable_cpu_low_priority="true" --runtime_dir="/tmp/DiskResource_PersistentVolumeTest_IncompatibleCheckpointedResources_1_WcbMwo" --sandbox_directory="/mnt/mesos/sandbox" --strict="true" --switch_user="true" --systemd_enable_support="true" --systemd_runtime_directory="/run/systemd/system" --version="false" --work_dir="/tmp/DiskResource_PersistentVolumeTest_IncompatibleCheckpointedResources_1_X64IYg"
I1028 23:02:39.272871 29452 credentials.hpp:86] Loading credential for authentication from '/tmp/DiskResource_PersistentVolumeTest_IncompatibleCheckpointedResources_1_WcbMwo/credential'
I1028 23:02:39.273066 29452 slave.cpp:346] Agent using credential for: test-principal
I1028 23:02:39.273088 29452 credentials.hpp:37] Loading credentials for authentication from '/tmp/DiskResource_PersistentVolumeTest_IncompatibleCheckpointedResources_1_WcbMwo/http_credentials'
I1028 23:02:39.273257 29427 sched.cpp:226] Version: 1.2.0
I1028 23:02:39.273365 29452 http.cpp:887] Using default 'basic' HTTP authenticator for realm 'mesos-agent-readonly'
I1028 23:02:39.273699 29452 http.cpp:887] Using default 'basic' HTTP authenticator for realm 'mesos-agent-readwrite'
I1028 23:02:39.273921 29461 sched.cpp:330] New master detected at master@172.17.0.2:54916
I1028 23:02:39.274029 29461 sched.cpp:396] Authenticating with master master@172.17.0.2:54916
I1028 23:02:39.274049 29461 sched.cpp:403] Using default CRAM-MD5 authenticatee
I1028 23:02:39.274302 29455 authenticatee.cpp:121] Creating new client SASL connection
I1028 23:02:39.274646 29456 master.cpp:6742] Authenticating scheduler-44c42e7a-2eab-4811-85ea-f17244f26c1f@172.17.0.2:54916
I1028 23:02:39.274811 29454 authenticator.cpp:414] Starting authentication session for crammd5-authenticatee(1155)@172.17.0.2:54916
I1028 23:02:39.275132 29453 authenticator.cpp:98] Creating new server SASL connection
I1028 23:02:39.275403 29447 authenticatee.cpp:213] Received SASL authentication mechanisms: CRAM-MD5
I1028 23:02:39.275437 29447 authenticatee.cpp:239] Attempting to authenticate with mechanism 'CRAM-MD5'
I1028 23:02:39.275535 29447 authenticator.cpp:204] Received SASL authentication start
I1028 23:02:39.275605 29447 authenticator.cpp:326] Authentication requires more steps
I1028 23:02:39.275795 29459 authenticatee.cpp:259] Received SASL authentication step
I1028 23:02:39.275935 29459 authenticator.cpp:232] Received SASL authentication step
I1028 23:02:39.275975 29459 auxprop.cpp:109] Request to lookup properties for user: 'test-principal' realm: '866f3de28f74' server FQDN: '866f3de28f74' SASL_AUXPROP_VERIFY_AGAINST_HASH: false SASL_AUXPROP_OVERRIDE: false SASL_AUXPROP_AUTHZID: false
I1028 23:02:39.275998 29459 auxprop.cpp:181] Looking up auxiliary property '*userPassword'
I1028 23:02:39.276041 29459 auxprop.cpp:181] Looking up auxiliary property '*cmusaslsecretCRAM-MD5'
I1028 23:02:39.276080 29459 auxprop.cpp:109] Request to lookup properties for user: 'test-principal' realm: '866f3de28f74' server FQDN: '866f3de28f74' SASL_AUXPROP_VERIFY_AGAINST_HASH: false SASL_AUXPROP_OVERRIDE: false SASL_AUXPROP_AUTHZID: true
I1028 23:02:39.276103 29459 auxprop.cpp:131] Skipping auxiliary property '*userPassword' since SASL_AUXPROP_AUTHZID == true
I1028 23:02:39.276121 29459 auxprop.cpp:131] Skipping auxiliary property '*cmusaslsecretCRAM-MD5' since SASL_AUXPROP_AUTHZID == true
I1028 23:02:39.276149 29459 authenticator.cpp:318] Authentication success
I1028 23:02:39.276264 29460 authenticatee.cpp:299] Authentication success
I1028 23:02:39.276331 29458 master.cpp:6772] Successfully authenticated principal 'test-principal' at scheduler-44c42e7a-2eab-4811-85ea-f17244f26c1f@172.17.0.2:54916
I1028 23:02:39.276402 29450 authenticator.cpp:432] Authentication session cleanup for crammd5-authenticatee(1155)@172.17.0.2:54916
I1028 23:02:39.276782 29459 sched.cpp:502] Successfully authenticated with master master@172.17.0.2:54916
I1028 23:02:39.276813 29459 sched.cpp:820] Sending SUBSCRIBE call to master@172.17.0.2:54916
I1028 23:02:39.277067 29459 sched.cpp:853] Will retry registration in 997.657328ms if necessary
I1028 23:02:39.277192 29460 master.cpp:2612] Received SUBSCRIBE call for framework 'default' at scheduler-44c42e7a-2eab-4811-85ea-f17244f26c1f@172.17.0.2:54916
I1028 23:02:39.277243 29460 master.cpp:2069] Authorizing framework principal 'test-principal' to receive offers for role 'default-role'
I1028 23:02:39.277189 29452 slave.cpp:533] Agent resources: cpus(*):2; mem(*):2048; disk(default-role)[PATH:/tmp/DiskResource_PersistentVolumeTest_IncompatibleCheckpointedResources_1_cMgHq9/disk1]:2048; disk(default-role)[PATH:/tmp/DiskResource_PersistentVolumeTest_IncompatibleCheckpointedResources_1_cMgHq9/disk2]:2048; ports(*):[31000-32000]
I1028 23:02:39.277339 29452 slave.cpp:541] Agent attributes: [ ]
I1028 23:02:39.277354 29452 slave.cpp:546] Agent hostname: 866f3de28f74
I1028 23:02:39.277669 29456 master.cpp:2688] Subscribing framework default with checkpointing disabled and capabilities [ ]
I1028 23:02:39.278173 29455 sched.cpp:743] Framework registered with 3c091598-975e-405f-bb8e-46df66c244c1-0000
I1028 23:02:39.278179 29458 hierarchical.cpp:275] Added framework 3c091598-975e-405f-bb8e-46df66c244c1-0000
I1028 23:02:39.278242 29455 sched.cpp:757] Scheduler::registered took 38996ns
I1028 23:02:39.278251 29458 hierarchical.cpp:1694] No allocations performed
I1028 23:02:39.278273 29458 hierarchical.cpp:1789] No inverse offers to send out!
I1028 23:02:39.278312 29458 hierarchical.cpp:1286] Performed allocation for 0 agents in 100516ns
I1028 23:02:39.278887 29456 state.cpp:57] Recovering state from '/tmp/DiskResource_PersistentVolumeTest_IncompatibleCheckpointedResources_1_X64IYg/meta'
I1028 23:02:39.279249 29454 status_update_manager.cpp:203] Recovering status update manager
I1028 23:02:39.279546 29446 slave.cpp:5399] Finished recovery
I1028 23:02:39.279892 29446 slave.cpp:5573] Querying resource estimator for oversubscribable resources
I1028 23:02:39.280058 29457 status_update_manager.cpp:177] Pausing sending status updates
I1028 23:02:39.280058 29446 slave.cpp:915] New master detected at master@172.17.0.2:54916
I1028 23:02:39.280091 29446 slave.cpp:974] Authenticating with master master@172.17.0.2:54916
I1028 23:02:39.280135 29446 slave.cpp:985] Using default CRAM-MD5 authenticatee
I1028 23:02:39.280287 29446 slave.cpp:947] Detecting new master
I1028 23:02:39.280299 29459 authenticatee.cpp:121] Creating new client SASL connection
I1028 23:02:39.280580 29454 master.cpp:6742] Authenticating (112)@172.17.0.2:54916
I1028 23:02:39.280700 29448 authenticator.cpp:414] Starting authentication session for crammd5-authenticatee(1156)@172.17.0.2:54916
I1028 23:02:39.280951 29456 authenticator.cpp:98] Creating new server SASL connection
I1028 23:02:39.281260 29453 authenticatee.cpp:213] Received SASL authentication mechanisms: CRAM-MD5
I1028 23:02:39.281282 29453 authenticatee.cpp:239] Attempting to authenticate with mechanism 'CRAM-MD5'
I1028 23:02:39.281360 29453 authenticator.cpp:204] Received SASL authentication start
I1028 23:02:39.281404 29453 authenticator.cpp:326] Authentication requires more steps
I1028 23:02:39.281512 29451 authenticatee.cpp:259] Received SASL authentication step
I1028 23:02:39.281637 29447 authenticator.cpp:232] Received SASL authentication step
I1028 23:02:39.281719 29447 auxprop.cpp:109] Request to lookup properties for user: 'test-principal' realm: '866f3de28f74' server FQDN: '866f3de28f74' SASL_AUXPROP_VERIFY_AGAINST_HASH: false SASL_AUXPROP_OVERRIDE: false SASL_AUXPROP_AUTHZID: false
I1028 23:02:39.281741 29447 auxprop.cpp:181] Looking up auxiliary property '*userPassword'
I1028 23:02:39.281771 29447 auxprop.cpp:181] Looking up auxiliary property '*cmusaslsecretCRAM-MD5'
I1028 23:02:39.281795 29447 auxprop.cpp:109] Request to lookup properties for user: 'test-principal' realm: '866f3de28f74' server FQDN: '866f3de28f74' SASL_AUXPROP_VERIFY_AGAINST_HASH: false SASL_AUXPROP_OVERRIDE: false SASL_AUXPROP_AUTHZID: true
I1028 23:02:39.281807 29447 auxprop.cpp:131] Skipping auxiliary property '*userPassword' since SASL_AUXPROP_AUTHZID == true
I1028 23:02:39.281817 29447 auxprop.cpp:131] Skipping auxiliary property '*cmusaslsecretCRAM-MD5' since SASL_AUXPROP_AUTHZID == true
I1028 23:02:39.281834 29447 authenticator.cpp:318] Authentication success
I1028 23:02:39.281962 29451 authenticatee.cpp:299] Authentication success
I1028 23:02:39.282003 29455 master.cpp:6772] Successfully authenticated principal 'test-principal' at (112)@172.17.0.2:54916
I1028 23:02:39.282047 29448 authenticator.cpp:432] Authentication session cleanup for crammd5-authenticatee(1156)@172.17.0.2:54916
I1028 23:02:39.282366 29459 slave.cpp:1069] Successfully authenticated with master master@172.17.0.2:54916
I1028 23:02:39.282663 29459 slave.cpp:1483] Will retry registration in 16.804383ms if necessary
I1028 23:02:39.282874 29454 master.cpp:5151] Registering agent at (112)@172.17.0.2:54916 (866f3de28f74) with id 3c091598-975e-405f-bb8e-46df66c244c1-S0
I1028 23:02:39.283509 29457 registrar.cpp:461] Applied 1 operations in 110681ns; attempting to update the registry
I1028 23:02:39.284494 29453 log.cpp:577] Attempting to append 579 bytes to the log
I1028 23:02:39.284656 29455 coordinator.cpp:348] Coordinator attempting to write APPEND action at position 3
I1028 23:02:39.285540 29451 replica.cpp:537] Replica received write request for position 3 from __req_res__(7522)@172.17.0.2:54916
I../../src/tests/persistent_volume_tests.cpp:677: Failure
Failed to wait 15secs for offers
../../src/tests/persistent_volume_tests.cpp:671: Failure
Actual function call count doesn't match EXPECT_CALL(sched, resourceOffers(&driver, _))...
Expected: to be called at least once
1028 23:02:39.285747 29451 leveldb.cpp:341] Persisting action (598 bytes) to leveldb took 165247ns
Actual: never called - unsatisfied and active
I1028 23:02:55.045651 29451 replica.cpp:708] Persisted action APPEND at position 3
I1028 23:02:39.300418 29456 slave.cpp:1483] Will retry registration in 23.459526ms if necessary
I1028 23:02:40.240900 29446 hierarchical.cpp:1694] No allocations performed
I1028 23:02:55.046030 29446 hierarchical.cpp:1789] No inverse offers to send out!
I1028 23:02:55.046139 29446 hierarchical.cpp:1286] Performed allocation for 0 agents in 14.80528153secs
I1028 23:02:39.300603 29460 master.cpp:5139] Ignoring register agent message from (112)@172.17.0.2:54916 (866f3de28f74) as admission is already in progress
I1028 23:02:55.048794 29454 replica.cpp:691] Replica received learned notice for position 3 from @0.0.0.0:0
*** Aborted at 1477695775 (unix time) try "date -d @1477695775" if you are using GNU date ***
I1028 23:02:55.049497 29454 leveldb.cpp:341] Persisting action (600 bytes) to leveldb took 655145ns
I1028 23:02:55.049541 29454 replica.cpp:708] Persisted action APPEND at position 3
I1028 23:02:55.050642 29460 master.cpp:1097] Master terminating
I1028 23:02:55.051056 29452 hierarchical.cpp:337] Removed framework 3c091598-975e-405f-bb8e-46df66c244c1-0000
PC: @ 0x0 (unknown)
*** SIGSEGV (@0x0) received by PID 29427 (TID 0x2b0dd97a9700) from PID 0; stack trace: ***
@ 0x2b0e21f882c7 (unknown)
I1028 23:02:55.052789 29456 registrar.cpp:506] Successfully updated the registry in 15.769202944secs
I1028 23:02:55.053230 29453 log.cpp:596] Attempting to truncate the log to 3
I1028 23:02:55.053700 29454 coordinator.cpp:348] Coordinator attempting to write TRUNCATE action at position 4
@ 0x2b0e21f8c5a9 (unknown)
@ 0x2b0dd133c330 (unknown)
make[4]: *** [check-local] Segmentation fault
make[4]: Leaving directory `/mesos/mesos-1.2.0/_build/src'
make[3]: *** [check-am] Error 2
make[3]: Leaving directory `/mesos/mesos-1.2.0/_build/src'
make[2]: *** [check] Error 2
make[2]: Leaving directory `/mesos/mesos-1.2.0/_build/src'
make[1]: *** [check-recursive] Error 1
make[1]: Leaving directory `/mesos/mesos-1.2.0/_build'
make: *** [distcheck] Error 1
+ docker rmi mesos-1477693520-1164
Untagged: mesos-1477693520-1164:latest
Deleted: sha256:2d41dc317200db71c44a6332049d2db661113e3c6fd782a02fc5fab37bdd5824
Deleted: sha256:cd140e3b826acd7231a5acc9013aec48e45e32340ea42a744c61cd2c31c8b56c
Deleted: sha256:fac431cb9c126ff71810a38acdd71c76190fbed935e5e19557e9fe43c5dc62c8
Deleted: sha256:7e062041c570339427678046fe3e0ecf080cb03a764baee1676df89425cde86c
Deleted: sha256:9bf8f8064fba09eaa69ffa8d68990916e6ce93e8199d4bc09f506d83e1753634
Deleted: sha256:da4f12ba7b0c094773ff20cb54920b397cf8044a13b2e3915998cf14a99f445d
Deleted: sha256:5f4ae991c9bda4052bbd0ef49bb5b615388713c08fcac0885d546c30c6c2abc1
Deleted: sha256:73001b545970599ec6f077299a81532270ceb451cb40dee884b9423c952b4fa5
Deleted: sha256:fc9775189465003caabdd422ae8c98693e3886e4cdff79348cc6b4b859b8f9d9
Deleted: sha256:3495308d41aa737c638adf9055623786107652d1bd23537963e31e8bfdde005e
Deleted: sha256:a1d8b889d2fb5def0840bf9c6d7fd7c5c95156b2e2d5f82ef53933d9d555ad39
Deleted: sha256:f1ab9825cbc44b9083166e3f0dcf39894f3c34f42ad11bd4ed7bc0cc41cef2c4
Deleted: sha256:9c355306232a20954e29f292939924182d12ed367c2a14dbfe39859635834c61
Deleted: sha256:7f8d1949b8f2245706043313c57d41181bf2ba8d9fc37f610849d7f4b734b3b8
Deleted: sha256:bfb33400e04d8408e258793db89540d9474a360751faf4c9ce5df36ee099cd3c
Deleted: sha256:5e3f9927ef5248c65f2ff8c513f9fb5fff02df1d2d1486563ae1ec9cd0b288a3
Deleted: sha256:f1c42e9f2879df2aaab758fbd0982390c72e1a9ebddd0f65965a9bc15aaed178
Deleted: sha256:756f2692f2eb469358b49d701a9618e040414ef906dbd98edfb00cf16c77012b
Deleted: sha256:bbe32648931e7d9b0825cafd5d11bb595d872dc9f8fedbf52f5b28c4e8a55f2d
Deleted: sha256:ae7c68e3a10e628091d03ddbbd3d07bdf32fe474b6cfd87def1c3ec640295416
Deleted: sha256:8f945a462088e855aa4ec53e9d78e4a825e0098bca9ad845a6cbbca668e6ea83
Deleted: sha256:11a5f935dd7ab289d526dcbec7aac0ee5b4723e7925f743e68a071597a0bd340
Deleted: sha256:3ce01454dfafe55a2d8169ead5e7d35e455564744570e62afaa62a42c5a52b0a
Deleted: sha256:e898411bc23e3927f5198fa1809c6b1840e8608cdca1c999cbd075003e363773
Build step 'Execute shell' marked build as failure
Build failed in Jenkins: mesos-reviewbot #15864
Posted by Apache Jenkins Server <je...@builds.apache.org>.
See <https://builds.apache.org/job/mesos-reviewbot/15864/changes>
Changes:
[vinodkone] Updated release guide.
------------------------------------------
[...truncated 215343 lines...]
I1028 23:41:29.939218 29419 containerizer.cpp:201] Using isolation: posix/cpu,posix/mem,filesystem/posix,network/cni
W1028 23:41:29.939909 29419 backend.cpp:76] Failed to create 'aufs' backend: AufsBackend requires root privileges, but is running as user mesos
W1028 23:41:29.940152 29419 backend.cpp:76] Failed to create 'bind' backend: BindBackend requires root privileges
I1028 23:41:29.943068 29441 slave.cpp:208] Mesos agent started on (636)@172.17.0.2:58617
I1028 23:41:29.943095 29441 slave.cpp:209] Flags at startup: --acls="" --appc_simple_discovery_uri_prefix="http://" --appc_store_dir="/tmp/mesos/store/appc" --authenticate_http_readonly="true" --authenticate_http_readwrite="true" --authenticatee="crammd5" --authentication_backoff_factor="1secs" --authorizer="local" --cgroups_cpu_enable_pids_and_tids_count="false" --cgroups_enable_cfs="false" --cgroups_hierarchy="/sys/fs/cgroup" --cgroups_limit_swap="false" --cgroups_root="mesos" --container_disk_watch_interval="15secs" --containerizers="mesos" --credential="/tmp/Endpoint_SlaveEndpointTest_AuthorizedRequest_1_UkrT0e/credential" --default_role="*" --disk_watch_interval="1mins" --docker="docker" --docker_kill_orphans="true" --docker_registry="https://registry-1.docker.io" --docker_remove_delay="6hrs" --docker_socket="/var/run/docker.sock" --docker_stop_timeout="0ns" --docker_store_dir="/tmp/mesos/store/docker" --docker_volume_checkpoint_dir="/var/run/mesos/isolators/docker/volume" --enforce_container_disk_quota="false" --executor_registration_timeout="1mins" --executor_shutdown_grace_period="5secs" --fetcher_cache_dir="/tmp/Endpoint_SlaveEndpointTest_AuthorizedRequest_1_UkrT0e/fetch" --fetcher_cache_size="2GB" --frameworks_home="" --gc_delay="1weeks" --gc_disk_headroom="0.1" --hadoop_home="" --help="false" --hostname_lookup="true" --http_authenticators="basic" --http_command_executor="false" --http_credentials="/tmp/Endpoint_SlaveEndpointTest_AuthorizedRequest_1_UkrT0e/http_credentials" --image_provisioner_backend="copy" --initialize_driver_logging="true" --isolation="posix/cpu,posix/mem" --launcher="posix" --launcher_dir="/mesos/mesos-1.2.0/_build/src" --logbufsecs="0" --logging_level="INFO" --max_completed_executors_per_framework="150" --oversubscribed_resources_interval="15secs" --perf_duration="10secs" --perf_interval="1mins" --qos_correction_interval_min="0ns" --quiet="false" --recover="reconnect" --recovery_timeout="15mins" --registration_backoff_factor="10ms" --resources="cpus:2;gpus:0;mem:1024;disk:1024;ports:[31000-32000]" --revocable_cpu_low_priority="true" --runtime_dir="/tmp/Endpoint_SlaveEndpointTest_AuthorizedRequest_1_UkrT0e" --sandbox_directory="/mnt/mesos/sandbox" --strict="true" --switch_user="true" --systemd_enable_support="true" --systemd_runtime_directory="/run/systemd/system" --version="false" --work_dir="/tmp/Endpoint_SlaveEndpointTest_AuthorizedRequest_1_tmuOrj"
I1028 23:41:29.943812 29441 credentials.hpp:86] Loading credential for authentication from '/tmp/Endpoint_SlaveEndpointTest_AuthorizedRequest_1_UkrT0e/credential'
I1028 23:41:29.943992 29441 slave.cpp:346] Agent using credential for: test-principal
I1028 23:41:29.944016 29441 credentials.hpp:37] Loading credentials for authentication from '/tmp/Endpoint_SlaveEndpointTest_AuthorizedRequest_1_UkrT0e/http_credentials'
I1028 23:41:29.944285 29441 http.cpp:887] Using default 'basic' HTTP authenticator for realm 'mesos-agent-readonly'
I1028 23:41:29.944492 29441 http.cpp:887] Using default 'basic' HTTP authenticator for realm 'mesos-agent-readwrite'
I1028 23:41:29.945973 29441 slave.cpp:533] Agent resources: cpus(*):2; mem(*):1024; disk(*):1024; ports(*):[31000-32000]
I1028 23:41:29.946075 29441 slave.cpp:541] Agent attributes: [ ]
I1028 23:41:29.946089 29441 slave.cpp:546] Agent hostname: 08fed81fdb8e
I1028 23:41:29.947696 29447 state.cpp:57] Recovering state from '/tmp/Endpoint_SlaveEndpointTest_AuthorizedRequest_1_tmuOrj/meta'
I1028 23:41:29.948025 29440 status_update_manager.cpp:203] Recovering status update manager
I1028 23:41:29.948575 29448 containerizer.cpp:557] Recovering containerizer
I1028 23:41:29.950162 29452 provisioner.cpp:253] Provisioner recovery complete
I1028 23:41:29.950609 29453 slave.cpp:5399] Finished recovery
I1028 23:41:29.951133 29453 slave.cpp:5573] Querying resource estimator for oversubscribable resources
I1028 23:41:29.951552 29443 slave.cpp:5587] Received oversubscribable resources {} from the resource estimator
I1028 23:41:29.953054 29444 process.cpp:3570] Handling HTTP event for process 'slave(636)' with path: '/slave(636)/monitor/statistics.json'
I1028 23:41:29.954613 29439 http.cpp:839] Authorizing principal 'test-principal' to GET the '/monitor/statistics.json' endpoint
I1028 23:41:29.959734 29441 slave.cpp:787] Agent terminating
[ OK ] Endpoint/SlaveEndpointTest.AuthorizedRequest/1 (30 ms)
[ RUN ] Endpoint/SlaveEndpointTest.AuthorizedRequest/2
I1028 23:41:29.970291 29419 containerizer.cpp:201] Using isolation: posix/cpu,posix/mem,filesystem/posix,network/cni
W1028 23:41:29.970974 29419 backend.cpp:76] Failed to create 'aufs' backend: AufsBackend requires root privileges, but is running as user mesos
W1028 23:41:29.971160 29419 backend.cpp:76] Failed to create 'bind' backend: BindBackend requires root privileges
I1028 23:41:29.974217 29450 slave.cpp:208] Mesos agent started on (637)@172.17.0.2:58617
I1028 23:41:29.974243 29450 slave.cpp:209] Flags at startup: --acls="" --appc_simple_discovery_uri_prefix="http://" --appc_store_dir="/tmp/mesos/store/appc" --authenticate_http_readonly="true" --authenticate_http_readwrite="true" --authenticatee="crammd5" --authentication_backoff_factor="1secs" --authorizer="local" --cgroups_cpu_enable_pids_and_tids_count="false" --cgroups_enable_cfs="false" --cgroups_hierarchy="/sys/fs/cgroup" --cgroups_limit_swap="false" --cgroups_root="mesos" --container_disk_watch_interval="15secs" --containerizers="mesos" --credential="/tmp/Endpoint_SlaveEndpointTest_AuthorizedRequest_2_ICDlyX/credential" --default_role="*" --disk_watch_interval="1mins" --docker="docker" --docker_kill_orphans="true" --docker_registry="https://registry-1.docker.io" --docker_remove_delay="6hrs" --docker_socket="/var/run/docker.sock" --docker_stop_timeout="0ns" --docker_store_dir="/tmp/mesos/store/docker" --docker_volume_checkpoint_dir="/var/run/mesos/isolators/docker/volume" --enforce_container_disk_quota="false" --executor_registration_timeout="1mins" --executor_shutdown_grace_period="5secs" --fetcher_cache_dir="/tmp/Endpoint_SlaveEndpointTest_AuthorizedRequest_2_ICDlyX/fetch" --fetcher_cache_size="2GB" --frameworks_home="" --gc_delay="1weeks" --gc_disk_headroom="0.1" --hadoop_home="" --help="false" --hostname_lookup="true" --http_authenticators="basic" --http_command_executor="false" --http_credentials="/tmp/Endpoint_SlaveEndpointTest_AuthorizedRequest_2_ICDlyX/http_credentials" --image_provisioner_backend="copy" --initialize_driver_logging="true" --isolation="posix/cpu,posix/mem" --launcher="posix" --launcher_dir="/mesos/mesos-1.2.0/_build/src" --logbufsecs="0" --logging_level="INFO" --max_completed_executors_per_framework="150" --oversubscribed_resources_interval="15secs" --perf_duration="10secs" --perf_interval="1mins" --qos_correction_interval_min="0ns" --quiet="false" --recover="reconnect" --recovery_timeout="15mins" --registration_backoff_factor="10ms" --resources="cpus:2;gpus:0;mem:1024;disk:1024;ports:[31000-32000]" --revocable_cpu_low_priority="true" --runtime_dir="/tmp/Endpoint_SlaveEndpointTest_AuthorizedRequest_2_ICDlyX" --sandbox_directory="/mnt/mesos/sandbox" --strict="true" --switch_user="true" --systemd_enable_support="true" --systemd_runtime_directory="/run/systemd/system" --version="false" --work_dir="/tmp/Endpoint_SlaveEndpointTest_AuthorizedRequest_2_hpedU1"
I1028 23:41:29.974853 29450 credentials.hpp:86] Loading credential for authentication from '/tmp/Endpoint_SlaveEndpointTest_AuthorizedRequest_2_ICDlyX/credential'
I1028 23:41:29.975016 29450 slave.cpp:346] Agent using credential for: test-principal
I1028 23:41:29.975040 29450 credentials.hpp:37] Loading credentials for authentication from '/tmp/Endpoint_SlaveEndpointTest_AuthorizedRequest_2_ICDlyX/http_credentials'
I1028 23:41:29.975301 29450 http.cpp:887] Using default 'basic' HTTP authenticator for realm 'mesos-agent-readonly'
I1028 23:41:29.975455 29450 http.cpp:887] Using default 'basic' HTTP authenticator for realm 'mesos-agent-readwrite'
I1028 23:41:29.976800 29450 slave.cpp:533] Agent resources: cpus(*):2; mem(*):1024; disk(*):1024; ports(*):[31000-32000]
I1028 23:41:29.976900 29450 slave.cpp:541] Agent attributes: [ ]
I1028 23:41:29.976914 29450 slave.cpp:546] Agent hostname: 08fed81fdb8e
I1028 23:41:29.978538 29443 state.cpp:57] Recovering state from '/tmp/Endpoint_SlaveEndpointTest_AuthorizedRequest_2_hpedU1/meta'
I1028 23:41:29.978968 29442 status_update_manager.cpp:203] Recovering status update manager
I1028 23:41:29.979229 29438 containerizer.cpp:557] Recovering containerizer
I1028 23:41:29.980679 29444 provisioner.cpp:253] Provisioner recovery complete
I1028 23:41:29.981181 29451 slave.cpp:5399] Finished recovery
I1028 23:41:29.981642 29451 slave.cpp:5573] Querying resource estimator for oversubscribable resources
I1028 23:41:29.981936 29439 slave.cpp:5587] Received oversubscribable resources {} from the resource estimator
I1028 23:41:29.983456 29453 process.cpp:3570] Handling HTTP event for process 'slave(637)' with path: '/slave(637)/containers'
I1028 23:41:29.984622 29452 http.cpp:839] Authorizing principal 'test-principal' to GET the '/containers' endpoint
I1028 23:41:29.988751 29449 slave.cpp:787] Agent terminating
[ OK ] Endpoint/SlaveEndpointTest.AuthorizedRequest/2 (29 ms)
[ RUN ] Endpoint/SlaveEndpointTest.UnauthorizedRequest/0
I1028 23:41:30.000346 29419 containerizer.cpp:201] Using isolation: posix/cpu,posix/mem,filesystem/posix,network/cni
W1028 23:41:30.001052 29419 backend.cpp:76] Failed to create 'aufs' backend: AufsBackend requires root privileges, but is running as user mesos
W1028 23:41:30.001274 29419 backend.cpp:76] Failed to create 'bind' backend: BindBackend requires root privileges
I1028 23:41:30.003991 29450 slave.cpp:208] Mesos agent started on (638)@172.17.0.2:58617
I1028 23:41:30.004022 29450 slave.cpp:209] Flags at startup: --acls="" --appc_simple_discovery_uri_prefix="http://" --appc_store_dir="/tmp/mesos/store/appc" --authenticate_http_readonly="true" --authenticate_http_readwrite="true" --authenticatee="crammd5" --authentication_backoff_factor="1secs" --authorizer="local" --cgroups_cpu_enable_pids_and_tids_count="false" --cgroups_enable_cfs="false" --cgroups_hierarchy="/sys/fs/cgroup" --cgroups_limit_swap="false" --cgroups_root="mesos" --container_disk_watch_interval="15secs" --containerizers="mesos" --credential="/tmp/Endpoint_SlaveEndpointTest_UnauthorizedRequest_0_YWynpG/credential" --default_role="*" --disk_watch_interval="1mins" --docker="docker" --docker_kill_orphans="true" --docker_registry="https://registry-1.docker.io" --docker_remove_delay="6hrs" --docker_socket="/var/run/docker.sock" --docker_stop_timeout="0ns" --docker_store_dir="/tmp/mesos/store/docker" --docker_volume_checkpoint_dir="/var/run/mesos/isolators/docker/volume" --enforce_container_disk_quota="false" --executor_registration_timeout="1mins" --executor_shutdown_grace_period="5secs" --fetcher_cache_dir="/tmp/Endpoint_SlaveEndpointTest_UnauthorizedRequest_0_YWynpG/fetch" --fetcher_cache_size="2GB" --frameworks_home="" --gc_delay="1weeks" --gc_disk_headroom="0.1" --hadoop_home="" --help="false" --hostname_lookup="true" --http_authenticators="basic" --http_command_executor="false" --http_credentials="/tmp/Endpoint_SlaveEndpointTest_UnauthorizedRequest_0_YWynpG/http_credentials" --image_provisioner_backend="copy" --initialize_driver_logging="true" --isolation="posix/cpu,posix/mem" --launcher="posix" --launcher_dir="/mesos/mesos-1.2.0/_build/src" --logbufsecs="0" --logging_level="INFO" --max_completed_executors_per_framework="150" --oversubscribed_resources_interval="15secs" --perf_duration="10secs" --perf_interval="1mins" --qos_correction_interval_min="0ns" --quiet="false" --recover="reconnect" --recovery_timeout="15mins" --registration_backoff_factor="10ms" --resources="cpus:2;gpus:0;mem:1024;disk:1024;ports:[31000-32000]" --revocable_cpu_low_priority="true" --runtime_dir="/tmp/Endpoint_SlaveEndpointTest_UnauthorizedRequest_0_YWynpG" --sandbox_directory="/mnt/mesos/sandbox" --strict="true" --switch_user="true" --systemd_enable_support="true" --systemd_runtime_directory="/run/systemd/system" --version="false" --work_dir="/tmp/Endpoint_SlaveEndpointTest_UnauthorizedRequest_0_H7lnGK"
I1028 23:41:30.004967 29450 credentials.hpp:86] Loading credential for authentication from '/tmp/Endpoint_SlaveEndpointTest_UnauthorizedRequest_0_YWynpG/credential'
I1028 23:41:30.005180 29450 slave.cpp:346] Agent using credential for: test-principal
I1028 23:41:30.005213 29450 credentials.hpp:37] Loading credentials for authentication from '/tmp/Endpoint_SlaveEndpointTest_UnauthorizedRequest_0_YWynpG/http_credentials'
I1028 23:41:30.005637 29450 http.cpp:887] Using default 'basic' HTTP authenticator for realm 'mesos-agent-readonly'
I1028 23:41:30.005810 29450 http.cpp:887] Using default 'basic' HTTP authenticator for realm 'mesos-agent-readwrite'
I1028 23:41:30.007498 29450 slave.cpp:533] Agent resources: cpus(*):2; mem(*):1024; disk(*):1024; ports(*):[31000-32000]
I1028 23:41:30.007596 29450 slave.cpp:541] Agent attributes: [ ]
I1028 23:41:30.007609 29450 slave.cpp:546] Agent hostname: 08fed81fdb8e
I1028 23:41:30.009040 29438 state.cpp:57] Recovering state from '/tmp/Endpoint_SlaveEndpointTest_UnauthorizedRequest_0_H7lnGK/meta'
I1028 23:41:30.009479 29452 status_update_manager.cpp:203] Recovering status update manager
I1028 23:41:30.009727 29442 containerizer.cpp:557] Recovering containerizer
I1028 23:41:30.011317 29450 provisioner.cpp:253] Provisioner recovery complete
I1028 23:41:30.012101 29442 slave.cpp:5399] Finished recovery
I1028 23:41:30.012738 29442 slave.cpp:5573] Querying resource estimator for oversubscribable resources
I1028 23:41:30.013098 29438 slave.cpp:5587] Received oversubscribable resources {} from the resource estimator
I1028 23:41:30.014971 29451 process.cpp:3570] Handling HTTP event for process 'slave(638)' with path: '/slave(638)/monitor/statistics'
I1028 23:41:30.016058 29446 http.cpp:839] Authorizing principal 'test-principal' to GET the '/monitor/statistics' endpoint
I1028 23:41:30.019112 29438 slave.cpp:787] Agent terminating
[ OK ] Endpoint/SlaveEndpointTest.UnauthorizedRequest/0 (29 ms)
[ RUN ] Endpoint/SlaveEndpointTest.UnauthorizedRequest/1
I1028 23:41:30.030323 29419 containerizer.cpp:201] Using isolation: posix/cpu,posix/mem,filesystem/posix,network/cni
W1028 23:41:30.031016 29419 backend.cpp:76] Failed to create 'aufs' backend: AufsBackend requires root privileges, but is running as user mesos
W1028 23:41:30.031193 29419 backend.cpp:76] Failed to create 'bind' backend: BindBackend requires root privileges
I1028 23:41:30.034536 29452 slave.cpp:208] Mesos agent started on (639)@172.17.0.2:58617
I1028 23:41:30.034560 29452 slave.cpp:209] Flags at startup: --acls="" --appc_simple_discovery_uri_prefix="http://" --appc_store_dir="/tmp/mesos/store/appc" --authenticate_http_readonly="true" --authenticate_http_readwrite="true" --authenticatee="crammd5" --authentication_backoff_factor="1secs" --authorizer="local" --cgroups_cpu_enable_pids_and_tids_count="false" --cgroups_enable_cfs="false" --cgroups_hierarchy="/sys/fs/cgroup" --cgroups_limit_swap="false" --cgroups_root="mesos" --container_disk_watch_interval="15secs" --containerizers="mesos" --credential="/tmp/Endpoint_SlaveEndpointTest_UnauthorizedRequest_1_0O45zp/credential" --default_role="*" --disk_watch_interval="1mins" --docker="docker" --docker_kill_orphans="true" --docker_registry="https://registry-1.docker.io" --docker_remove_delay="6hrs" --docker_socket="/var/run/docker.sock" --docker_stop_timeout="0ns" --docker_store_dir="/tmp/mesos/store/docker" --docker_volume_checkpoint_dir="/var/run/mesos/isolators/docker/volume" --enforce_container_disk_quota="false" --executor_registration_timeout="1mins" --executor_shutdown_grace_period="5secs" --fetcher_cache_dir="/tmp/Endpoint_SlaveEndpointTest_UnauthorizedRequest_1_0O45zp/fetch" --fetcher_cache_size="2GB" --frameworks_home="" --gc_delay="1weeks" --gc_disk_headroom="0.1" --hadoop_home="" --help="false" --hostname_lookup="true" --http_authenticators="basic" --http_command_executor="false" --http_credentials="/tmp/Endpoint_SlaveEndpointTest_UnauthorizedRequest_1_0O45zp/http_credentials" --image_provisioner_backend="copy" --initialize_driver_logging="true" --isolation="posix/cpu,posix/mem" --launcher="posix" --launcher_dir="/mesos/mesos-1.2.0/_build/src" --logbufsecs="0" --logging_level="INFO" --max_completed_executors_per_framework="150" --oversubscribed_resources_interval="15secs" --perf_duration="10secs" --perf_interval="1mins" --qos_correction_interval_min="0ns" --quiet="false" --recover="reconnect" --recovery_timeout="15mins" --registration_backoff_factor="10ms" --resources="cpus:2;gpus:0;mem:1024;disk:1024;ports:[31000-32000]" --revocable_cpu_low_priority="true" --runtime_dir="/tmp/Endpoint_SlaveEndpointTest_UnauthorizedRequest_1_0O45zp" --sandbox_directory="/mnt/mesos/sandbox" --strict="true" --switch_user="true" --systemd_enable_support="true" --systemd_runtime_directory="/run/systemd/system" --version="false" --work_dir="/tmp/Endpoint_SlaveEndpointTest_UnauthorizedRequest_1_1zVcMt"
I1028 23:41:30.035205 29452 credentials.hpp:86] Loading credential for authentication from '/tmp/Endpoint_SlaveEndpointTest_UnauthorizedRequest_1_0O45zp/credential'
I1028 23:41:30.035369 29452 slave.cpp:346] Agent using credential for: test-principal
I1028 23:41:30.035394 29452 credentials.hpp:37] Loading credentials for authentication from '/tmp/Endpoint_SlaveEndpointTest_UnauthorizedRequest_1_0O45zp/http_credentials'
I1028 23:41:30.035651 29452 http.cpp:887] Using default 'basic' HTTP authenticator for realm 'mesos-agent-readonly'
I1028 23:41:30.035782 29452 http.cpp:887] Using default 'basic' HTTP authenticator for realm 'mesos-agent-readwrite'
I1028 23:41:30.037014 29452 slave.cpp:533] Agent resources: cpus(*):2; mem(*):1024; disk(*):1024; ports(*):[31000-32000]
I1028 23:41:30.037112 29452 slave.cpp:541] Agent attributes: [ ]
I1028 23:41:30.037127 29452 slave.cpp:546] Agent hostname: 08fed81fdb8e
I1028 23:41:30.038729 29445 state.cpp:57] Recovering state from '/tmp/Endpoint_SlaveEndpointTest_UnauthorizedRequest_1_1zVcMt/meta'
I1028 23:41:30.039155 29452 status_update_manager.cpp:203] Recovering status update manager
I1028 23:41:30.039372 29444 containerizer.cpp:557] Recovering containerizer
I1028 23:41:30.040751 29441 provisioner.cpp:253] Provisioner recovery complete
I1028 23:41:30.041287 29450 slave.cpp:5399] Finished recovery
I1028 23:41:30.041831 29450 slave.cpp:5573] Querying resource estimator for oversubscribable resources
I1028 23:41:30.042047 29453 slave.cpp:5587] Received oversubscribable resources {} from the resource estimator
I1028 23:41:30.043740 29448 process.cpp:3570] Handling HTTP event for process 'slave(639)' with path: '/slave(639)/monitor/statistics.json'
I1028 23:41:30.044766 29441 http.cpp:839] Authorizing principal 'test-principal' to GET the '/monitor/statistics.json' endpoint
I1028 23:41:30.047721 29446 slave.cpp:787] Agent terminating
[ OK ] Endpoint/SlaveEndpointTest.UnauthorizedRequest/1 (27 ms)
[ RUN ] Endpoint/SlaveEndpointTest.UnauthorizedRequest/2
I1028 23:41:30.057880 29419 containerizer.cpp:201] Using isolation: posix/cpu,posix/mem,filesystem/posix,network/cni
W1028 23:41:30.058545 29419 backend.cpp:76] Failed to create 'aufs' backend: AufsBackend requires root privileges, but is running as user mesos
W1028 23:41:30.058709 29419 backend.cpp:76] Failed to create 'bind' backend: BindBackend requires root privileges
I1028 23:41:30.061807 29443 slave.cpp:208] Mesos agent started on (640)@172.17.0.2:58617
I1028 23:41:30.061839 29443 slave.cpp:209] Flags at startup: --acls="" --appc_simple_discovery_uri_prefix="http://" --appc_store_dir="/tmp/mesos/store/appc" --authenticate_http_readonly="true" --authenticate_http_readwrite="true" --authenticatee="crammd5" --authentication_backoff_factor="1secs" --authorizer="local" --cgroups_cpu_enable_pids_and_tids_count="false" --cgroups_enable_cfs="false" --cgroups_hierarchy="/sys/fs/cgroup" --cgroups_limit_swap="false" --cgroups_root="mesos" --container_disk_watch_interval="15secs" --containerizers="mesos" --credential="/tmp/Endpoint_SlaveEndpointTest_UnauthorizedRequest_2_Sx8Y28/credential" --default_role="*" --disk_watch_interval="1mins" --docker="docker" --docker_kill_orphans="true" --docker_registry="https://registry-1.docker.io" --docker_remove_delay="6hrs" --docker_socket="/var/run/docker.sock" --docker_stop_timeout="0ns" --docker_store_dir="/tmp/mesos/store/docker" --docker_volume_checkpoint_dir="/var/run/mesos/isolators/docker/volume" --enforce_container_disk_quota="false" --executor_registration_timeout="1mins" --executor_shutdown_grace_period="5secs" --fetcher_cache_dir="/tmp/Endpoint_SlaveEndpointTest_UnauthorizedRequest_2_Sx8Y28/fetch" --fetcher_cache_size="2GB" --frameworks_home="" --gc_delay="1weeks" --gc_disk_headroom="0.1" --hadoop_home="" --help="false" --hostname_lookup="true" --http_authenticators="basic" --http_command_executor="false" --http_credentials="/tmp/Endpoint_SlaveEndpointTest_UnauthorizedRequest_2_Sx8Y28/http_credentials" --image_provisioner_backend="copy" --initialize_driver_logging="true" --isolation="posix/cpu,posix/mem" --launcher="posix" --launcher_dir="/mesos/mesos-1.2.0/_build/src" --logbufsecs="0" --logging_level="INFO" --max_completed_executors_per_framework="150" --oversubscribed_resources_interval="15secs" --perf_duration="10secs" --perf_interval="1mins" --qos_correction_interval_min="0ns" --quiet="false" --recover="reconnect" --recovery_timeout="15mins" --registration_backoff_factor="10ms" --resources="cpus:2;gpus:0;mem:1024;disk:1024;ports:[31000-32000]" --revocable_cpu_low_priority="true" --runtime_dir="/tmp/Endpoint_SlaveEndpointTest_UnauthorizedRequest_2_Sx8Y28" --sandbox_directory="/mnt/mesos/sandbox" --strict="true" --switch_user="true" --systemd_enable_support="true" --systemd_runtime_directory="/run/systemd/system" --version="false" --work_dir="/tmp/Endpoint_SlaveEndpointTest_UnauthorizedRequest_2_fajDad"
I1028 23:41:30.062796 29443 credentials.hpp:86] Loading credential for authentication from '/tmp/Endpoint_SlaveEndpointTest_UnauthorizedRequest_2_Sx8Y28/credential'
I1028 23:41:30.063005 29443 slave.cpp:346] Agent using credential for: test-principal
I1028 23:41:30.063038 29443 credentials.hpp:37] Loading credentials for authentication from '/tmp/Endpoint_SlaveEndpointTest_UnauthorizedRequest_2_Sx8Y28/http_credentials'
I1028 23:41:30.063413 29443 http.cpp:887] Using default 'basic' HTTP authenticator for realm 'mesos-agent-readonly'
I1028 23:41:30.063592 29443 http.cpp:887] Using default 'basic' HTTP authenticator for realm 'mesos-agent-readwrite'
I1028 23:41:30.065275 29443 slave.cpp:533] Agent resources: cpus(*):2; mem(*):1024; disk(*):1024; ports(*):[31000-32000]
I1028 23:41:30.065384 29443 slave.cpp:541] Agent attributes: [ ]
I1028 23:41:30.065407 29443 slave.cpp:546] Agent hostname: 08fed81fdb8e
I1028 23:41:30.066936 29440 state.cpp:57] Recovering state from '/tmp/Endpoint_SlaveEndpointTest_UnauthorizedRequest_2_fajDad/meta'
I1028 23:41:30.067414 29444 status_update_manager.cpp:203] Recovering status update manager
I1028 23:41:30.067883 29443 containerizer.cpp:557] Recovering containerizer
I1028 23:41:30.069835 29452 provisioner.cpp:253] Provisioner recovery complete
I1028 23:41:30.070909 29443 slave.cpp:5399] Finished recovery
I1028 23:41:30.071830 29443 slave.cpp:5573] Querying resource estimator for oversubscribable resources
I1028 23:41:30.072201 29443 slave.cpp:5587] Received oversubscribable resources {} from the resource estimator
I1028 23:41:30.073690 29441 process.cpp:3570] Handling HTTP event for process 'slave(640)' with path: '/slave(640)/containers'
I1028 23:41:30.074813 29453 http.cpp:839] Authorizing principal 'test-principal' to GET the '/containers' endpoint
I1028 23:41:30.078279 29439 slave.cpp:787] Agent terminating
[ OK ] Endpoint/SlaveEndpointTest.UnauthorizedRequest/2 (31 ms)
[ RUN ] Endpoint/SlaveEndpointTest.NoAuthorizer/0
I1028 23:41:30.090603 29419 containerizer.cpp:201] Using isolation: posix/cpu,posix/mem,filesystem/posix,network/cni
W1028 23:41:30.091310 29419 backend.cpp:76] Failed to create 'aufs' backend: AufsBackend requires root privileges, but is running as user mesos
W1028 23:41:30.091477 29419 backend.cpp:76] Failed to create 'bind' backend: BindBackend requires root privileges
I1028 23:41:30.093143 29419 cluster.cpp:435] Creating default 'local' authorizer
I1028 23:41:30.094771 29452 slave.cpp:208] Mesos agent started on (641)@172.17.0.2:58617
I1028 23:41:30.094789 29452 slave.cpp:209] Flags at startup: --acls="" --appc_simple_discovery_uri_prefix="http://" --appc_store_dir="/tmp/mesos/store/appc" --authenticate_http_readonly="true" --authenticate_http_readwrite="true" --authenticatee="crammd5" --authentication_backoff_factor="1secs" --authorizer="local" --cgroups_cpu_enable_pids_and_tids_count="false" --cgroups_enable_cfs="false" --cgroups_hierarchy="/sys/fs/cgroup" --cgroups_limit_swap="false" --cgroups_root="mesos" --container_disk_watch_interval="15secs" --containerizers="mesos" --credential="/tmp/Endpoint_SlaveEndpointTest_NoAuthorizer_0_4kamQS/credential" --default_role="*" --disk_watch_interval="1mins" --docker="docker" --docker_kill_orphans="true" --docker_registry="https://registry-1.docker.io" --docker_remove_delay="6hrs" --docker_socket="/var/run/docker.sock" --docker_stop_timeout="0ns" --docker_store_dir="/tmp/mesos/store/docker" --docker_volume_checkpoint_dir="/var/run/mesos/isolators/docker/volume" --enforce_container_disk_quota="false" --executor_registration_timeout="1mins" --executor_shutdown_grace_period="5secs" --fetcher_cache_dir="/tmp/Endpoint_SlaveEndpointTest_NoAuthorizer_0_4kamQS/fetch" --fetcher_cache_size="2GB" --frameworks_home="" --gc_delay="1weeks" --gc_disk_headroom="0.1" --hadoop_home="" --help="false" --hostname_lookup="true" --http_authenticators="basic" --http_command_executor="false" --http_credentials="/tmp/Endpoint_SlaveEndpointTest_NoAuthorizer_0_4kamQS/http_credentials" --image_provisioner_backend="copy" --initialize_driver_logging="true" --isolation="posix/cpu,posix/mem" --launcher="posix" --launcher_dir="/mesos/mesos-1.2.0/_build/src" --logbufsecs="0" --logging_level="INFO" --max_completed_executors_per_framework="150" --oversubscribed_resources_interval="15secs" --perf_duration="10secs" --perf_interval="1mins" --qos_correction_interval_min="0ns" --quiet="false" --recover="reconnect" --recovery_timeout="15mins" --registration_backoff_factor="10ms" --resources="cpus:2;gpus:0;mem:1024;disk:1024;ports:[31000-32000]" --revocable_cpu_low_priority="true" --runtime_dir="/tmp/Endpoint_SlaveEndpointTest_NoAuthorizer_0_4kamQS" --sandbox_directory="/mnt/mesos/sandbox" --strict="true" --switch_user="true" --systemd_enable_support="true" --systemd_runtime_directory="/run/systemd/system" --version="false" --work_dir="/tmp/Endpoint_SlaveEndpointTest_NoAuthorizer_0_955KSW"
I1028 23:41:30.095247 29452 credentials.hpp:86] Loading credential for authentication from '/tmp/Endpoint_SlaveEndpointTest_NoAuthorizer_0_4kamQS/credential'
I1028 23:41:30.095360 29452 slave.cpp:346] Agent using credential for: test-principal
I1028 23:41:30.095377 29452 credentials.hpp:37] Loading credentials for authentication from '/tmp/Endpoint_SlaveEndpointTest_NoAuthorizer_0_4kamQS/http_credentials'
I1028 23:41:30.095562 29452 http.cpp:887] Using default 'basic' HTTP authenticator for realm 'mesos-agent-readonly'
I1028 23:41:30.095661 29452 http.cpp:887] Using default 'basic' HTTP authenticator for realm 'mesos-agent-readwrite'
I1028 23:41:30.096712 29452 slave.cpp:533] Agent resources: cpus(*):2; mem(*):1024; disk(*):1024; ports(*):[31000-32000]
I1028 23:41:30.096812 29452 slave.cpp:541] Agent attributes: [ ]
I1028 23:41:30.096824 29452 slave.cpp:546] Agent hostname: 08fed81fdb8e
I1028 23:41:30.098330 29443 state.cpp:57] Recovering state from '/tmp/Endpoint_SlaveEndpointTest_NoAuthorizer_0_955KSW/meta'
I1028 23:41:30.098795 29441 status_update_manager.cpp:203] Recovering status update manager
I1028 23:41:30.099195 29441 containerizer.cpp:557] Recovering containerizer
I1028 23:41:30.100795 29439 provisioner.cpp:253] Provisioner recovery complete
I1028 23:41:30.101279 29445 slave.cpp:5399] Finished recovery
I1028 23:41:30.101838 29445 slave.cpp:5573] Querying resource estimator for oversubscribable resources
I1028 23:41:30.102193 29439 slave.cpp:5587] Received oversubscribable resources {} from the resource estimator
I1028 23:41:30.103938 29451 process.cpp:3570] Handling HTTP event for process 'slave(641)' with path: '/slave(641)/monitor/statistics'
I1028 23:41:30.105039 29441 http.cpp:839] Authorizing principal 'test-principal' to GET the '/monitor/statistics' endpoint
I1028 23:41:30.109506 29446 slave.cpp:787] Agent terminating
[ OK ] Endpoint/SlaveEndpointTest.NoAuthorizer/0 (31 ms)
[ RUN ] Endpoint/SlaveEndpointTest.NoAuthorizer/1
I1028 23:41:30.122051 29419 containerizer.cpp:201] Using isolation: posix/cpu,posix/mem,filesystem/posix,network/cni
W1028 23:41:30.122766 29419 backend.cpp:76] Failed to create 'aufs' backend: AufsBackend requires root privileges, but is running as user mesos
W1028 23:41:30.122930 29419 backend.cpp:76] Failed to create 'bind' backend: BindBackend requires root privileges
I1028 23:41:30.124809 29419 cluster.cpp:435] Creating default 'local' authorizer
I1028 23:41:30.126762 29445 slave.cpp:208] Mesos agent started on (642)@172.17.0.2:58617
I1028 23:41:30.126791 29445 slave.cpp:209] Flags at startup: --acls="" --appc_simple_discovery_uri_prefix="http://" --appc_store_dir="/tmp/mesos/store/appc" --authenticate_http_readonly="true" --authenticate_http_readwrite="true" --authenticatee="crammd5" --authentication_backoff_factor="1secs" --authorizer="local" --cgroups_cpu_enable_pids_and_tids_count="false" --cgroups_enable_cfs="false" --cgroups_hierarchy="/sys/fs/cgroup" --cgroups_limit_swap="false" --cgroups_root="mesos" --container_disk_watch_interval="15secs" --containerizers="mesos" --credential="/tmp/Endpoint_SlaveEndpointTest_NoAuthorizer_1_2zf4XC/credential" --default_role="*" --disk_watch_interval="1mins" --docker="docker" --docker_kill_orphans="true" --docker_registry="https://registry-1.docker.io" --docker_remove_delay="6hrs" --docker_socket="/var/run/docker.sock" --docker_stop_timeout="0ns" --docker_store_dir="/tmp/mesos/store/docker" --docker_volume_checkpoint_dir="/var/run/mesos/isolators/docker/volume" --enforce_container_disk_quota="false" --executor_registration_timeout="1mins" --executor_shutdown_grace_period="5secs" --fetcher_cache_dir="/tmp/Endpoint_SlaveEndpointTest_NoAuthorizer_1_2zf4XC/fetch" --fetcher_cache_size="2GB" --frameworks_home="" --gc_delay="1weeks" --gc_disk_headroom="0.1" --hadoop_home="" --help="false" --hostname_lookup="true" --http_authenticators="basic" --http_command_executor="false" --http_credentials="/tmp/Endpoint_SlaveEndpointTest_NoAuthorizer_1_2zf4XC/http_credentials" --image_provisioner_backend="copy" --initialize_driver_logging="true" --isolation="posix/cpu,posix/mem" --launcher="posix" --launcher_dir="/mesos/mesos-1.2.0/_build/src" --logbufsecs="0" --logging_level="INFO" --max_completed_executors_per_framework="150" --oversubscribed_resources_interval="15secs" --perf_duration="10secs" --perf_interval="1mins" --qos_correction_interval_min="0ns" --quiet="false" --recover="reconnect" --recovery_timeout="15mins" --registration_backoff_factor="10ms" --resources="cpus:2;gpus:0;mem:1024;disk:1024;ports:[31000-32000]" --revocable_cpu_low_priority="true" --runtime_dir="/tmp/Endpoint_SlaveEndpointTest_NoAuthorizer_1_2zf4XC" --sandbox_directory="/mnt/mesos/sandbox" --strict="true" --switch_user="true" --systemd_enable_support="true" --systemd_runtime_directory="/run/systemd/system" --version="false" --work_dir="/tmp/Endpoint_SlaveEndpointTest_NoAuthorizer_1_bUhlVG"
I1028 23:41:30.127364 29445 credentials.hpp:86] Loading credential for authentication from '/tmp/Endpoint_SlaveEndpointTest_NoAuthorizer_1_2zf4XC/credential'
I1028 23:41:30.127518 29445 slave.cpp:346] Agent using credential for: test-principal
I1028 23:41:30.127543 29445 credentials.hpp:37] Loading credentials for authentication from '/tmp/Endpoint_SlaveEndpointTest_NoAuthorizer_1_2zf4XC/http_credentials'
I1028 23:41:30.127804 29445 http.cpp:887] Using default 'basic' HTTP authenticator for realm 'mesos-agent-readonly'
I1028 23:41:30.127948 29445 http.cpp:887] Using default 'basic' HTTP authenticator for realm 'mesos-agent-readwrite'
I1028 23:41:30.129245 29445 slave.cpp:533] Agent resources: cpus(*):2; mem(*):1024; disk(*):1024; ports(*):[31000-32000]
I1028 23:41:30.129344 29445 slave.cpp:541] Agent attributes: [ ]
I1028 23:41:30.129359 29445 slave.cpp:546] Agent hostname: 08fed81fdb8e
I1028 23:41:30.130873 29450 state.cpp:57] Recovering state from '/tmp/Endpoint_SlaveEndpointTest_NoAuthorizer_1_bUhlVG/meta'
I1028 23:41:30.131217 29445 status_update_manager.cpp:203] Recovering status update manager
I1028 23:41:30.131546 29453 containerizer.cpp:557] Recovering containerizer
I1028 23:41:30.133376 29439 provisioner.cpp:253] Provisioner recovery complete
I1028 23:41:30.133894 29452 slave.cpp:5399] Finished recovery
I1028 23:41:30.134449 29452 slave.cpp:5573] Querying resource estimator for oversubscribable resources
I1028 23:41:30.134727 29445 slave.cpp:5587] Received oversubscribable resources {} from the resource estimator
I1028 23:41:30.136626 29442 process.cpp:3570] Handling HTTP event for process 'slave(642)' with path: '/slave(642)/monitor/statistics.json'
I1028 23:41:30.138180 29450 http.cpp:839] Authorizing principal 'test-principal' to GET the '/monitor/statistics.json' endpoint
I1028 23:41:30.143200 29442 slave.cpp:787] Agent terminating
[ OK ] Endpoint/SlaveEndpointTest.NoAuthorizer/1 (32 ms)
[ RUN ] Endpoint/SlaveEndpointTest.NoAuthorizer/2
I1028 23:41:30.153947 29419 containerizer.cpp:201] Using isolation: posix/cpu,posix/mem,filesystem/posix,network/cni
W1028 23:41:30.154635 29419 backend.cpp:76] Failed to create 'aufs' backend: AufsBackend requires root privileges, but is running as user mesos
W1028 23:41:30.154803 29419 backend.cpp:76] Failed to create 'bind' backend: BindBackend requires root privileges
I1028 23:41:30.156333 29419 cluster.cpp:435] Creating default 'local' authorizer
I1028 23:41:30.158020 29442 slave.cpp:208] Mesos agent started on (643)@172.17.0.2:58617
I1028 23:41:30.158043 29442 slave.cpp:209] Flags at startup: --acls="" --appc_simple_discovery_uri_prefix="http://" --appc_store_dir="/tmp/mesos/store/appc" --authenticate_http_readonly="true" --authenticate_http_readwrite="true" --authenticatee="crammd5" --authentication_backoff_factor="1secs" --authorizer="local" --cgroups_cpu_enable_pids_and_tids_count="false" --cgroups_enable_cfs="false" --cgroups_hierarchy="/sys/fs/cgroup" --cgroups_limit_swap="false" --cgroups_root="mesos" --container_disk_watch_interval="15secs" --containerizers="mesos" --credential="/tmp/Endpoint_SlaveEndpointTest_NoAuthorizer_2_AoyDqn/credential" --default_role="*" --disk_watch_interval="1mins" --docker="docker" --docker_kill_orphans="true" --docker_registry="https://registry-1.docker.io" --docker_remove_delay="6hrs" --docker_socket="/var/run/docker.sock" --docker_stop_timeout="0ns" --docker_store_dir="/tmp/mesos/store/docker" --docker_volume_checkpoint_dir="/var/run/mesos/isolators/docker/volume" --enforce_container_disk_quota="false" --executor_registration_timeout="1mins" --executor_shutdown_grace_period="5secs" --fetcher_cache_dir="/tmp/Endpoint_SlaveEndpointTest_NoAuthorizer_2_AoyDqn/fetch" --fetcher_cache_size="2GB" --frameworks_home="" --gc_delay="1weeks" --gc_disk_headroom="0.1" --hadoop_home="" --help="false" --hostname_lookup="true" --http_authenticators="basic" --http_command_executor="false" --http_credentials="/tmp/Endpoint_SlaveEndpointTest_NoAuthorizer_2_AoyDqn/http_credentials" --image_provisioner_backend="copy" --initialize_driver_logging="true" --isolation="posix/cpu,posix/mem" --launcher="posix" --launcher_dir="/mesos/mesos-1.2.0/_build/src" --logbufsecs="0" --logging_level="INFO" --max_completed_executors_per_framework="150" --oversubscribed_resources_interval="15secs" --perf_duration="10secs" --perf_interval="1mins" --qos_correction_interval_min="0ns" --quiet="false" --recover="reconnect" --recovery_timeout="15mins" --registration_backoff_factor="10ms" --resources="cpus:2;gpus:0;mem:1024;disk:1024;ports:[31000-32000]" --revocable_cpu_low_priority="true" --runtime_dir="/tmp/Endpoint_SlaveEndpointTest_NoAuthorizer_2_AoyDqn" --sandbox_directory="/mnt/mesos/sandbox" --strict="true" --switch_user="true" --systemd_enable_support="true" --systemd_runtime_directory="/run/systemd/system" --version="false" --work_dir="/tmp/Endpoint_SlaveEndpointTest_NoAuthorizer_2_thVIir"
I1028 23:41:30.158507 29442 credentials.hpp:86] Loading credential for authentication from '/tmp/Endpoint_SlaveEndpointTest_NoAuthorizer_2_AoyDqn/credential'
I1028 23:41:30.158632 29442 slave.cpp:346] Agent using credential for: test-principal
I1028 23:41:30.158650 29442 credentials.hpp:37] Loading credentials for authentication from '/tmp/Endpoint_SlaveEndpointTest_NoAuthorizer_2_AoyDqn/http_credentials'
I1028 23:41:30.158856 29442 http.cpp:887] Using default 'basic' HTTP authenticator for realm 'mesos-agent-readonly'
I1028 23:41:30.158999 29442 http.cpp:887] Using default 'basic' HTTP authenticator for realm 'mesos-agent-readwrite'
I1028 23:41:30.160001 29442 slave.cpp:533] Agent resources: cpus(*):2; mem(*):1024; disk(*):1024; ports(*):[31000-32000]
I1028 23:41:30.160073 29442 slave.cpp:541] Agent attributes: [ ]
I1028 23:41:30.160085 29442 slave.cpp:546] Agent hostname: 08fed81fdb8e
I1028 23:41:30.161252 29450 state.cpp:57] Recovering state from '/tmp/Endpoint_SlaveEndpointTest_NoAuthorizer_2_thVIir/meta'
I1028 23:41:30.161574 29447 status_update_manager.cpp:203] Recovering status update manager
I1028 23:41:30.161749 29439 containerizer.cpp:557] Recovering containerizer
I1028 23:41:30.162791 29444 provisioner.cpp:253] Provisioner recovery complete
I1028 23:41:30.163180 29446 slave.cpp:5399] Finished recovery
I1028 23:41:30.163573 29446 slave.cpp:5573] Querying resource estimator for oversubscribable resources
I1028 23:41:30.163767 29444 slave.cpp:5587] Received oversubscribable resources {} from the resource estimator
I1028 23:41:30.165418 29448 process.cpp:3570] Handling HTTP event for process 'slave(643)' with path: '/slave(643)/containers'
I1028 23:41:30.166326 29439 http.cpp:839] Authorizing principal 'test-principal' to GET the '/containers' endpoint
I1028 23:41:30.169329 29449 slave.cpp:787] Agent terminating
[ OK ] Endpoint/SlaveEndpointTest.NoAuthorizer/2 (26 ms)
[----------] 9 tests from Endpoint/SlaveEndpointTest (274 ms total)
[----------] Global test environment tear-down
[==========] 1370 tests from 155 test cases ran. (423636 ms total)
[ PASSED ] 1369 tests.
[ FAILED ] 1 test, listed below:
[ FAILED ] RegistrarTest.PruneUnreachable
1 FAILED TEST
YOU HAVE 4 DISABLED TESTS
make[4]: *** [check-local] Error 1
make[4]: Leaving directory `/mesos/mesos-1.2.0/_build/src'
make[3]: *** [check-am] Error 2
make[3]: Leaving directory `/mesos/mesos-1.2.0/_build/src'
make[2]: *** [check] Error 2
make[2]: Leaving directory `/mesos/mesos-1.2.0/_build/src'
make[1]: *** [check-recursive] Error 1
make[1]: Leaving directory `/mesos/mesos-1.2.0/_build'
make: *** [distcheck] Error 1
+ docker rmi mesos-1477695921-30643
Untagged: mesos-1477695921-30643:latest
Deleted: sha256:72b444a9fcf27ae84fcb48b9c291b9e34fe44dfb4b57273a7b1d4bf15d854bb7
Deleted: sha256:e975c38f779d3a06c034c81388bc58778b6bfd1efb29428498c181947bba721e
Deleted: sha256:b6e7efe598433bda1e1c68f76a696be394250780e1fa218df4cbb21c55a23e06
Deleted: sha256:bc1432faebf2796d6ab1aa52eea2e0eaedecf5e1ca08ababb28d6356b1177c1e
Deleted: sha256:29b1551ee81503dd37de412869ee88ac82ee92e59b43cb731a35b3216ac78696
Deleted: sha256:ce37edfd7ce4f11182113908914e6ea8541d73be4871b138467743695b4c7281
Deleted: sha256:2f712072618b7e17ad8d6d860d219cc919a397c8d481f05298b1a8848deb876f
Deleted: sha256:554f6072d853057979387d802a44f0c30db419528a31f0c3b6d74aa0dc911301
Deleted: sha256:82e716734903d6930e338659949a3afc33c8cb8fbf188fe6fe2e0b719b03d79c
Deleted: sha256:da4580486b9834faa32361e21a5de93960d6bf5599337280ab671cf1ffb5f047
Deleted: sha256:c36f88378f422092d820d07937801cbde8dd8971406dd06966a0c9f35f7d9b30
Deleted: sha256:7a8e142abe783927d74f4deef17e467d6a4c21d3f1235db9e9f9ad651fd50f9b
Deleted: sha256:acb51f9141cf7e90cdaaa8f39fd8a3480a440b667bf9b9f9f4444d460ae0150c
Deleted: sha256:9899ef9431723abe6dacbfaee36005b667a42751856feb4a0768facdc23575a2
Deleted: sha256:e9a847903ae9b771635192a9863d29e4d06a386c3a1760b3e6bc99217ceee1d2
Deleted: sha256:03706aa0c82028e7d44b3a3ef9c189a3e48ef7dd369926fa5b14b97c6e236535
Deleted: sha256:e908f94dacf65a471bfd4d5d997414ccd16bd1d265392c71153f0e9e163f1d08
Deleted: sha256:07ff5b2b670acf35572e55711ff599cb364ddb49e17017e9ae48e50be9c1c8d4
Deleted: sha256:e5efcec579905a56b9d6aad96438f724baf53fbb0d96bbb4d9529b9890b537f6
Deleted: sha256:34b57db2e02e4ab87d3a938bdca479e460cdd2336a9d80ec60c176ea95ab707e
Deleted: sha256:2bbf05cf3ccd9c2dcf0b73cc6b58d4f336e527ea3c6202213aec29a2e29be269
Deleted: sha256:763d3eb1848f323cecc057d9bc7ac6f31e34f36664c4a723a9cef121ecbb3a76
Deleted: sha256:b286ff4f325781c829cb2c065fb6a2dca68e4e8954170ef9488edadbe11d6e9a
Deleted: sha256:6dd9bcb854289ce5f23e43d1103bb890c893b642ac71894171c5d96af139f879
Build step 'Execute shell' marked build as failure