You are viewing a plain text version of this content. The canonical link for it is here.
Posted to builds@solr.apache.org by Apache Jenkins Server <je...@builds.apache.org> on 2021/11/27 14:09:37 UTC

[JENKINS] Solr » Solr-Check-main - Build # 2148 - Unstable!

Build: https://ci-builds.apache.org/job/Solr/job/Solr-Check-main/2148/

1 tests failed.
FAILED:  org.apache.solr.util.OrderedExecutorTest.classMethod

Error Message:
com.carrotsearch.randomizedtesting.ThreadLeakError: 1 thread leaked from SUITE scope at org.apache.solr.util.OrderedExecutorTest: 
   1) Thread[id=29898, name=testRunInParallel_test-18127-thread-6, state=RUNNABLE, group=TGRP-OrderedExecutorTest]
        at java.base@11.0.11/jdk.internal.misc.Unsafe.unpark(Native Method)
        at java.base@11.0.11/java.util.concurrent.locks.LockSupport.unpark(LockSupport.java:160)
        at java.base@11.0.11/java.util.concurrent.locks.AbstractQueuedSynchronizer.unparkSuccessor(AbstractQueuedSynchronizer.java:709)
        at java.base@11.0.11/java.util.concurrent.locks.AbstractQueuedSynchronizer.release(AbstractQueuedSynchronizer.java:1305)
        at java.base@11.0.11/java.util.concurrent.locks.ReentrantLock.unlock(ReentrantLock.java:439)
        at java.base@11.0.11/java.util.concurrent.ThreadPoolExecutor.tryTerminate(ThreadPoolExecutor.java:726)
        at java.base@11.0.11/java.util.concurrent.ThreadPoolExecutor.processWorkerExit(ThreadPoolExecutor.java:994)
        at java.base@11.0.11/java.util.concurrent.ThreadPoolExecutor.runWorker(ThreadPoolExecutor.java:1142)
        at java.base@11.0.11/java.util.concurrent.ThreadPoolExecutor$Worker.run(ThreadPoolExecutor.java:628)
        at java.base@11.0.11/java.lang.Thread.run(Thread.java:834)

Stack Trace:
com.carrotsearch.randomizedtesting.ThreadLeakError: 1 thread leaked from SUITE scope at org.apache.solr.util.OrderedExecutorTest: 
   1) Thread[id=29898, name=testRunInParallel_test-18127-thread-6, state=RUNNABLE, group=TGRP-OrderedExecutorTest]
        at java.base@11.0.11/jdk.internal.misc.Unsafe.unpark(Native Method)
        at java.base@11.0.11/java.util.concurrent.locks.LockSupport.unpark(LockSupport.java:160)
        at java.base@11.0.11/java.util.concurrent.locks.AbstractQueuedSynchronizer.unparkSuccessor(AbstractQueuedSynchronizer.java:709)
        at java.base@11.0.11/java.util.concurrent.locks.AbstractQueuedSynchronizer.release(AbstractQueuedSynchronizer.java:1305)
        at java.base@11.0.11/java.util.concurrent.locks.ReentrantLock.unlock(ReentrantLock.java:439)
        at java.base@11.0.11/java.util.concurrent.ThreadPoolExecutor.tryTerminate(ThreadPoolExecutor.java:726)
        at java.base@11.0.11/java.util.concurrent.ThreadPoolExecutor.processWorkerExit(ThreadPoolExecutor.java:994)
        at java.base@11.0.11/java.util.concurrent.ThreadPoolExecutor.runWorker(ThreadPoolExecutor.java:1142)
        at java.base@11.0.11/java.util.concurrent.ThreadPoolExecutor$Worker.run(ThreadPoolExecutor.java:628)
        at java.base@11.0.11/java.lang.Thread.run(Thread.java:834)
	at __randomizedtesting.SeedInfo.seed([871DC4D8EE10E8D3]:0)




Build Log:
[...truncated 958 lines...]
ERROR: The following test(s) have failed:
  - org.apache.solr.util.OrderedExecutorTest.classMethod (:solr:core)
    Test output: /home/jenkins/jenkins-slave/workspace/Solr/Solr-Check-main/solr/core/build/test-results/test/outputs/OUTPUT-org.apache.solr.util.OrderedExecutorTest.txt
    Reproduce with: gradlew :solr:core:test --tests "org.apache.solr.util.OrderedExecutorTest.classMethod" -Ptests.jvms=4 -Ptests.haltonfailure=false -Ptests.jvmargs=-XX:TieredStopAtLevel=1 -Ptests.seed=871DC4D8EE10E8D3 -Ptests.multiplier=2 -Ptests.badapples=false -Ptests.file.encoding=ISO-8859-1


Deprecated Gradle features were used in this build, making it incompatible with Gradle 8.0.

You can use '--warning-mode all' to show the individual deprecation warnings and determine if they come from your own scripts or plugins.

See https://docs.gradle.org/7.2/userguide/command_line_interface.html#sec:command_line_warnings

BUILD SUCCESSFUL in 50m 13s
407 actionable tasks: 407 executed
Build step 'Invoke Gradle script' changed build result to SUCCESS
Archiving artifacts
java.lang.InterruptedException: no matches found within 10000
	at hudson.FilePath$ValidateAntFileMask.hasMatch(FilePath.java:3069)
	at hudson.FilePath$ValidateAntFileMask.invoke(FilePath.java:2948)
	at hudson.FilePath$ValidateAntFileMask.invoke(FilePath.java:2929)
	at hudson.FilePath$FileCallableWrapper.call(FilePath.java:3317)
Also:   hudson.remoting.Channel$CallSiteStackTrace: Remote call to lucene-solr-2
		at hudson.remoting.Channel.attachCallSiteStackTrace(Channel.java:1800)
		at hudson.remoting.UserRequest$ExceptionResponse.retrieve(UserRequest.java:356)
		at hudson.remoting.Channel.call(Channel.java:1001)
		at hudson.FilePath.act(FilePath.java:1159)
		at hudson.FilePath.act(FilePath.java:1148)
		at hudson.FilePath.validateAntFileMask(FilePath.java:2927)
		at hudson.tasks.ArtifactArchiver.perform(ArtifactArchiver.java:270)
		at hudson.tasks.BuildStepCompatibilityLayer.perform(BuildStepCompatibilityLayer.java:80)
		at hudson.tasks.BuildStepMonitor$1.perform(BuildStepMonitor.java:20)
		at hudson.model.AbstractBuild$AbstractBuildExecution.perform(AbstractBuild.java:803)
		at hudson.model.AbstractBuild$AbstractBuildExecution.performAllBuildSteps(AbstractBuild.java:752)
		at hudson.model.Build$BuildExecution.post2(Build.java:177)
		at hudson.model.AbstractBuild$AbstractBuildExecution.post(AbstractBuild.java:697)
		at hudson.model.Run.execute(Run.java:1931)
		at hudson.model.FreeStyleBuild.run(FreeStyleBuild.java:43)
		at hudson.model.ResourceController.execute(ResourceController.java:97)
		at hudson.model.Executor.run(Executor.java:429)
Caused: hudson.FilePath$TunneledInterruptedException
	at hudson.FilePath$FileCallableWrapper.call(FilePath.java:3319)
	at hudson.remoting.UserRequest.perform(UserRequest.java:211)
	at hudson.remoting.UserRequest.perform(UserRequest.java:54)
	at hudson.remoting.Request$2.run(Request.java:376)
	at hudson.remoting.InterceptingExecutorService.lambda$wrap$0(InterceptingExecutorService.java:78)
	at java.util.concurrent.FutureTask.run(FutureTask.java:266)
	at java.util.concurrent.ThreadPoolExecutor.runWorker(ThreadPoolExecutor.java:1149)
	at java.util.concurrent.ThreadPoolExecutor$Worker.run(ThreadPoolExecutor.java:624)
	at java.lang.Thread.run(Thread.java:748)
Caused: java.lang.InterruptedException: java.lang.InterruptedException: no matches found within 10000
	at hudson.FilePath.act(FilePath.java:1161)
	at hudson.FilePath.act(FilePath.java:1148)
	at hudson.FilePath.validateAntFileMask(FilePath.java:2927)
	at hudson.tasks.ArtifactArchiver.perform(ArtifactArchiver.java:270)
	at hudson.tasks.BuildStepCompatibilityLayer.perform(BuildStepCompatibilityLayer.java:80)
	at hudson.tasks.BuildStepMonitor$1.perform(BuildStepMonitor.java:20)
	at hudson.model.AbstractBuild$AbstractBuildExecution.perform(AbstractBuild.java:803)
	at hudson.model.AbstractBuild$AbstractBuildExecution.performAllBuildSteps(AbstractBuild.java:752)
	at hudson.model.Build$BuildExecution.post2(Build.java:177)
	at hudson.model.AbstractBuild$AbstractBuildExecution.post(AbstractBuild.java:697)
	at hudson.model.Run.execute(Run.java:1931)
	at hudson.model.FreeStyleBuild.run(FreeStyleBuild.java:43)
	at hudson.model.ResourceController.execute(ResourceController.java:97)
	at hudson.model.Executor.run(Executor.java:429)
No artifacts found that match the file pattern "**/*.events,heapdumps/**,**/hs_err_pid*". Configuration error?
Recording test results
[Checks API] No suitable checks publisher found.
Build step 'Publish JUnit test result report' changed build result to UNSTABLE
Email was triggered for: Unstable (Test Failures)
Sending email for trigger: Unstable (Test Failures)

[JENKINS] Solr » Solr-Check-main - Build # 2152 - Still Unstable!

Posted by Apache Jenkins Server <je...@builds.apache.org>.
Build: https://ci-builds.apache.org/job/Solr/job/Solr-Check-main/2152/

1 tests failed.
FAILED:  org.apache.solr.schema.TestBulkSchemaConcurrent.classMethod

Error Message:
com.carrotsearch.randomizedtesting.ThreadLeakError: 3 threads leaked from SUITE scope at org.apache.solr.schema.TestBulkSchemaConcurrent: 
   1) Thread[id=26314, name=ZKEventListenerThread, state=TIMED_WAITING, group=TGRP-TestBulkSchemaConcurrent]
        at java.base@11.0.11/java.lang.Thread.sleep(Native Method)
        at app//org.apache.solr.common.cloud.ZkCmdExecutor.retryDelay(ZkCmdExecutor.java:156)
        at app//org.apache.solr.common.cloud.ZkCmdExecutor.retryOperation(ZkCmdExecutor.java:89)
        at app//org.apache.solr.common.cloud.SolrZkClient.exists(SolrZkClient.java:307)
        at app//org.apache.solr.cloud.ZkController.pathExists(ZkController.java:1118)
        at app//org.apache.solr.cloud.ZkSolrResourceLoader.openResource(ZkSolrResourceLoader.java:80)
        at app//org.apache.lucene.analysis.AbstractAnalysisFactory.getLines(AbstractAnalysisFactory.java:302)
        at app//org.apache.lucene.analysis.AbstractAnalysisFactory.getWordSet(AbstractAnalysisFactory.java:293)
        at app//org.apache.lucene.analysis.miscellaneous.WordDelimiterGraphFilterFactory.inform(WordDelimiterGraphFilterFactory.java:120)
        at app//org.apache.solr.core.SolrResourceLoader.informAware(SolrResourceLoader.java:727)
        at app//org.apache.solr.schema.ManagedIndexSchema.informResourceLoaderAwareObjectsInChain(ManagedIndexSchema.java:1353)
        at app//org.apache.solr.schema.ManagedIndexSchema.informResourceLoaderAwareObjectsForFieldType(ManagedIndexSchema.java:1206)
        at app//org.apache.solr.schema.ManagedIndexSchema.postReadInform(ManagedIndexSchema.java:1191)
        at app//org.apache.solr.schema.IndexSchema.readSchema(IndexSchema.java:615)
        at app//org.apache.solr.schema.IndexSchema.<init>(IndexSchema.java:177)
        at app//org.apache.solr.schema.ManagedIndexSchema.<init>(ManagedIndexSchema.java:108)
        at app//org.apache.solr.schema.ZkIndexSchemaReader.updateSchema(ZkIndexSchemaReader.java:178)
        at app//org.apache.solr.schema.ZkIndexSchemaReader.refreshSchemaFromZk(ZkIndexSchemaReader.java:158)
        at app//org.apache.solr.schema.ManagedIndexSchemaFactory.inform(ManagedIndexSchemaFactory.java:482)
        at app//org.apache.solr.core.SolrResourceLoader.inform(SolrResourceLoader.java:692)
        at app//org.apache.solr.core.SolrCore.<init>(SolrCore.java:1068)
        at app//org.apache.solr.core.SolrCore.reload(SolrCore.java:746)
        at app//org.apache.solr.core.CoreContainer.reload(CoreContainer.java:1712)
        at app//org.apache.solr.core.SolrCore.lambda$getConfListener$21(SolrCore.java:3140)
        at app//org.apache.solr.core.SolrCore$$Lambda$870/0x000000010096a840.run(Unknown Source)
        at app//org.apache.solr.cloud.ZkController.lambda$fireEventListeners$17(ZkController.java:2473)
        at app//org.apache.solr.cloud.ZkController$$Lambda$1427/0x0000000100b9e440.run(Unknown Source)
        at java.base@11.0.11/java.lang.Thread.run(Thread.java:834)
   2) Thread[id=26346, name=ZKEventListenerThread, state=BLOCKED, group=TGRP-TestBulkSchemaConcurrent]
        at app//org.apache.solr.core.SolrCore.reload(SolrCore.java:732)
        at app//org.apache.solr.core.CoreContainer.reload(CoreContainer.java:1712)
        at app//org.apache.solr.core.SolrCore.lambda$getConfListener$21(SolrCore.java:3140)
        at app//org.apache.solr.core.SolrCore$$Lambda$870/0x000000010096a840.run(Unknown Source)
        at app//org.apache.solr.cloud.ZkController.lambda$fireEventListeners$17(ZkController.java:2473)
        at app//org.apache.solr.cloud.ZkController$$Lambda$1427/0x0000000100b9e440.run(Unknown Source)
        at java.base@11.0.11/java.lang.Thread.run(Thread.java:834)
   3) Thread[id=26412, name=searcherExecutor-17099-thread-1-processing-127.0.0.1:42753_kowp%2Fk, state=WAITING, group=TGRP-TestBulkSchemaConcurrent]
        at java.base@11.0.11/jdk.internal.misc.Unsafe.park(Native Method)
        at java.base@11.0.11/java.util.concurrent.locks.LockSupport.park(LockSupport.java:194)
        at java.base@11.0.11/java.util.concurrent.locks.AbstractQueuedSynchronizer.parkAndCheckInterrupt(AbstractQueuedSynchronizer.java:885)
        at java.base@11.0.11/java.util.concurrent.locks.AbstractQueuedSynchronizer.doAcquireSharedInterruptibly(AbstractQueuedSynchronizer.java:1039)
        at java.base@11.0.11/java.util.concurrent.locks.AbstractQueuedSynchronizer.acquireSharedInterruptibly(AbstractQueuedSynchronizer.java:1345)
        at java.base@11.0.11/java.util.concurrent.CountDownLatch.await(CountDownLatch.java:232)
        at app//org.apache.solr.core.SolrCore.lambda$new$2(SolrCore.java:1055)
        at app//org.apache.solr.core.SolrCore$$Lambda$418/0x00000001005ee840.call(Unknown Source)
        at java.base@11.0.11/java.util.concurrent.FutureTask.run(FutureTask.java:264)
        at app//org.apache.solr.common.util.ExecutorUtil$MDCAwareThreadPoolExecutor.lambda$execute$0(ExecutorUtil.java:235)
        at app//org.apache.solr.common.util.ExecutorUtil$MDCAwareThreadPoolExecutor$$Lambda$282/0x00000001004e9440.run(Unknown Source)
        at java.base@11.0.11/java.util.concurrent.ThreadPoolExecutor.runWorker(ThreadPoolExecutor.java:1128)
        at java.base@11.0.11/java.util.concurrent.ThreadPoolExecutor$Worker.run(ThreadPoolExecutor.java:628)
        at java.base@11.0.11/java.lang.Thread.run(Thread.java:834)

Stack Trace:
com.carrotsearch.randomizedtesting.ThreadLeakError: 3 threads leaked from SUITE scope at org.apache.solr.schema.TestBulkSchemaConcurrent: 
   1) Thread[id=26314, name=ZKEventListenerThread, state=TIMED_WAITING, group=TGRP-TestBulkSchemaConcurrent]
        at java.base@11.0.11/java.lang.Thread.sleep(Native Method)
        at app//org.apache.solr.common.cloud.ZkCmdExecutor.retryDelay(ZkCmdExecutor.java:156)
        at app//org.apache.solr.common.cloud.ZkCmdExecutor.retryOperation(ZkCmdExecutor.java:89)
        at app//org.apache.solr.common.cloud.SolrZkClient.exists(SolrZkClient.java:307)
        at app//org.apache.solr.cloud.ZkController.pathExists(ZkController.java:1118)
        at app//org.apache.solr.cloud.ZkSolrResourceLoader.openResource(ZkSolrResourceLoader.java:80)
        at app//org.apache.lucene.analysis.AbstractAnalysisFactory.getLines(AbstractAnalysisFactory.java:302)
        at app//org.apache.lucene.analysis.AbstractAnalysisFactory.getWordSet(AbstractAnalysisFactory.java:293)
        at app//org.apache.lucene.analysis.miscellaneous.WordDelimiterGraphFilterFactory.inform(WordDelimiterGraphFilterFactory.java:120)
        at app//org.apache.solr.core.SolrResourceLoader.informAware(SolrResourceLoader.java:727)
        at app//org.apache.solr.schema.ManagedIndexSchema.informResourceLoaderAwareObjectsInChain(ManagedIndexSchema.java:1353)
        at app//org.apache.solr.schema.ManagedIndexSchema.informResourceLoaderAwareObjectsForFieldType(ManagedIndexSchema.java:1206)
        at app//org.apache.solr.schema.ManagedIndexSchema.postReadInform(ManagedIndexSchema.java:1191)
        at app//org.apache.solr.schema.IndexSchema.readSchema(IndexSchema.java:615)
        at app//org.apache.solr.schema.IndexSchema.<init>(IndexSchema.java:177)
        at app//org.apache.solr.schema.ManagedIndexSchema.<init>(ManagedIndexSchema.java:108)
        at app//org.apache.solr.schema.ZkIndexSchemaReader.updateSchema(ZkIndexSchemaReader.java:178)
        at app//org.apache.solr.schema.ZkIndexSchemaReader.refreshSchemaFromZk(ZkIndexSchemaReader.java:158)
        at app//org.apache.solr.schema.ManagedIndexSchemaFactory.inform(ManagedIndexSchemaFactory.java:482)
        at app//org.apache.solr.core.SolrResourceLoader.inform(SolrResourceLoader.java:692)
        at app//org.apache.solr.core.SolrCore.<init>(SolrCore.java:1068)
        at app//org.apache.solr.core.SolrCore.reload(SolrCore.java:746)
        at app//org.apache.solr.core.CoreContainer.reload(CoreContainer.java:1712)
        at app//org.apache.solr.core.SolrCore.lambda$getConfListener$21(SolrCore.java:3140)
        at app//org.apache.solr.core.SolrCore$$Lambda$870/0x000000010096a840.run(Unknown Source)
        at app//org.apache.solr.cloud.ZkController.lambda$fireEventListeners$17(ZkController.java:2473)
        at app//org.apache.solr.cloud.ZkController$$Lambda$1427/0x0000000100b9e440.run(Unknown Source)
        at java.base@11.0.11/java.lang.Thread.run(Thread.java:834)
   2) Thread[id=26346, name=ZKEventListenerThread, state=BLOCKED, group=TGRP-TestBulkSchemaConcurrent]
        at app//org.apache.solr.core.SolrCore.reload(SolrCore.java:732)
        at app//org.apache.solr.core.CoreContainer.reload(CoreContainer.java:1712)
        at app//org.apache.solr.core.SolrCore.lambda$getConfListener$21(SolrCore.java:3140)
        at app//org.apache.solr.core.SolrCore$$Lambda$870/0x000000010096a840.run(Unknown Source)
        at app//org.apache.solr.cloud.ZkController.lambda$fireEventListeners$17(ZkController.java:2473)
        at app//org.apache.solr.cloud.ZkController$$Lambda$1427/0x0000000100b9e440.run(Unknown Source)
        at java.base@11.0.11/java.lang.Thread.run(Thread.java:834)
   3) Thread[id=26412, name=searcherExecutor-17099-thread-1-processing-127.0.0.1:42753_kowp%2Fk, state=WAITING, group=TGRP-TestBulkSchemaConcurrent]
        at java.base@11.0.11/jdk.internal.misc.Unsafe.park(Native Method)
        at java.base@11.0.11/java.util.concurrent.locks.LockSupport.park(LockSupport.java:194)
        at java.base@11.0.11/java.util.concurrent.locks.AbstractQueuedSynchronizer.parkAndCheckInterrupt(AbstractQueuedSynchronizer.java:885)
        at java.base@11.0.11/java.util.concurrent.locks.AbstractQueuedSynchronizer.doAcquireSharedInterruptibly(AbstractQueuedSynchronizer.java:1039)
        at java.base@11.0.11/java.util.concurrent.locks.AbstractQueuedSynchronizer.acquireSharedInterruptibly(AbstractQueuedSynchronizer.java:1345)
        at java.base@11.0.11/java.util.concurrent.CountDownLatch.await(CountDownLatch.java:232)
        at app//org.apache.solr.core.SolrCore.lambda$new$2(SolrCore.java:1055)
        at app//org.apache.solr.core.SolrCore$$Lambda$418/0x00000001005ee840.call(Unknown Source)
        at java.base@11.0.11/java.util.concurrent.FutureTask.run(FutureTask.java:264)
        at app//org.apache.solr.common.util.ExecutorUtil$MDCAwareThreadPoolExecutor.lambda$execute$0(ExecutorUtil.java:235)
        at app//org.apache.solr.common.util.ExecutorUtil$MDCAwareThreadPoolExecutor$$Lambda$282/0x00000001004e9440.run(Unknown Source)
        at java.base@11.0.11/java.util.concurrent.ThreadPoolExecutor.runWorker(ThreadPoolExecutor.java:1128)
        at java.base@11.0.11/java.util.concurrent.ThreadPoolExecutor$Worker.run(ThreadPoolExecutor.java:628)
        at java.base@11.0.11/java.lang.Thread.run(Thread.java:834)
	at __randomizedtesting.SeedInfo.seed([491005B810F4D28E]:0)




Build Log:
[...truncated 3810 lines...]
ERROR: The following test(s) have failed:
  - org.apache.solr.schema.TestBulkSchemaConcurrent.classMethod (:solr:core)
    Test output: /home/jenkins/jenkins-slave/workspace/Solr/Solr-Check-main/solr/core/build/test-results/test/outputs/OUTPUT-org.apache.solr.schema.TestBulkSchemaConcurrent.txt
    Reproduce with: gradlew :solr:core:test --tests "org.apache.solr.schema.TestBulkSchemaConcurrent.classMethod" -Ptests.jvms=4 -Ptests.haltonfailure=false -Ptests.jvmargs=-XX:TieredStopAtLevel=1 -Ptests.seed=491005B810F4D28E -Ptests.multiplier=2 -Ptests.badapples=false -Ptests.file.encoding=UTF-8


Deprecated Gradle features were used in this build, making it incompatible with Gradle 8.0.

You can use '--warning-mode all' to show the individual deprecation warnings and determine if they come from your own scripts or plugins.

See https://docs.gradle.org/7.2/userguide/command_line_interface.html#sec:command_line_warnings

BUILD SUCCESSFUL in 53m 36s
407 actionable tasks: 407 executed
Build step 'Invoke Gradle script' changed build result to SUCCESS
Archiving artifacts
java.lang.InterruptedException: no matches found within 10000
	at hudson.FilePath$ValidateAntFileMask.hasMatch(FilePath.java:3069)
	at hudson.FilePath$ValidateAntFileMask.invoke(FilePath.java:2948)
	at hudson.FilePath$ValidateAntFileMask.invoke(FilePath.java:2929)
	at hudson.FilePath$FileCallableWrapper.call(FilePath.java:3317)
Also:   hudson.remoting.Channel$CallSiteStackTrace: Remote call to lucene-solr-1
		at hudson.remoting.Channel.attachCallSiteStackTrace(Channel.java:1800)
		at hudson.remoting.UserRequest$ExceptionResponse.retrieve(UserRequest.java:356)
		at hudson.remoting.Channel.call(Channel.java:1001)
		at hudson.FilePath.act(FilePath.java:1159)
		at hudson.FilePath.act(FilePath.java:1148)
		at hudson.FilePath.validateAntFileMask(FilePath.java:2927)
		at hudson.tasks.ArtifactArchiver.perform(ArtifactArchiver.java:270)
		at hudson.tasks.BuildStepCompatibilityLayer.perform(BuildStepCompatibilityLayer.java:80)
		at hudson.tasks.BuildStepMonitor$1.perform(BuildStepMonitor.java:20)
		at hudson.model.AbstractBuild$AbstractBuildExecution.perform(AbstractBuild.java:803)
		at hudson.model.AbstractBuild$AbstractBuildExecution.performAllBuildSteps(AbstractBuild.java:752)
		at hudson.model.Build$BuildExecution.post2(Build.java:177)
		at hudson.model.AbstractBuild$AbstractBuildExecution.post(AbstractBuild.java:697)
		at hudson.model.Run.execute(Run.java:1931)
		at hudson.model.FreeStyleBuild.run(FreeStyleBuild.java:43)
		at hudson.model.ResourceController.execute(ResourceController.java:97)
		at hudson.model.Executor.run(Executor.java:429)
Caused: hudson.FilePath$TunneledInterruptedException
	at hudson.FilePath$FileCallableWrapper.call(FilePath.java:3319)
	at hudson.remoting.UserRequest.perform(UserRequest.java:211)
	at hudson.remoting.UserRequest.perform(UserRequest.java:54)
	at hudson.remoting.Request$2.run(Request.java:376)
	at hudson.remoting.InterceptingExecutorService.lambda$wrap$0(InterceptingExecutorService.java:78)
	at java.util.concurrent.FutureTask.run(FutureTask.java:266)
	at java.util.concurrent.ThreadPoolExecutor.runWorker(ThreadPoolExecutor.java:1149)
	at java.util.concurrent.ThreadPoolExecutor$Worker.run(ThreadPoolExecutor.java:624)
	at java.lang.Thread.run(Thread.java:748)
Caused: java.lang.InterruptedException: java.lang.InterruptedException: no matches found within 10000
	at hudson.FilePath.act(FilePath.java:1161)
	at hudson.FilePath.act(FilePath.java:1148)
	at hudson.FilePath.validateAntFileMask(FilePath.java:2927)
	at hudson.tasks.ArtifactArchiver.perform(ArtifactArchiver.java:270)
	at hudson.tasks.BuildStepCompatibilityLayer.perform(BuildStepCompatibilityLayer.java:80)
	at hudson.tasks.BuildStepMonitor$1.perform(BuildStepMonitor.java:20)
	at hudson.model.AbstractBuild$AbstractBuildExecution.perform(AbstractBuild.java:803)
	at hudson.model.AbstractBuild$AbstractBuildExecution.performAllBuildSteps(AbstractBuild.java:752)
	at hudson.model.Build$BuildExecution.post2(Build.java:177)
	at hudson.model.AbstractBuild$AbstractBuildExecution.post(AbstractBuild.java:697)
	at hudson.model.Run.execute(Run.java:1931)
	at hudson.model.FreeStyleBuild.run(FreeStyleBuild.java:43)
	at hudson.model.ResourceController.execute(ResourceController.java:97)
	at hudson.model.Executor.run(Executor.java:429)
No artifacts found that match the file pattern "**/*.events,heapdumps/**,**/hs_err_pid*". Configuration error?
Recording test results
[Checks API] No suitable checks publisher found.
Build step 'Publish JUnit test result report' changed build result to UNSTABLE
Email was triggered for: Unstable (Test Failures)
Sending email for trigger: Unstable (Test Failures)

[JENKINS] Solr » Solr-Check-main - Build # 2151 - Still Unstable!

Posted by Apache Jenkins Server <je...@builds.apache.org>.
Build: https://ci-builds.apache.org/job/Solr/job/Solr-Check-main/2151/

3 tests failed.
FAILED:  org.apache.solr.cloud.OverseerTest.testShardLeaderChange

Error Message:
com.carrotsearch.randomizedtesting.UncaughtExceptionError: Captured an uncaught exception in thread: Thread[id=10431, name=OverseerCollectionConfigSetProcessor-74619266513698845-127.0.0.1:46327_solr-n_0000000000, state=RUNNABLE, group=Overseer collection creation process.]

Stack Trace:
com.carrotsearch.randomizedtesting.UncaughtExceptionError: Captured an uncaught exception in thread: Thread[id=10431, name=OverseerCollectionConfigSetProcessor-74619266513698845-127.0.0.1:46327_solr-n_0000000000, state=RUNNABLE, group=Overseer collection creation process.]
	at __randomizedtesting.SeedInfo.seed([8691E1FA07A2B605:58C2660D1D3A43F4]:0)
Caused by: org.apache.solr.common.AlreadyClosedException
	at __randomizedtesting.SeedInfo.seed([8691E1FA07A2B605]:0)
	at app//org.apache.solr.common.cloud.ZkCmdExecutor.retryOperation(ZkCmdExecutor.java:77)
	at app//org.apache.solr.common.cloud.SolrZkClient.getData(SolrZkClient.java:343)
	at app//org.apache.solr.cloud.OverseerTaskProcessor.amILeader(OverseerTaskProcessor.java:454)
	at app//org.apache.solr.cloud.OverseerTaskProcessor.run(OverseerTaskProcessor.java:169)
	at java.base@11.0.11/java.lang.Thread.run(Thread.java:834)


FAILED:  org.apache.solr.handler.component.DistributedQueryComponentCustomSortTest.test

Error Message:
org.apache.solr.client.solrj.impl.BaseHttpSolrClient$RemoteSolrException: Error from server at https://127.0.0.1:35261/yk_j/bm/collection1: org.apache.solr.client.solrj.SolrServerException: Connection refused

Stack Trace:
org.apache.solr.client.solrj.impl.BaseHttpSolrClient$RemoteSolrException: Error from server at https://127.0.0.1:35261/yk_j/bm/collection1: org.apache.solr.client.solrj.SolrServerException: Connection refused
	at __randomizedtesting.SeedInfo.seed([8691E1FA07A2B605:EC5DE20A95EDBFD]:0)
	at app//org.apache.solr.client.solrj.impl.HttpSolrClient.executeMethod(HttpSolrClient.java:668)
	at app//org.apache.solr.client.solrj.impl.HttpSolrClient.request(HttpSolrClient.java:239)
	at app//org.apache.solr.client.solrj.impl.HttpSolrClient.request(HttpSolrClient.java:222)
	at app//org.apache.solr.client.solrj.SolrRequest.process(SolrRequest.java:226)
	at app//org.apache.solr.client.solrj.SolrClient.query(SolrClient.java:1004)
	at app//org.apache.solr.client.solrj.SolrClient.query(SolrClient.java:1019)
	at app//org.apache.solr.BaseDistributedSearchTestCase.queryServer(BaseDistributedSearchTestCase.java:623)
	at app//org.apache.solr.handler.component.DistributedQueryComponentCustomSortTest.queryAllowPartialResults(DistributedQueryComponentCustomSortTest.java:141)
	at app//org.apache.solr.handler.component.DistributedQueryComponentCustomSortTest.test(DistributedQueryComponentCustomSortTest.java:131)
	at java.base@11.0.11/jdk.internal.reflect.NativeMethodAccessorImpl.invoke0(Native Method)
	at java.base@11.0.11/jdk.internal.reflect.NativeMethodAccessorImpl.invoke(NativeMethodAccessorImpl.java:62)
	at java.base@11.0.11/jdk.internal.reflect.DelegatingMethodAccessorImpl.invoke(DelegatingMethodAccessorImpl.java:43)
	at java.base@11.0.11/java.lang.reflect.Method.invoke(Method.java:566)
	at app//com.carrotsearch.randomizedtesting.RandomizedRunner.invoke(RandomizedRunner.java:1754)
	at app//com.carrotsearch.randomizedtesting.RandomizedRunner$8.evaluate(RandomizedRunner.java:942)
	at app//com.carrotsearch.randomizedtesting.RandomizedRunner$9.evaluate(RandomizedRunner.java:978)
	at app//com.carrotsearch.randomizedtesting.RandomizedRunner$10.evaluate(RandomizedRunner.java:992)
	at app//org.apache.solr.BaseDistributedSearchTestCase$ShardsRepeatRule$ShardsFixedStatement.callStatement(BaseDistributedSearchTestCase.java:1081)
	at app//org.apache.solr.BaseDistributedSearchTestCase$ShardsRepeatRule$ShardsStatement.evaluate(BaseDistributedSearchTestCase.java:1052)
	at app//com.carrotsearch.randomizedtesting.rules.SystemPropertiesRestoreRule$1.evaluate(SystemPropertiesRestoreRule.java:57)
	at app//org.junit.rules.RunRules.evaluate(RunRules.java:20)
	at app//org.apache.lucene.util.TestRuleSetupTeardownChained$1.evaluate(TestRuleSetupTeardownChained.java:44)
	at app//org.apache.lucene.util.AbstractBeforeAfterRule$1.evaluate(AbstractBeforeAfterRule.java:43)
	at app//org.apache.lucene.util.TestRuleThreadAndTestName$1.evaluate(TestRuleThreadAndTestName.java:45)
	at app//org.apache.lucene.util.TestRuleIgnoreAfterMaxFailures$1.evaluate(TestRuleIgnoreAfterMaxFailures.java:60)
	at app//org.apache.lucene.util.TestRuleMarkFailure$1.evaluate(TestRuleMarkFailure.java:44)
	at app//org.junit.rules.RunRules.evaluate(RunRules.java:20)
	at app//com.carrotsearch.randomizedtesting.rules.StatementAdapter.evaluate(StatementAdapter.java:36)
	at app//com.carrotsearch.randomizedtesting.ThreadLeakControl$StatementRunner.run(ThreadLeakControl.java:370)
	at app//com.carrotsearch.randomizedtesting.ThreadLeakControl.forkTimeoutingTask(ThreadLeakControl.java:819)
	at app//com.carrotsearch.randomizedtesting.ThreadLeakControl$3.evaluate(ThreadLeakControl.java:470)
	at app//com.carrotsearch.randomizedtesting.RandomizedRunner.runSingleTest(RandomizedRunner.java:951)
	at app//com.carrotsearch.randomizedtesting.RandomizedRunner$5.evaluate(RandomizedRunner.java:836)
	at app//com.carrotsearch.randomizedtesting.RandomizedRunner$6.evaluate(RandomizedRunner.java:887)
	at app//com.carrotsearch.randomizedtesting.RandomizedRunner$7.evaluate(RandomizedRunner.java:898)
	at app//com.carrotsearch.randomizedtesting.rules.StatementAdapter.evaluate(StatementAdapter.java:36)
	at app//org.apache.lucene.util.AbstractBeforeAfterRule$1.evaluate(AbstractBeforeAfterRule.java:43)
	at app//org.apache.lucene.util.AbstractBeforeAfterRule$1.evaluate(AbstractBeforeAfterRule.java:43)
	at app//com.carrotsearch.randomizedtesting.rules.SystemPropertiesRestoreRule$1.evaluate(SystemPropertiesRestoreRule.java:57)
	at app//org.junit.rules.RunRules.evaluate(RunRules.java:20)
	at app//org.apache.lucene.util.AbstractBeforeAfterRule$1.evaluate(AbstractBeforeAfterRule.java:43)
	at app//com.carrotsearch.randomizedtesting.rules.StatementAdapter.evaluate(StatementAdapter.java:36)
	at app//org.apache.lucene.util.TestRuleStoreClassName$1.evaluate(TestRuleStoreClassName.java:38)
	at app//com.carrotsearch.randomizedtesting.rules.NoShadowingOrOverridesOnMethodsRule$1.evaluate(NoShadowingOrOverridesOnMethodsRule.java:40)
	at app//com.carrotsearch.randomizedtesting.rules.NoShadowingOrOverridesOnMethodsRule$1.evaluate(NoShadowingOrOverridesOnMethodsRule.java:40)
	at app//com.carrotsearch.randomizedtesting.rules.StatementAdapter.evaluate(StatementAdapter.java:36)
	at app//com.carrotsearch.randomizedtesting.rules.StatementAdapter.evaluate(StatementAdapter.java:36)
	at app//org.apache.lucene.util.TestRuleAssertionsRequired$1.evaluate(TestRuleAssertionsRequired.java:53)
	at app//org.apache.lucene.util.AbstractBeforeAfterRule$1.evaluate(AbstractBeforeAfterRule.java:43)
	at app//org.apache.lucene.util.TestRuleMarkFailure$1.evaluate(TestRuleMarkFailure.java:44)
	at app//org.apache.lucene.util.TestRuleIgnoreAfterMaxFailures$1.evaluate(TestRuleIgnoreAfterMaxFailures.java:60)
	at app//org.apache.lucene.util.TestRuleIgnoreTestSuites$1.evaluate(TestRuleIgnoreTestSuites.java:47)
	at app//org.junit.rules.RunRules.evaluate(RunRules.java:20)
	at app//com.carrotsearch.randomizedtesting.rules.StatementAdapter.evaluate(StatementAdapter.java:36)
	at app//com.carrotsearch.randomizedtesting.ThreadLeakControl$StatementRunner.run(ThreadLeakControl.java:370)
	at app//com.carrotsearch.randomizedtesting.ThreadLeakControl.lambda$forkTimeoutingTask$0(ThreadLeakControl.java:826)
	at java.base@11.0.11/java.lang.Thread.run(Thread.java:834)


FAILED:  org.apache.solr.client.solrj.impl.CloudHttp2SolrClientTest.testRetryUpdatesWhenClusterStateIsStale

Error Message:
java.lang.AssertionError: expected:<1> but was:<0>

Stack Trace:
java.lang.AssertionError: expected:<1> but was:<0>
	at __randomizedtesting.SeedInfo.seed([8691E1FA07A2B605:32A07912E44BC029]:0)
	at org.junit.Assert.fail(Assert.java:89)
	at org.junit.Assert.failNotEquals(Assert.java:835)
	at org.junit.Assert.assertEquals(Assert.java:647)
	at org.junit.Assert.assertEquals(Assert.java:633)
	at org.apache.solr.client.solrj.impl.CloudHttp2SolrClientTest.testRetryUpdatesWhenClusterStateIsStale(CloudHttp2SolrClientTest.java:930)
	at java.base/jdk.internal.reflect.NativeMethodAccessorImpl.invoke0(Native Method)
	at java.base/jdk.internal.reflect.NativeMethodAccessorImpl.invoke(NativeMethodAccessorImpl.java:62)
	at java.base/jdk.internal.reflect.DelegatingMethodAccessorImpl.invoke(DelegatingMethodAccessorImpl.java:43)
	at java.base/java.lang.reflect.Method.invoke(Method.java:566)
	at com.carrotsearch.randomizedtesting.RandomizedRunner.invoke(RandomizedRunner.java:1754)
	at com.carrotsearch.randomizedtesting.RandomizedRunner$8.evaluate(RandomizedRunner.java:942)
	at com.carrotsearch.randomizedtesting.RandomizedRunner$9.evaluate(RandomizedRunner.java:978)
	at com.carrotsearch.randomizedtesting.RandomizedRunner$10.evaluate(RandomizedRunner.java:992)
	at org.junit.rules.ExpectedException$ExpectedExceptionStatement.evaluate(ExpectedException.java:258)
	at com.carrotsearch.randomizedtesting.rules.SystemPropertiesRestoreRule$1.evaluate(SystemPropertiesRestoreRule.java:57)
	at org.junit.rules.RunRules.evaluate(RunRules.java:20)
	at org.apache.lucene.util.TestRuleSetupTeardownChained$1.evaluate(TestRuleSetupTeardownChained.java:44)
	at org.apache.lucene.util.AbstractBeforeAfterRule$1.evaluate(AbstractBeforeAfterRule.java:43)
	at org.apache.lucene.util.TestRuleThreadAndTestName$1.evaluate(TestRuleThreadAndTestName.java:45)
	at org.apache.lucene.util.TestRuleIgnoreAfterMaxFailures$1.evaluate(TestRuleIgnoreAfterMaxFailures.java:60)
	at org.apache.lucene.util.TestRuleMarkFailure$1.evaluate(TestRuleMarkFailure.java:44)
	at org.junit.rules.RunRules.evaluate(RunRules.java:20)
	at com.carrotsearch.randomizedtesting.rules.StatementAdapter.evaluate(StatementAdapter.java:36)
	at com.carrotsearch.randomizedtesting.ThreadLeakControl$StatementRunner.run(ThreadLeakControl.java:370)
	at com.carrotsearch.randomizedtesting.ThreadLeakControl.forkTimeoutingTask(ThreadLeakControl.java:819)
	at com.carrotsearch.randomizedtesting.ThreadLeakControl$3.evaluate(ThreadLeakControl.java:470)
	at com.carrotsearch.randomizedtesting.RandomizedRunner.runSingleTest(RandomizedRunner.java:951)
	at com.carrotsearch.randomizedtesting.RandomizedRunner$5.evaluate(RandomizedRunner.java:836)
	at com.carrotsearch.randomizedtesting.RandomizedRunner$6.evaluate(RandomizedRunner.java:887)
	at com.carrotsearch.randomizedtesting.RandomizedRunner$7.evaluate(RandomizedRunner.java:898)
	at com.carrotsearch.randomizedtesting.rules.StatementAdapter.evaluate(StatementAdapter.java:36)
	at org.apache.lucene.util.AbstractBeforeAfterRule$1.evaluate(AbstractBeforeAfterRule.java:43)
	at org.apache.lucene.util.AbstractBeforeAfterRule$1.evaluate(AbstractBeforeAfterRule.java:43)
	at com.carrotsearch.randomizedtesting.rules.SystemPropertiesRestoreRule$1.evaluate(SystemPropertiesRestoreRule.java:57)
	at org.junit.rules.RunRules.evaluate(RunRules.java:20)
	at org.apache.lucene.util.AbstractBeforeAfterRule$1.evaluate(AbstractBeforeAfterRule.java:43)
	at com.carrotsearch.randomizedtesting.rules.StatementAdapter.evaluate(StatementAdapter.java:36)
	at org.apache.lucene.util.TestRuleStoreClassName$1.evaluate(TestRuleStoreClassName.java:38)
	at com.carrotsearch.randomizedtesting.rules.NoShadowingOrOverridesOnMethodsRule$1.evaluate(NoShadowingOrOverridesOnMethodsRule.java:40)
	at com.carrotsearch.randomizedtesting.rules.NoShadowingOrOverridesOnMethodsRule$1.evaluate(NoShadowingOrOverridesOnMethodsRule.java:40)
	at com.carrotsearch.randomizedtesting.rules.StatementAdapter.evaluate(StatementAdapter.java:36)
	at com.carrotsearch.randomizedtesting.rules.StatementAdapter.evaluate(StatementAdapter.java:36)
	at org.apache.lucene.util.TestRuleAssertionsRequired$1.evaluate(TestRuleAssertionsRequired.java:53)
	at org.apache.lucene.util.AbstractBeforeAfterRule$1.evaluate(AbstractBeforeAfterRule.java:43)
	at org.apache.lucene.util.TestRuleMarkFailure$1.evaluate(TestRuleMarkFailure.java:44)
	at org.apache.lucene.util.TestRuleIgnoreAfterMaxFailures$1.evaluate(TestRuleIgnoreAfterMaxFailures.java:60)
	at org.apache.lucene.util.TestRuleIgnoreTestSuites$1.evaluate(TestRuleIgnoreTestSuites.java:47)
	at org.junit.rules.RunRules.evaluate(RunRules.java:20)
	at com.carrotsearch.randomizedtesting.rules.StatementAdapter.evaluate(StatementAdapter.java:36)
	at com.carrotsearch.randomizedtesting.ThreadLeakControl$StatementRunner.run(ThreadLeakControl.java:370)
	at com.carrotsearch.randomizedtesting.ThreadLeakControl.lambda$forkTimeoutingTask$0(ThreadLeakControl.java:826)
	at java.base/java.lang.Thread.run(Thread.java:834)




Build Log:
[...truncated 75592 lines...]
ERROR: The following test(s) have failed:
  - org.apache.solr.client.solrj.impl.CloudHttp2SolrClientTest.testRetryUpdatesWhenClusterStateIsStale (:solr:solrj)
    Test output: /home/jenkins/jenkins-slave/workspace/Solr/Solr-Check-main/solr/solrj/build/test-results/test/outputs/OUTPUT-org.apache.solr.client.solrj.impl.CloudHttp2SolrClientTest.txt
    Reproduce with: gradlew :solr:solrj:test --tests "org.apache.solr.client.solrj.impl.CloudHttp2SolrClientTest.testRetryUpdatesWhenClusterStateIsStale" -Ptests.jvms=4 -Ptests.haltonfailure=false -Ptests.jvmargs=-XX:TieredStopAtLevel=1 -Ptests.seed=8691E1FA07A2B605 -Ptests.multiplier=2 -Ptests.badapples=false -Ptests.file.encoding=US-ASCII

  - org.apache.solr.handler.component.DistributedQueryComponentCustomSortTest.test (:solr:core)
    Test output: /home/jenkins/jenkins-slave/workspace/Solr/Solr-Check-main/solr/core/build/test-results/test/outputs/OUTPUT-org.apache.solr.handler.component.DistributedQueryComponentCustomSortTest.txt
    Reproduce with: gradlew :solr:core:test --tests "org.apache.solr.handler.component.DistributedQueryComponentCustomSortTest.test" -Ptests.jvms=4 -Ptests.haltonfailure=false -Ptests.jvmargs=-XX:TieredStopAtLevel=1 -Ptests.seed=8691E1FA07A2B605 -Ptests.multiplier=2 -Ptests.badapples=false -Ptests.file.encoding=US-ASCII

  - org.apache.solr.cloud.OverseerTest.testShardLeaderChange (:solr:core)
    Test output: /home/jenkins/jenkins-slave/workspace/Solr/Solr-Check-main/solr/core/build/test-results/test/outputs/OUTPUT-org.apache.solr.cloud.OverseerTest.txt
    Reproduce with: gradlew :solr:core:test --tests "org.apache.solr.cloud.OverseerTest.testShardLeaderChange" -Ptests.jvms=4 -Ptests.haltonfailure=false -Ptests.jvmargs=-XX:TieredStopAtLevel=1 -Ptests.seed=8691E1FA07A2B605 -Ptests.multiplier=2 -Ptests.badapples=false -Ptests.file.encoding=US-ASCII


Deprecated Gradle features were used in this build, making it incompatible with Gradle 8.0.

You can use '--warning-mode all' to show the individual deprecation warnings and determine if they come from your own scripts or plugins.

See https://docs.gradle.org/7.2/userguide/command_line_interface.html#sec:command_line_warnings

BUILD SUCCESSFUL in 51m 51s
407 actionable tasks: 407 executed
Build step 'Invoke Gradle script' changed build result to SUCCESS
Archiving artifacts
java.lang.InterruptedException: no matches found within 10000
	at hudson.FilePath$ValidateAntFileMask.hasMatch(FilePath.java:3069)
	at hudson.FilePath$ValidateAntFileMask.invoke(FilePath.java:2948)
	at hudson.FilePath$ValidateAntFileMask.invoke(FilePath.java:2929)
	at hudson.FilePath$FileCallableWrapper.call(FilePath.java:3317)
Also:   hudson.remoting.Channel$CallSiteStackTrace: Remote call to lucene-solr-2
		at hudson.remoting.Channel.attachCallSiteStackTrace(Channel.java:1800)
		at hudson.remoting.UserRequest$ExceptionResponse.retrieve(UserRequest.java:356)
		at hudson.remoting.Channel.call(Channel.java:1001)
		at hudson.FilePath.act(FilePath.java:1159)
		at hudson.FilePath.act(FilePath.java:1148)
		at hudson.FilePath.validateAntFileMask(FilePath.java:2927)
		at hudson.tasks.ArtifactArchiver.perform(ArtifactArchiver.java:270)
		at hudson.tasks.BuildStepCompatibilityLayer.perform(BuildStepCompatibilityLayer.java:80)
		at hudson.tasks.BuildStepMonitor$1.perform(BuildStepMonitor.java:20)
		at hudson.model.AbstractBuild$AbstractBuildExecution.perform(AbstractBuild.java:803)
		at hudson.model.AbstractBuild$AbstractBuildExecution.performAllBuildSteps(AbstractBuild.java:752)
		at hudson.model.Build$BuildExecution.post2(Build.java:177)
		at hudson.model.AbstractBuild$AbstractBuildExecution.post(AbstractBuild.java:697)
		at hudson.model.Run.execute(Run.java:1931)
		at hudson.model.FreeStyleBuild.run(FreeStyleBuild.java:43)
		at hudson.model.ResourceController.execute(ResourceController.java:97)
		at hudson.model.Executor.run(Executor.java:429)
Caused: hudson.FilePath$TunneledInterruptedException
	at hudson.FilePath$FileCallableWrapper.call(FilePath.java:3319)
	at hudson.remoting.UserRequest.perform(UserRequest.java:211)
	at hudson.remoting.UserRequest.perform(UserRequest.java:54)
	at hudson.remoting.Request$2.run(Request.java:376)
	at hudson.remoting.InterceptingExecutorService.lambda$wrap$0(InterceptingExecutorService.java:78)
	at java.util.concurrent.FutureTask.run(FutureTask.java:266)
	at java.util.concurrent.ThreadPoolExecutor.runWorker(ThreadPoolExecutor.java:1149)
	at java.util.concurrent.ThreadPoolExecutor$Worker.run(ThreadPoolExecutor.java:624)
	at java.lang.Thread.run(Thread.java:748)
Caused: java.lang.InterruptedException: java.lang.InterruptedException: no matches found within 10000
	at hudson.FilePath.act(FilePath.java:1161)
	at hudson.FilePath.act(FilePath.java:1148)
	at hudson.FilePath.validateAntFileMask(FilePath.java:2927)
	at hudson.tasks.ArtifactArchiver.perform(ArtifactArchiver.java:270)
	at hudson.tasks.BuildStepCompatibilityLayer.perform(BuildStepCompatibilityLayer.java:80)
	at hudson.tasks.BuildStepMonitor$1.perform(BuildStepMonitor.java:20)
	at hudson.model.AbstractBuild$AbstractBuildExecution.perform(AbstractBuild.java:803)
	at hudson.model.AbstractBuild$AbstractBuildExecution.performAllBuildSteps(AbstractBuild.java:752)
	at hudson.model.Build$BuildExecution.post2(Build.java:177)
	at hudson.model.AbstractBuild$AbstractBuildExecution.post(AbstractBuild.java:697)
	at hudson.model.Run.execute(Run.java:1931)
	at hudson.model.FreeStyleBuild.run(FreeStyleBuild.java:43)
	at hudson.model.ResourceController.execute(ResourceController.java:97)
	at hudson.model.Executor.run(Executor.java:429)
No artifacts found that match the file pattern "**/*.events,heapdumps/**,**/hs_err_pid*". Configuration error?
Recording test results
[Checks API] No suitable checks publisher found.
Build step 'Publish JUnit test result report' changed build result to UNSTABLE
Email was triggered for: Unstable (Test Failures)
Sending email for trigger: Unstable (Test Failures)

[JENKINS] Solr » Solr-Check-main - Build # 2150 - Still Unstable!

Posted by Apache Jenkins Server <je...@builds.apache.org>.
Build: https://ci-builds.apache.org/job/Solr/job/Solr-Check-main/2150/

2 tests failed.
FAILED:  org.apache.solr.cloud.TestLeaderElectionZkExpiry.classMethod

Error Message:
com.carrotsearch.randomizedtesting.ThreadLeakError: 5 threads leaked from SUITE scope at org.apache.solr.cloud.TestLeaderElectionZkExpiry: 
   1) Thread[id=13034, name=zkConnectionManagerCallback-9093-thread-1-EventThread, state=BLOCKED, group=TGRP-TestLeaderElectionZkExpiry]
        at app//org.apache.solr.common.cloud.ZkStateReader.createClusterStateWatchersAndUpdate(ZkStateReader.java:393)
        at app//org.apache.solr.cloud.ZkController$1.command(ZkController.java:334)
        at app//org.apache.solr.common.cloud.ConnectionManager$1.update(ConnectionManager.java:170)
        at app//org.apache.solr.common.cloud.DefaultConnectionStrategy.reconnect(DefaultConnectionStrategy.java:57)
        at app//org.apache.solr.common.cloud.ConnectionManager.process(ConnectionManager.java:152)
        at app//org.apache.zookeeper.ClientCnxn$EventThread.processEvent(ClientCnxn.java:580)
        at app//org.apache.zookeeper.ClientCnxn$EventThread.run(ClientCnxn.java:555)
   2) Thread[id=13048, name=zkConnectionManagerCallback-9093-thread-1-EventThread, state=BLOCKED, group=TGRP-TestLeaderElectionZkExpiry]
        at app//org.apache.solr.common.cloud.ZkStateReader.createClusterStateWatchersAndUpdate(ZkStateReader.java:393)
        at app//org.apache.solr.cloud.ZkController$1.command(ZkController.java:334)
        at app//org.apache.solr.common.cloud.ConnectionManager$1.update(ConnectionManager.java:170)
        at app//org.apache.solr.common.cloud.DefaultConnectionStrategy.reconnect(DefaultConnectionStrategy.java:57)
        at app//org.apache.solr.common.cloud.ConnectionManager.process(ConnectionManager.java:152)
        at app//org.apache.zookeeper.ClientCnxn$EventThread.processEvent(ClientCnxn.java:580)
        at app//org.apache.zookeeper.ClientCnxn$EventThread.run(ClientCnxn.java:555)
   3) Thread[id=13036, name=zkConnectionManagerCallback-9093-thread-1-EventThread, state=BLOCKED, group=TGRP-TestLeaderElectionZkExpiry]
        at app//org.apache.solr.common.cloud.ZkStateReader.createClusterStateWatchersAndUpdate(ZkStateReader.java:393)
        at app//org.apache.solr.cloud.ZkController$1.command(ZkController.java:334)
        at app//org.apache.solr.common.cloud.ConnectionManager$1.update(ConnectionManager.java:170)
        at app//org.apache.solr.common.cloud.DefaultConnectionStrategy.reconnect(DefaultConnectionStrategy.java:57)
        at app//org.apache.solr.common.cloud.ConnectionManager.process(ConnectionManager.java:152)
        at app//org.apache.zookeeper.ClientCnxn$EventThread.processEvent(ClientCnxn.java:580)
        at app//org.apache.zookeeper.ClientCnxn$EventThread.run(ClientCnxn.java:555)
   4) Thread[id=13038, name=zkConnectionManagerCallback-9093-thread-1-EventThread, state=BLOCKED, group=TGRP-TestLeaderElectionZkExpiry]
        at app//org.apache.solr.common.cloud.ZkStateReader.createClusterStateWatchersAndUpdate(ZkStateReader.java:393)
        at app//org.apache.solr.cloud.ZkController$1.command(ZkController.java:334)
        at app//org.apache.solr.common.cloud.ConnectionManager$1.update(ConnectionManager.java:170)
        at app//org.apache.solr.common.cloud.DefaultConnectionStrategy.reconnect(DefaultConnectionStrategy.java:57)
        at app//org.apache.solr.common.cloud.ConnectionManager.process(ConnectionManager.java:152)
        at app//org.apache.zookeeper.ClientCnxn$EventThread.processEvent(ClientCnxn.java:580)
        at app//org.apache.zookeeper.ClientCnxn$EventThread.run(ClientCnxn.java:555)
   5) Thread[id=13040, name=zkConnectionManagerCallback-9093-thread-1-EventThread, state=BLOCKED, group=TGRP-TestLeaderElectionZkExpiry]
        at app//org.apache.solr.common.cloud.ZkStateReader.createClusterStateWatchersAndUpdate(ZkStateReader.java:393)
        at app//org.apache.solr.cloud.ZkController$1.command(ZkController.java:334)
        at app//org.apache.solr.common.cloud.ConnectionManager$1.update(ConnectionManager.java:170)
        at app//org.apache.solr.common.cloud.DefaultConnectionStrategy.reconnect(DefaultConnectionStrategy.java:57)
        at app//org.apache.solr.common.cloud.ConnectionManager.process(ConnectionManager.java:152)
        at app//org.apache.zookeeper.ClientCnxn$EventThread.processEvent(ClientCnxn.java:580)
        at app//org.apache.zookeeper.ClientCnxn$EventThread.run(ClientCnxn.java:555)

Stack Trace:
com.carrotsearch.randomizedtesting.ThreadLeakError: 5 threads leaked from SUITE scope at org.apache.solr.cloud.TestLeaderElectionZkExpiry: 
   1) Thread[id=13034, name=zkConnectionManagerCallback-9093-thread-1-EventThread, state=BLOCKED, group=TGRP-TestLeaderElectionZkExpiry]
        at app//org.apache.solr.common.cloud.ZkStateReader.createClusterStateWatchersAndUpdate(ZkStateReader.java:393)
        at app//org.apache.solr.cloud.ZkController$1.command(ZkController.java:334)
        at app//org.apache.solr.common.cloud.ConnectionManager$1.update(ConnectionManager.java:170)
        at app//org.apache.solr.common.cloud.DefaultConnectionStrategy.reconnect(DefaultConnectionStrategy.java:57)
        at app//org.apache.solr.common.cloud.ConnectionManager.process(ConnectionManager.java:152)
        at app//org.apache.zookeeper.ClientCnxn$EventThread.processEvent(ClientCnxn.java:580)
        at app//org.apache.zookeeper.ClientCnxn$EventThread.run(ClientCnxn.java:555)
   2) Thread[id=13048, name=zkConnectionManagerCallback-9093-thread-1-EventThread, state=BLOCKED, group=TGRP-TestLeaderElectionZkExpiry]
        at app//org.apache.solr.common.cloud.ZkStateReader.createClusterStateWatchersAndUpdate(ZkStateReader.java:393)
        at app//org.apache.solr.cloud.ZkController$1.command(ZkController.java:334)
        at app//org.apache.solr.common.cloud.ConnectionManager$1.update(ConnectionManager.java:170)
        at app//org.apache.solr.common.cloud.DefaultConnectionStrategy.reconnect(DefaultConnectionStrategy.java:57)
        at app//org.apache.solr.common.cloud.ConnectionManager.process(ConnectionManager.java:152)
        at app//org.apache.zookeeper.ClientCnxn$EventThread.processEvent(ClientCnxn.java:580)
        at app//org.apache.zookeeper.ClientCnxn$EventThread.run(ClientCnxn.java:555)
   3) Thread[id=13036, name=zkConnectionManagerCallback-9093-thread-1-EventThread, state=BLOCKED, group=TGRP-TestLeaderElectionZkExpiry]
        at app//org.apache.solr.common.cloud.ZkStateReader.createClusterStateWatchersAndUpdate(ZkStateReader.java:393)
        at app//org.apache.solr.cloud.ZkController$1.command(ZkController.java:334)
        at app//org.apache.solr.common.cloud.ConnectionManager$1.update(ConnectionManager.java:170)
        at app//org.apache.solr.common.cloud.DefaultConnectionStrategy.reconnect(DefaultConnectionStrategy.java:57)
        at app//org.apache.solr.common.cloud.ConnectionManager.process(ConnectionManager.java:152)
        at app//org.apache.zookeeper.ClientCnxn$EventThread.processEvent(ClientCnxn.java:580)
        at app//org.apache.zookeeper.ClientCnxn$EventThread.run(ClientCnxn.java:555)
   4) Thread[id=13038, name=zkConnectionManagerCallback-9093-thread-1-EventThread, state=BLOCKED, group=TGRP-TestLeaderElectionZkExpiry]
        at app//org.apache.solr.common.cloud.ZkStateReader.createClusterStateWatchersAndUpdate(ZkStateReader.java:393)
        at app//org.apache.solr.cloud.ZkController$1.command(ZkController.java:334)
        at app//org.apache.solr.common.cloud.ConnectionManager$1.update(ConnectionManager.java:170)
        at app//org.apache.solr.common.cloud.DefaultConnectionStrategy.reconnect(DefaultConnectionStrategy.java:57)
        at app//org.apache.solr.common.cloud.ConnectionManager.process(ConnectionManager.java:152)
        at app//org.apache.zookeeper.ClientCnxn$EventThread.processEvent(ClientCnxn.java:580)
        at app//org.apache.zookeeper.ClientCnxn$EventThread.run(ClientCnxn.java:555)
   5) Thread[id=13040, name=zkConnectionManagerCallback-9093-thread-1-EventThread, state=BLOCKED, group=TGRP-TestLeaderElectionZkExpiry]
        at app//org.apache.solr.common.cloud.ZkStateReader.createClusterStateWatchersAndUpdate(ZkStateReader.java:393)
        at app//org.apache.solr.cloud.ZkController$1.command(ZkController.java:334)
        at app//org.apache.solr.common.cloud.ConnectionManager$1.update(ConnectionManager.java:170)
        at app//org.apache.solr.common.cloud.DefaultConnectionStrategy.reconnect(DefaultConnectionStrategy.java:57)
        at app//org.apache.solr.common.cloud.ConnectionManager.process(ConnectionManager.java:152)
        at app//org.apache.zookeeper.ClientCnxn$EventThread.processEvent(ClientCnxn.java:580)
        at app//org.apache.zookeeper.ClientCnxn$EventThread.run(ClientCnxn.java:555)
	at __randomizedtesting.SeedInfo.seed([7C440F02F396D621]:0)


FAILED:  org.apache.solr.cloud.api.collections.TestCollectionAPI.test

Error Message:
org.apache.solr.client.solrj.SolrServerException: IOException occurred when talking to server at: http://127.0.0.1:32857

Stack Trace:
org.apache.solr.client.solrj.SolrServerException: IOException occurred when talking to server at: http://127.0.0.1:32857
	at __randomizedtesting.SeedInfo.seed([7C440F02F396D621:F41030D85D6ABBD9]:0)
	at app//org.apache.solr.client.solrj.impl.HttpSolrClient.executeMethod(HttpSolrClient.java:682)
	at app//org.apache.solr.client.solrj.impl.HttpSolrClient.request(HttpSolrClient.java:239)
	at app//org.apache.solr.client.solrj.impl.HttpSolrClient.request(HttpSolrClient.java:222)
	at app//org.apache.solr.client.solrj.impl.LBSolrClient.doRequest(LBSolrClient.java:389)
	at app//org.apache.solr.client.solrj.impl.LBSolrClient.request(LBSolrClient.java:359)
	at app//org.apache.solr.client.solrj.impl.BaseCloudSolrClient.sendRequest(BaseCloudSolrClient.java:1132)
	at app//org.apache.solr.client.solrj.impl.BaseCloudSolrClient.requestWithRetryOnStaleState(BaseCloudSolrClient.java:898)
	at app//org.apache.solr.client.solrj.impl.BaseCloudSolrClient.request(BaseCloudSolrClient.java:832)
	at app//org.apache.solr.client.solrj.SolrRequest.process(SolrRequest.java:226)
	at app//org.apache.solr.client.solrj.SolrRequest.process(SolrRequest.java:243)
	at app//org.apache.solr.cloud.api.collections.TestCollectionAPI.clusterStatusWithCollectionHealthState(TestCollectionAPI.java:381)
	at app//org.apache.solr.cloud.api.collections.TestCollectionAPI.test(TestCollectionAPI.java:96)
	at java.base@11.0.11/jdk.internal.reflect.NativeMethodAccessorImpl.invoke0(Native Method)
	at java.base@11.0.11/jdk.internal.reflect.NativeMethodAccessorImpl.invoke(NativeMethodAccessorImpl.java:62)
	at java.base@11.0.11/jdk.internal.reflect.DelegatingMethodAccessorImpl.invoke(DelegatingMethodAccessorImpl.java:43)
	at java.base@11.0.11/java.lang.reflect.Method.invoke(Method.java:566)
	at app//com.carrotsearch.randomizedtesting.RandomizedRunner.invoke(RandomizedRunner.java:1754)
	at app//com.carrotsearch.randomizedtesting.RandomizedRunner$8.evaluate(RandomizedRunner.java:942)
	at app//com.carrotsearch.randomizedtesting.RandomizedRunner$9.evaluate(RandomizedRunner.java:978)
	at app//com.carrotsearch.randomizedtesting.RandomizedRunner$10.evaluate(RandomizedRunner.java:992)
	at app//org.apache.solr.BaseDistributedSearchTestCase$ShardsRepeatRule$ShardsFixedStatement.callStatement(BaseDistributedSearchTestCase.java:1081)
	at app//org.apache.solr.BaseDistributedSearchTestCase$ShardsRepeatRule$ShardsStatement.evaluate(BaseDistributedSearchTestCase.java:1052)
	at app//com.carrotsearch.randomizedtesting.rules.SystemPropertiesRestoreRule$1.evaluate(SystemPropertiesRestoreRule.java:57)
	at app//org.junit.rules.RunRules.evaluate(RunRules.java:20)
	at app//org.apache.lucene.util.TestRuleSetupTeardownChained$1.evaluate(TestRuleSetupTeardownChained.java:44)
	at app//org.apache.lucene.util.AbstractBeforeAfterRule$1.evaluate(AbstractBeforeAfterRule.java:43)
	at app//org.apache.lucene.util.TestRuleThreadAndTestName$1.evaluate(TestRuleThreadAndTestName.java:45)
	at app//org.apache.lucene.util.TestRuleIgnoreAfterMaxFailures$1.evaluate(TestRuleIgnoreAfterMaxFailures.java:60)
	at app//org.apache.lucene.util.TestRuleMarkFailure$1.evaluate(TestRuleMarkFailure.java:44)
	at app//org.junit.rules.RunRules.evaluate(RunRules.java:20)
	at app//com.carrotsearch.randomizedtesting.rules.StatementAdapter.evaluate(StatementAdapter.java:36)
	at app//com.carrotsearch.randomizedtesting.ThreadLeakControl$StatementRunner.run(ThreadLeakControl.java:370)
	at app//com.carrotsearch.randomizedtesting.ThreadLeakControl.forkTimeoutingTask(ThreadLeakControl.java:819)
	at app//com.carrotsearch.randomizedtesting.ThreadLeakControl$3.evaluate(ThreadLeakControl.java:470)
	at app//com.carrotsearch.randomizedtesting.RandomizedRunner.runSingleTest(RandomizedRunner.java:951)
	at app//com.carrotsearch.randomizedtesting.RandomizedRunner$5.evaluate(RandomizedRunner.java:836)
	at app//com.carrotsearch.randomizedtesting.RandomizedRunner$6.evaluate(RandomizedRunner.java:887)
	at app//com.carrotsearch.randomizedtesting.RandomizedRunner$7.evaluate(RandomizedRunner.java:898)
	at app//com.carrotsearch.randomizedtesting.rules.StatementAdapter.evaluate(StatementAdapter.java:36)
	at app//org.apache.lucene.util.AbstractBeforeAfterRule$1.evaluate(AbstractBeforeAfterRule.java:43)
	at app//org.apache.lucene.util.AbstractBeforeAfterRule$1.evaluate(AbstractBeforeAfterRule.java:43)
	at app//com.carrotsearch.randomizedtesting.rules.SystemPropertiesRestoreRule$1.evaluate(SystemPropertiesRestoreRule.java:57)
	at app//org.junit.rules.RunRules.evaluate(RunRules.java:20)
	at app//org.apache.lucene.util.AbstractBeforeAfterRule$1.evaluate(AbstractBeforeAfterRule.java:43)
	at app//com.carrotsearch.randomizedtesting.rules.StatementAdapter.evaluate(StatementAdapter.java:36)
	at app//org.apache.lucene.util.TestRuleStoreClassName$1.evaluate(TestRuleStoreClassName.java:38)
	at app//com.carrotsearch.randomizedtesting.rules.NoShadowingOrOverridesOnMethodsRule$1.evaluate(NoShadowingOrOverridesOnMethodsRule.java:40)
	at app//com.carrotsearch.randomizedtesting.rules.NoShadowingOrOverridesOnMethodsRule$1.evaluate(NoShadowingOrOverridesOnMethodsRule.java:40)
	at app//com.carrotsearch.randomizedtesting.rules.StatementAdapter.evaluate(StatementAdapter.java:36)
	at app//com.carrotsearch.randomizedtesting.rules.StatementAdapter.evaluate(StatementAdapter.java:36)
	at app//org.apache.lucene.util.TestRuleAssertionsRequired$1.evaluate(TestRuleAssertionsRequired.java:53)
	at app//org.apache.lucene.util.AbstractBeforeAfterRule$1.evaluate(AbstractBeforeAfterRule.java:43)
	at app//org.apache.lucene.util.TestRuleMarkFailure$1.evaluate(TestRuleMarkFailure.java:44)
	at app//org.apache.lucene.util.TestRuleIgnoreAfterMaxFailures$1.evaluate(TestRuleIgnoreAfterMaxFailures.java:60)
	at app//org.apache.lucene.util.TestRuleIgnoreTestSuites$1.evaluate(TestRuleIgnoreTestSuites.java:47)
	at app//org.junit.rules.RunRules.evaluate(RunRules.java:20)
	at app//com.carrotsearch.randomizedtesting.rules.StatementAdapter.evaluate(StatementAdapter.java:36)
	at app//com.carrotsearch.randomizedtesting.ThreadLeakControl$StatementRunner.run(ThreadLeakControl.java:370)
	at app//com.carrotsearch.randomizedtesting.ThreadLeakControl.lambda$forkTimeoutingTask$0(ThreadLeakControl.java:826)
	at java.base@11.0.11/java.lang.Thread.run(Thread.java:834)
Caused by: org.apache.http.NoHttpResponseException: 127.0.0.1:32857 failed to respond
	at app//org.apache.http.impl.conn.DefaultHttpResponseParser.parseHead(DefaultHttpResponseParser.java:141)
	at app//org.apache.http.impl.conn.DefaultHttpResponseParser.parseHead(DefaultHttpResponseParser.java:56)
	at app//org.apache.http.impl.io.AbstractMessageParser.parse(AbstractMessageParser.java:259)
	at app//org.apache.http.impl.DefaultBHttpClientConnection.receiveResponseHeader(DefaultBHttpClientConnection.java:163)
	at app//org.apache.http.impl.conn.CPoolProxy.receiveResponseHeader(CPoolProxy.java:157)
	at app//org.apache.http.protocol.HttpRequestExecutor.doReceiveResponse(HttpRequestExecutor.java:273)
	at app//org.apache.http.protocol.HttpRequestExecutor.execute(HttpRequestExecutor.java:125)
	at app//org.apache.http.impl.execchain.MainClientExec.execute(MainClientExec.java:272)
	at app//org.apache.http.impl.execchain.ProtocolExec.execute(ProtocolExec.java:186)
	at app//org.apache.http.impl.execchain.RetryExec.execute(RetryExec.java:89)
	at app//org.apache.http.impl.execchain.RedirectExec.execute(RedirectExec.java:110)
	at app//org.apache.http.impl.client.InternalHttpClient.doExecute(InternalHttpClient.java:185)
	at app//org.apache.http.impl.client.CloseableHttpClient.execute(CloseableHttpClient.java:83)
	at app//org.apache.http.impl.client.CloseableHttpClient.execute(CloseableHttpClient.java:56)
	at app//org.apache.solr.client.solrj.impl.HttpSolrClient.executeMethod(HttpSolrClient.java:551)
	... 59 more




Build Log:
[...truncated 4077 lines...]
ERROR: The following test(s) have failed:
  - org.apache.solr.cloud.TestLeaderElectionZkExpiry.classMethod (:solr:core)
    Test output: /home/jenkins/jenkins-slave/workspace/Solr/Solr-Check-main/solr/core/build/test-results/test/outputs/OUTPUT-org.apache.solr.cloud.TestLeaderElectionZkExpiry.txt
    Reproduce with: gradlew :solr:core:test --tests "org.apache.solr.cloud.TestLeaderElectionZkExpiry.classMethod" -Ptests.jvms=4 -Ptests.haltonfailure=false -Ptests.jvmargs=-XX:TieredStopAtLevel=1 -Ptests.seed=7C440F02F396D621 -Ptests.multiplier=2 -Ptests.badapples=false -Ptests.file.encoding=US-ASCII

  - org.apache.solr.cloud.api.collections.TestCollectionAPI.test (:solr:core)
    Test output: /home/jenkins/jenkins-slave/workspace/Solr/Solr-Check-main/solr/core/build/test-results/test/outputs/OUTPUT-org.apache.solr.cloud.api.collections.TestCollectionAPI.txt
    Reproduce with: gradlew :solr:core:test --tests "org.apache.solr.cloud.api.collections.TestCollectionAPI.test" -Ptests.jvms=4 -Ptests.haltonfailure=false -Ptests.jvmargs=-XX:TieredStopAtLevel=1 -Ptests.seed=7C440F02F396D621 -Ptests.multiplier=2 -Ptests.badapples=false -Ptests.file.encoding=US-ASCII


Deprecated Gradle features were used in this build, making it incompatible with Gradle 8.0.

You can use '--warning-mode all' to show the individual deprecation warnings and determine if they come from your own scripts or plugins.

See https://docs.gradle.org/7.2/userguide/command_line_interface.html#sec:command_line_warnings

BUILD SUCCESSFUL in 48m 48s
407 actionable tasks: 407 executed
Build step 'Invoke Gradle script' changed build result to SUCCESS
Archiving artifacts
java.lang.InterruptedException: no matches found within 10000
	at hudson.FilePath$ValidateAntFileMask.hasMatch(FilePath.java:3069)
	at hudson.FilePath$ValidateAntFileMask.invoke(FilePath.java:2948)
	at hudson.FilePath$ValidateAntFileMask.invoke(FilePath.java:2929)
	at hudson.FilePath$FileCallableWrapper.call(FilePath.java:3317)
Also:   hudson.remoting.Channel$CallSiteStackTrace: Remote call to lucene-solr-2
		at hudson.remoting.Channel.attachCallSiteStackTrace(Channel.java:1800)
		at hudson.remoting.UserRequest$ExceptionResponse.retrieve(UserRequest.java:356)
		at hudson.remoting.Channel.call(Channel.java:1001)
		at hudson.FilePath.act(FilePath.java:1159)
		at hudson.FilePath.act(FilePath.java:1148)
		at hudson.FilePath.validateAntFileMask(FilePath.java:2927)
		at hudson.tasks.ArtifactArchiver.perform(ArtifactArchiver.java:270)
		at hudson.tasks.BuildStepCompatibilityLayer.perform(BuildStepCompatibilityLayer.java:80)
		at hudson.tasks.BuildStepMonitor$1.perform(BuildStepMonitor.java:20)
		at hudson.model.AbstractBuild$AbstractBuildExecution.perform(AbstractBuild.java:803)
		at hudson.model.AbstractBuild$AbstractBuildExecution.performAllBuildSteps(AbstractBuild.java:752)
		at hudson.model.Build$BuildExecution.post2(Build.java:177)
		at hudson.model.AbstractBuild$AbstractBuildExecution.post(AbstractBuild.java:697)
		at hudson.model.Run.execute(Run.java:1931)
		at hudson.model.FreeStyleBuild.run(FreeStyleBuild.java:43)
		at hudson.model.ResourceController.execute(ResourceController.java:97)
		at hudson.model.Executor.run(Executor.java:429)
Caused: hudson.FilePath$TunneledInterruptedException
	at hudson.FilePath$FileCallableWrapper.call(FilePath.java:3319)
	at hudson.remoting.UserRequest.perform(UserRequest.java:211)
	at hudson.remoting.UserRequest.perform(UserRequest.java:54)
	at hudson.remoting.Request$2.run(Request.java:376)
	at hudson.remoting.InterceptingExecutorService.lambda$wrap$0(InterceptingExecutorService.java:78)
	at java.util.concurrent.FutureTask.run(FutureTask.java:266)
	at java.util.concurrent.ThreadPoolExecutor.runWorker(ThreadPoolExecutor.java:1149)
	at java.util.concurrent.ThreadPoolExecutor$Worker.run(ThreadPoolExecutor.java:624)
	at java.lang.Thread.run(Thread.java:748)
Caused: java.lang.InterruptedException: java.lang.InterruptedException: no matches found within 10000
	at hudson.FilePath.act(FilePath.java:1161)
	at hudson.FilePath.act(FilePath.java:1148)
	at hudson.FilePath.validateAntFileMask(FilePath.java:2927)
	at hudson.tasks.ArtifactArchiver.perform(ArtifactArchiver.java:270)
	at hudson.tasks.BuildStepCompatibilityLayer.perform(BuildStepCompatibilityLayer.java:80)
	at hudson.tasks.BuildStepMonitor$1.perform(BuildStepMonitor.java:20)
	at hudson.model.AbstractBuild$AbstractBuildExecution.perform(AbstractBuild.java:803)
	at hudson.model.AbstractBuild$AbstractBuildExecution.performAllBuildSteps(AbstractBuild.java:752)
	at hudson.model.Build$BuildExecution.post2(Build.java:177)
	at hudson.model.AbstractBuild$AbstractBuildExecution.post(AbstractBuild.java:697)
	at hudson.model.Run.execute(Run.java:1931)
	at hudson.model.FreeStyleBuild.run(FreeStyleBuild.java:43)
	at hudson.model.ResourceController.execute(ResourceController.java:97)
	at hudson.model.Executor.run(Executor.java:429)
No artifacts found that match the file pattern "**/*.events,heapdumps/**,**/hs_err_pid*". Configuration error?
Recording test results
[Checks API] No suitable checks publisher found.
Build step 'Publish JUnit test result report' changed build result to UNSTABLE
Email was triggered for: Unstable (Test Failures)
Sending email for trigger: Unstable (Test Failures)

[JENKINS] Solr » Solr-Check-main - Build # 2149 - Still Unstable!

Posted by Apache Jenkins Server <je...@builds.apache.org>.
Build: https://ci-builds.apache.org/job/Solr/job/Solr-Check-main/2149/

5 tests failed.
FAILED:  org.apache.solr.cloud.TestConfigSetsAPI.testUploadLegacyManagedSchemaFile

Error Message:
java.util.concurrent.TimeoutException: Timed out waiting for all collections to be fully removed.

Stack Trace:
java.util.concurrent.TimeoutException: Timed out waiting for all collections to be fully removed.
	at org.apache.solr.cloud.MiniSolrCloudCluster.deleteAllCollections(MiniSolrCloudCluster.java:577)
	at org.apache.solr.cloud.TestConfigSetsAPI.tearDown(TestConfigSetsAPI.java:136)
	at java.base/jdk.internal.reflect.NativeMethodAccessorImpl.invoke0(Native Method)
	at java.base/jdk.internal.reflect.NativeMethodAccessorImpl.invoke(NativeMethodAccessorImpl.java:62)
	at java.base/jdk.internal.reflect.DelegatingMethodAccessorImpl.invoke(DelegatingMethodAccessorImpl.java:43)
	at java.base/java.lang.reflect.Method.invoke(Method.java:566)
	at com.carrotsearch.randomizedtesting.RandomizedRunner.invoke(RandomizedRunner.java:1754)
	at com.carrotsearch.randomizedtesting.RandomizedRunner$10.evaluate(RandomizedRunner.java:1000)
	at com.carrotsearch.randomizedtesting.rules.SystemPropertiesRestoreRule$1.evaluate(SystemPropertiesRestoreRule.java:57)
	at org.junit.rules.RunRules.evaluate(RunRules.java:20)
	at org.apache.lucene.util.TestRuleSetupTeardownChained$1.evaluate(TestRuleSetupTeardownChained.java:44)
	at org.apache.lucene.util.AbstractBeforeAfterRule$1.evaluate(AbstractBeforeAfterRule.java:43)
	at org.apache.lucene.util.TestRuleThreadAndTestName$1.evaluate(TestRuleThreadAndTestName.java:45)
	at org.apache.lucene.util.TestRuleIgnoreAfterMaxFailures$1.evaluate(TestRuleIgnoreAfterMaxFailures.java:60)
	at org.apache.lucene.util.TestRuleMarkFailure$1.evaluate(TestRuleMarkFailure.java:44)
	at org.junit.rules.RunRules.evaluate(RunRules.java:20)
	at com.carrotsearch.randomizedtesting.rules.StatementAdapter.evaluate(StatementAdapter.java:36)
	at com.carrotsearch.randomizedtesting.ThreadLeakControl$StatementRunner.run(ThreadLeakControl.java:370)
	at com.carrotsearch.randomizedtesting.ThreadLeakControl.forkTimeoutingTask(ThreadLeakControl.java:819)
	at com.carrotsearch.randomizedtesting.ThreadLeakControl$3.evaluate(ThreadLeakControl.java:470)
	at com.carrotsearch.randomizedtesting.RandomizedRunner.runSingleTest(RandomizedRunner.java:951)
	at com.carrotsearch.randomizedtesting.RandomizedRunner$5.evaluate(RandomizedRunner.java:836)
	at com.carrotsearch.randomizedtesting.RandomizedRunner$6.evaluate(RandomizedRunner.java:887)
	at com.carrotsearch.randomizedtesting.RandomizedRunner$7.evaluate(RandomizedRunner.java:898)
	at com.carrotsearch.randomizedtesting.rules.StatementAdapter.evaluate(StatementAdapter.java:36)
	at org.apache.lucene.util.AbstractBeforeAfterRule$1.evaluate(AbstractBeforeAfterRule.java:43)
	at org.apache.lucene.util.AbstractBeforeAfterRule$1.evaluate(AbstractBeforeAfterRule.java:43)
	at com.carrotsearch.randomizedtesting.rules.SystemPropertiesRestoreRule$1.evaluate(SystemPropertiesRestoreRule.java:57)
	at org.junit.rules.RunRules.evaluate(RunRules.java:20)
	at org.apache.lucene.util.AbstractBeforeAfterRule$1.evaluate(AbstractBeforeAfterRule.java:43)
	at com.carrotsearch.randomizedtesting.rules.StatementAdapter.evaluate(StatementAdapter.java:36)
	at org.apache.lucene.util.TestRuleStoreClassName$1.evaluate(TestRuleStoreClassName.java:38)
	at com.carrotsearch.randomizedtesting.rules.NoShadowingOrOverridesOnMethodsRule$1.evaluate(NoShadowingOrOverridesOnMethodsRule.java:40)
	at com.carrotsearch.randomizedtesting.rules.NoShadowingOrOverridesOnMethodsRule$1.evaluate(NoShadowingOrOverridesOnMethodsRule.java:40)
	at com.carrotsearch.randomizedtesting.rules.StatementAdapter.evaluate(StatementAdapter.java:36)
	at com.carrotsearch.randomizedtesting.rules.StatementAdapter.evaluate(StatementAdapter.java:36)
	at org.apache.lucene.util.TestRuleAssertionsRequired$1.evaluate(TestRuleAssertionsRequired.java:53)
	at org.apache.lucene.util.AbstractBeforeAfterRule$1.evaluate(AbstractBeforeAfterRule.java:43)
	at org.apache.lucene.util.TestRuleMarkFailure$1.evaluate(TestRuleMarkFailure.java:44)
	at org.apache.lucene.util.TestRuleIgnoreAfterMaxFailures$1.evaluate(TestRuleIgnoreAfterMaxFailures.java:60)
	at org.apache.lucene.util.TestRuleIgnoreTestSuites$1.evaluate(TestRuleIgnoreTestSuites.java:47)
	at org.junit.rules.RunRules.evaluate(RunRules.java:20)
	at com.carrotsearch.randomizedtesting.rules.StatementAdapter.evaluate(StatementAdapter.java:36)
	at com.carrotsearch.randomizedtesting.ThreadLeakControl$StatementRunner.run(ThreadLeakControl.java:370)
	at com.carrotsearch.randomizedtesting.ThreadLeakControl.lambda$forkTimeoutingTask$0(ThreadLeakControl.java:826)
	at java.base/java.lang.Thread.run(Thread.java:834)


FAILED:  org.apache.solr.cloud.TestConfigSetsAPI.testOverwriteWithCleanupV1

Error Message:
java.util.concurrent.TimeoutException: Timed out waiting for all collections to be fully removed.

Stack Trace:
java.util.concurrent.TimeoutException: Timed out waiting for all collections to be fully removed.
	at __randomizedtesting.SeedInfo.seed([F30BCF4B5409E2CD:13953FF86CC8203E]:0)
	at org.apache.solr.cloud.MiniSolrCloudCluster.deleteAllCollections(MiniSolrCloudCluster.java:577)
	at org.apache.solr.cloud.TestConfigSetsAPI.tearDown(TestConfigSetsAPI.java:136)
	at java.base/jdk.internal.reflect.NativeMethodAccessorImpl.invoke0(Native Method)
	at java.base/jdk.internal.reflect.NativeMethodAccessorImpl.invoke(NativeMethodAccessorImpl.java:62)
	at java.base/jdk.internal.reflect.DelegatingMethodAccessorImpl.invoke(DelegatingMethodAccessorImpl.java:43)
	at java.base/java.lang.reflect.Method.invoke(Method.java:566)
	at com.carrotsearch.randomizedtesting.RandomizedRunner.invoke(RandomizedRunner.java:1754)
	at com.carrotsearch.randomizedtesting.RandomizedRunner$10.evaluate(RandomizedRunner.java:1000)
	at com.carrotsearch.randomizedtesting.rules.SystemPropertiesRestoreRule$1.evaluate(SystemPropertiesRestoreRule.java:57)
	at org.junit.rules.RunRules.evaluate(RunRules.java:20)
	at org.apache.lucene.util.TestRuleSetupTeardownChained$1.evaluate(TestRuleSetupTeardownChained.java:44)
	at org.apache.lucene.util.AbstractBeforeAfterRule$1.evaluate(AbstractBeforeAfterRule.java:43)
	at org.apache.lucene.util.TestRuleThreadAndTestName$1.evaluate(TestRuleThreadAndTestName.java:45)
	at org.apache.lucene.util.TestRuleIgnoreAfterMaxFailures$1.evaluate(TestRuleIgnoreAfterMaxFailures.java:60)
	at org.apache.lucene.util.TestRuleMarkFailure$1.evaluate(TestRuleMarkFailure.java:44)
	at org.junit.rules.RunRules.evaluate(RunRules.java:20)
	at com.carrotsearch.randomizedtesting.rules.StatementAdapter.evaluate(StatementAdapter.java:36)
	at com.carrotsearch.randomizedtesting.ThreadLeakControl$StatementRunner.run(ThreadLeakControl.java:370)
	at com.carrotsearch.randomizedtesting.ThreadLeakControl.forkTimeoutingTask(ThreadLeakControl.java:819)
	at com.carrotsearch.randomizedtesting.ThreadLeakControl$3.evaluate(ThreadLeakControl.java:470)
	at com.carrotsearch.randomizedtesting.RandomizedRunner.runSingleTest(RandomizedRunner.java:951)
	at com.carrotsearch.randomizedtesting.RandomizedRunner$5.evaluate(RandomizedRunner.java:836)
	at com.carrotsearch.randomizedtesting.RandomizedRunner$6.evaluate(RandomizedRunner.java:887)
	at com.carrotsearch.randomizedtesting.RandomizedRunner$7.evaluate(RandomizedRunner.java:898)
	at com.carrotsearch.randomizedtesting.rules.StatementAdapter.evaluate(StatementAdapter.java:36)
	at org.apache.lucene.util.AbstractBeforeAfterRule$1.evaluate(AbstractBeforeAfterRule.java:43)
	at org.apache.lucene.util.AbstractBeforeAfterRule$1.evaluate(AbstractBeforeAfterRule.java:43)
	at com.carrotsearch.randomizedtesting.rules.SystemPropertiesRestoreRule$1.evaluate(SystemPropertiesRestoreRule.java:57)
	at org.junit.rules.RunRules.evaluate(RunRules.java:20)
	at org.apache.lucene.util.AbstractBeforeAfterRule$1.evaluate(AbstractBeforeAfterRule.java:43)
	at com.carrotsearch.randomizedtesting.rules.StatementAdapter.evaluate(StatementAdapter.java:36)
	at org.apache.lucene.util.TestRuleStoreClassName$1.evaluate(TestRuleStoreClassName.java:38)
	at com.carrotsearch.randomizedtesting.rules.NoShadowingOrOverridesOnMethodsRule$1.evaluate(NoShadowingOrOverridesOnMethodsRule.java:40)
	at com.carrotsearch.randomizedtesting.rules.NoShadowingOrOverridesOnMethodsRule$1.evaluate(NoShadowingOrOverridesOnMethodsRule.java:40)
	at com.carrotsearch.randomizedtesting.rules.StatementAdapter.evaluate(StatementAdapter.java:36)
	at com.carrotsearch.randomizedtesting.rules.StatementAdapter.evaluate(StatementAdapter.java:36)
	at org.apache.lucene.util.TestRuleAssertionsRequired$1.evaluate(TestRuleAssertionsRequired.java:53)
	at org.apache.lucene.util.AbstractBeforeAfterRule$1.evaluate(AbstractBeforeAfterRule.java:43)
	at org.apache.lucene.util.TestRuleMarkFailure$1.evaluate(TestRuleMarkFailure.java:44)
	at org.apache.lucene.util.TestRuleIgnoreAfterMaxFailures$1.evaluate(TestRuleIgnoreAfterMaxFailures.java:60)
	at org.apache.lucene.util.TestRuleIgnoreTestSuites$1.evaluate(TestRuleIgnoreTestSuites.java:47)
	at org.junit.rules.RunRules.evaluate(RunRules.java:20)
	at com.carrotsearch.randomizedtesting.rules.StatementAdapter.evaluate(StatementAdapter.java:36)
	at com.carrotsearch.randomizedtesting.ThreadLeakControl$StatementRunner.run(ThreadLeakControl.java:370)
	at com.carrotsearch.randomizedtesting.ThreadLeakControl.lambda$forkTimeoutingTask$0(ThreadLeakControl.java:826)
	at java.base/java.lang.Thread.run(Thread.java:834)


FAILED:  org.apache.solr.cloud.TestConfigSetsAPI.testSingleFileOverwriteV1

Error Message:
java.util.concurrent.TimeoutException: Timed out waiting for all collections to be fully removed.

Stack Trace:
java.util.concurrent.TimeoutException: Timed out waiting for all collections to be fully removed.
	at __randomizedtesting.SeedInfo.seed([F30BCF4B5409E2CD:5C2CD1E303B15643]:0)
	at org.apache.solr.cloud.MiniSolrCloudCluster.deleteAllCollections(MiniSolrCloudCluster.java:577)
	at org.apache.solr.cloud.TestConfigSetsAPI.tearDown(TestConfigSetsAPI.java:136)
	at java.base/jdk.internal.reflect.NativeMethodAccessorImpl.invoke0(Native Method)
	at java.base/jdk.internal.reflect.NativeMethodAccessorImpl.invoke(NativeMethodAccessorImpl.java:62)
	at java.base/jdk.internal.reflect.DelegatingMethodAccessorImpl.invoke(DelegatingMethodAccessorImpl.java:43)
	at java.base/java.lang.reflect.Method.invoke(Method.java:566)
	at com.carrotsearch.randomizedtesting.RandomizedRunner.invoke(RandomizedRunner.java:1754)
	at com.carrotsearch.randomizedtesting.RandomizedRunner$10.evaluate(RandomizedRunner.java:1000)
	at com.carrotsearch.randomizedtesting.rules.SystemPropertiesRestoreRule$1.evaluate(SystemPropertiesRestoreRule.java:57)
	at org.junit.rules.RunRules.evaluate(RunRules.java:20)
	at org.apache.lucene.util.TestRuleSetupTeardownChained$1.evaluate(TestRuleSetupTeardownChained.java:44)
	at org.apache.lucene.util.AbstractBeforeAfterRule$1.evaluate(AbstractBeforeAfterRule.java:43)
	at org.apache.lucene.util.TestRuleThreadAndTestName$1.evaluate(TestRuleThreadAndTestName.java:45)
	at org.apache.lucene.util.TestRuleIgnoreAfterMaxFailures$1.evaluate(TestRuleIgnoreAfterMaxFailures.java:60)
	at org.apache.lucene.util.TestRuleMarkFailure$1.evaluate(TestRuleMarkFailure.java:44)
	at org.junit.rules.RunRules.evaluate(RunRules.java:20)
	at com.carrotsearch.randomizedtesting.rules.StatementAdapter.evaluate(StatementAdapter.java:36)
	at com.carrotsearch.randomizedtesting.ThreadLeakControl$StatementRunner.run(ThreadLeakControl.java:370)
	at com.carrotsearch.randomizedtesting.ThreadLeakControl.forkTimeoutingTask(ThreadLeakControl.java:819)
	at com.carrotsearch.randomizedtesting.ThreadLeakControl$3.evaluate(ThreadLeakControl.java:470)
	at com.carrotsearch.randomizedtesting.RandomizedRunner.runSingleTest(RandomizedRunner.java:951)
	at com.carrotsearch.randomizedtesting.RandomizedRunner$5.evaluate(RandomizedRunner.java:836)
	at com.carrotsearch.randomizedtesting.RandomizedRunner$6.evaluate(RandomizedRunner.java:887)
	at com.carrotsearch.randomizedtesting.RandomizedRunner$7.evaluate(RandomizedRunner.java:898)
	at com.carrotsearch.randomizedtesting.rules.StatementAdapter.evaluate(StatementAdapter.java:36)
	at org.apache.lucene.util.AbstractBeforeAfterRule$1.evaluate(AbstractBeforeAfterRule.java:43)
	at org.apache.lucene.util.AbstractBeforeAfterRule$1.evaluate(AbstractBeforeAfterRule.java:43)
	at com.carrotsearch.randomizedtesting.rules.SystemPropertiesRestoreRule$1.evaluate(SystemPropertiesRestoreRule.java:57)
	at org.junit.rules.RunRules.evaluate(RunRules.java:20)
	at org.apache.lucene.util.AbstractBeforeAfterRule$1.evaluate(AbstractBeforeAfterRule.java:43)
	at com.carrotsearch.randomizedtesting.rules.StatementAdapter.evaluate(StatementAdapter.java:36)
	at org.apache.lucene.util.TestRuleStoreClassName$1.evaluate(TestRuleStoreClassName.java:38)
	at com.carrotsearch.randomizedtesting.rules.NoShadowingOrOverridesOnMethodsRule$1.evaluate(NoShadowingOrOverridesOnMethodsRule.java:40)
	at com.carrotsearch.randomizedtesting.rules.NoShadowingOrOverridesOnMethodsRule$1.evaluate(NoShadowingOrOverridesOnMethodsRule.java:40)
	at com.carrotsearch.randomizedtesting.rules.StatementAdapter.evaluate(StatementAdapter.java:36)
	at com.carrotsearch.randomizedtesting.rules.StatementAdapter.evaluate(StatementAdapter.java:36)
	at org.apache.lucene.util.TestRuleAssertionsRequired$1.evaluate(TestRuleAssertionsRequired.java:53)
	at org.apache.lucene.util.AbstractBeforeAfterRule$1.evaluate(AbstractBeforeAfterRule.java:43)
	at org.apache.lucene.util.TestRuleMarkFailure$1.evaluate(TestRuleMarkFailure.java:44)
	at org.apache.lucene.util.TestRuleIgnoreAfterMaxFailures$1.evaluate(TestRuleIgnoreAfterMaxFailures.java:60)
	at org.apache.lucene.util.TestRuleIgnoreTestSuites$1.evaluate(TestRuleIgnoreTestSuites.java:47)
	at org.junit.rules.RunRules.evaluate(RunRules.java:20)
	at com.carrotsearch.randomizedtesting.rules.StatementAdapter.evaluate(StatementAdapter.java:36)
	at com.carrotsearch.randomizedtesting.ThreadLeakControl$StatementRunner.run(ThreadLeakControl.java:370)
	at com.carrotsearch.randomizedtesting.ThreadLeakControl.lambda$forkTimeoutingTask$0(ThreadLeakControl.java:826)
	at java.base/java.lang.Thread.run(Thread.java:834)


FAILED:  org.apache.solr.cloud.TestConfigSetsAPI.testDeleteErrors

Error Message:
java.util.concurrent.TimeoutException: Timed out waiting for all collections to be fully removed.

Stack Trace:
java.util.concurrent.TimeoutException: Timed out waiting for all collections to be fully removed.
	at __randomizedtesting.SeedInfo.seed([F30BCF4B5409E2CD:FAE91066D17FE3D9]:0)
	at org.apache.solr.cloud.MiniSolrCloudCluster.deleteAllCollections(MiniSolrCloudCluster.java:577)
	at org.apache.solr.cloud.TestConfigSetsAPI.tearDown(TestConfigSetsAPI.java:136)
	at java.base/jdk.internal.reflect.NativeMethodAccessorImpl.invoke0(Native Method)
	at java.base/jdk.internal.reflect.NativeMethodAccessorImpl.invoke(NativeMethodAccessorImpl.java:62)
	at java.base/jdk.internal.reflect.DelegatingMethodAccessorImpl.invoke(DelegatingMethodAccessorImpl.java:43)
	at java.base/java.lang.reflect.Method.invoke(Method.java:566)
	at com.carrotsearch.randomizedtesting.RandomizedRunner.invoke(RandomizedRunner.java:1754)
	at com.carrotsearch.randomizedtesting.RandomizedRunner$10.evaluate(RandomizedRunner.java:1000)
	at com.carrotsearch.randomizedtesting.rules.SystemPropertiesRestoreRule$1.evaluate(SystemPropertiesRestoreRule.java:57)
	at org.junit.rules.RunRules.evaluate(RunRules.java:20)
	at org.apache.lucene.util.TestRuleSetupTeardownChained$1.evaluate(TestRuleSetupTeardownChained.java:44)
	at org.apache.lucene.util.AbstractBeforeAfterRule$1.evaluate(AbstractBeforeAfterRule.java:43)
	at org.apache.lucene.util.TestRuleThreadAndTestName$1.evaluate(TestRuleThreadAndTestName.java:45)
	at org.apache.lucene.util.TestRuleIgnoreAfterMaxFailures$1.evaluate(TestRuleIgnoreAfterMaxFailures.java:60)
	at org.apache.lucene.util.TestRuleMarkFailure$1.evaluate(TestRuleMarkFailure.java:44)
	at org.junit.rules.RunRules.evaluate(RunRules.java:20)
	at com.carrotsearch.randomizedtesting.rules.StatementAdapter.evaluate(StatementAdapter.java:36)
	at com.carrotsearch.randomizedtesting.ThreadLeakControl$StatementRunner.run(ThreadLeakControl.java:370)
	at com.carrotsearch.randomizedtesting.ThreadLeakControl.forkTimeoutingTask(ThreadLeakControl.java:819)
	at com.carrotsearch.randomizedtesting.ThreadLeakControl$3.evaluate(ThreadLeakControl.java:470)
	at com.carrotsearch.randomizedtesting.RandomizedRunner.runSingleTest(RandomizedRunner.java:951)
	at com.carrotsearch.randomizedtesting.RandomizedRunner$5.evaluate(RandomizedRunner.java:836)
	at com.carrotsearch.randomizedtesting.RandomizedRunner$6.evaluate(RandomizedRunner.java:887)
	at com.carrotsearch.randomizedtesting.RandomizedRunner$7.evaluate(RandomizedRunner.java:898)
	at com.carrotsearch.randomizedtesting.rules.StatementAdapter.evaluate(StatementAdapter.java:36)
	at org.apache.lucene.util.AbstractBeforeAfterRule$1.evaluate(AbstractBeforeAfterRule.java:43)
	at org.apache.lucene.util.AbstractBeforeAfterRule$1.evaluate(AbstractBeforeAfterRule.java:43)
	at com.carrotsearch.randomizedtesting.rules.SystemPropertiesRestoreRule$1.evaluate(SystemPropertiesRestoreRule.java:57)
	at org.junit.rules.RunRules.evaluate(RunRules.java:20)
	at org.apache.lucene.util.AbstractBeforeAfterRule$1.evaluate(AbstractBeforeAfterRule.java:43)
	at com.carrotsearch.randomizedtesting.rules.StatementAdapter.evaluate(StatementAdapter.java:36)
	at org.apache.lucene.util.TestRuleStoreClassName$1.evaluate(TestRuleStoreClassName.java:38)
	at com.carrotsearch.randomizedtesting.rules.NoShadowingOrOverridesOnMethodsRule$1.evaluate(NoShadowingOrOverridesOnMethodsRule.java:40)
	at com.carrotsearch.randomizedtesting.rules.NoShadowingOrOverridesOnMethodsRule$1.evaluate(NoShadowingOrOverridesOnMethodsRule.java:40)
	at com.carrotsearch.randomizedtesting.rules.StatementAdapter.evaluate(StatementAdapter.java:36)
	at com.carrotsearch.randomizedtesting.rules.StatementAdapter.evaluate(StatementAdapter.java:36)
	at org.apache.lucene.util.TestRuleAssertionsRequired$1.evaluate(TestRuleAssertionsRequired.java:53)
	at org.apache.lucene.util.AbstractBeforeAfterRule$1.evaluate(AbstractBeforeAfterRule.java:43)
	at org.apache.lucene.util.TestRuleMarkFailure$1.evaluate(TestRuleMarkFailure.java:44)
	at org.apache.lucene.util.TestRuleIgnoreAfterMaxFailures$1.evaluate(TestRuleIgnoreAfterMaxFailures.java:60)
	at org.apache.lucene.util.TestRuleIgnoreTestSuites$1.evaluate(TestRuleIgnoreTestSuites.java:47)
	at org.junit.rules.RunRules.evaluate(RunRules.java:20)
	at com.carrotsearch.randomizedtesting.rules.StatementAdapter.evaluate(StatementAdapter.java:36)
	at com.carrotsearch.randomizedtesting.ThreadLeakControl$StatementRunner.run(ThreadLeakControl.java:370)
	at com.carrotsearch.randomizedtesting.ThreadLeakControl.lambda$forkTimeoutingTask$0(ThreadLeakControl.java:826)
	at java.base/java.lang.Thread.run(Thread.java:834)


FAILED:  org.apache.solr.cloud.TestConfigSetsAPI.testUpload

Error Message:
org.apache.solr.client.solrj.impl.BaseHttpSolrClient$RemoteSolrException: Error from server at https://127.0.0.1:39231/solr: Underlying core creation failed while creating collection: newcollection

Stack Trace:
org.apache.solr.client.solrj.impl.BaseHttpSolrClient$RemoteSolrException: Error from server at https://127.0.0.1:39231/solr: Underlying core creation failed while creating collection: newcollection
	at __randomizedtesting.SeedInfo.seed([F30BCF4B5409E2CD:F0B19F4AB76BAA47]:0)
	at app//org.apache.solr.client.solrj.impl.HttpSolrClient.executeMethod(HttpSolrClient.java:668)
	at app//org.apache.solr.client.solrj.impl.HttpSolrClient.request(HttpSolrClient.java:239)
	at app//org.apache.solr.client.solrj.impl.HttpSolrClient.request(HttpSolrClient.java:222)
	at app//org.apache.solr.client.solrj.impl.LBSolrClient.doRequest(LBSolrClient.java:389)
	at app//org.apache.solr.client.solrj.impl.LBSolrClient.request(LBSolrClient.java:359)
	at app//org.apache.solr.client.solrj.impl.BaseCloudSolrClient.sendRequest(BaseCloudSolrClient.java:1132)
	at app//org.apache.solr.client.solrj.impl.BaseCloudSolrClient.requestWithRetryOnStaleState(BaseCloudSolrClient.java:898)
	at app//org.apache.solr.client.solrj.impl.BaseCloudSolrClient.request(BaseCloudSolrClient.java:832)
	at app//org.apache.solr.client.solrj.SolrClient.request(SolrClient.java:1290)
	at app//org.apache.solr.cloud.TestConfigSetsAPI.createCollection(TestConfigSetsAPI.java:1093)
	at app//org.apache.solr.cloud.TestConfigSetsAPI.testUpload(TestConfigSetsAPI.java:819)
	at java.base@11.0.11/jdk.internal.reflect.NativeMethodAccessorImpl.invoke0(Native Method)
	at java.base@11.0.11/jdk.internal.reflect.NativeMethodAccessorImpl.invoke(NativeMethodAccessorImpl.java:62)
	at java.base@11.0.11/jdk.internal.reflect.DelegatingMethodAccessorImpl.invoke(DelegatingMethodAccessorImpl.java:43)
	at java.base@11.0.11/java.lang.reflect.Method.invoke(Method.java:566)
	at app//com.carrotsearch.randomizedtesting.RandomizedRunner.invoke(RandomizedRunner.java:1754)
	at app//com.carrotsearch.randomizedtesting.RandomizedRunner$8.evaluate(RandomizedRunner.java:942)
	at app//com.carrotsearch.randomizedtesting.RandomizedRunner$9.evaluate(RandomizedRunner.java:978)
	at app//com.carrotsearch.randomizedtesting.RandomizedRunner$10.evaluate(RandomizedRunner.java:992)
	at app//com.carrotsearch.randomizedtesting.rules.SystemPropertiesRestoreRule$1.evaluate(SystemPropertiesRestoreRule.java:57)
	at app//org.junit.rules.RunRules.evaluate(RunRules.java:20)
	at app//org.apache.lucene.util.TestRuleSetupTeardownChained$1.evaluate(TestRuleSetupTeardownChained.java:44)
	at app//org.apache.lucene.util.AbstractBeforeAfterRule$1.evaluate(AbstractBeforeAfterRule.java:43)
	at app//org.apache.lucene.util.TestRuleThreadAndTestName$1.evaluate(TestRuleThreadAndTestName.java:45)
	at app//org.apache.lucene.util.TestRuleIgnoreAfterMaxFailures$1.evaluate(TestRuleIgnoreAfterMaxFailures.java:60)
	at app//org.apache.lucene.util.TestRuleMarkFailure$1.evaluate(TestRuleMarkFailure.java:44)
	at app//org.junit.rules.RunRules.evaluate(RunRules.java:20)
	at app//com.carrotsearch.randomizedtesting.rules.StatementAdapter.evaluate(StatementAdapter.java:36)
	at app//com.carrotsearch.randomizedtesting.ThreadLeakControl$StatementRunner.run(ThreadLeakControl.java:370)
	at app//com.carrotsearch.randomizedtesting.ThreadLeakControl.forkTimeoutingTask(ThreadLeakControl.java:819)
	at app//com.carrotsearch.randomizedtesting.ThreadLeakControl$3.evaluate(ThreadLeakControl.java:470)
	at app//com.carrotsearch.randomizedtesting.RandomizedRunner.runSingleTest(RandomizedRunner.java:951)
	at app//com.carrotsearch.randomizedtesting.RandomizedRunner$5.evaluate(RandomizedRunner.java:836)
	at app//com.carrotsearch.randomizedtesting.RandomizedRunner$6.evaluate(RandomizedRunner.java:887)
	at app//com.carrotsearch.randomizedtesting.RandomizedRunner$7.evaluate(RandomizedRunner.java:898)
	at app//com.carrotsearch.randomizedtesting.rules.StatementAdapter.evaluate(StatementAdapter.java:36)
	at app//org.apache.lucene.util.AbstractBeforeAfterRule$1.evaluate(AbstractBeforeAfterRule.java:43)
	at app//org.apache.lucene.util.AbstractBeforeAfterRule$1.evaluate(AbstractBeforeAfterRule.java:43)
	at app//com.carrotsearch.randomizedtesting.rules.SystemPropertiesRestoreRule$1.evaluate(SystemPropertiesRestoreRule.java:57)
	at app//org.junit.rules.RunRules.evaluate(RunRules.java:20)
	at app//org.apache.lucene.util.AbstractBeforeAfterRule$1.evaluate(AbstractBeforeAfterRule.java:43)
	at app//com.carrotsearch.randomizedtesting.rules.StatementAdapter.evaluate(StatementAdapter.java:36)
	at app//org.apache.lucene.util.TestRuleStoreClassName$1.evaluate(TestRuleStoreClassName.java:38)
	at app//com.carrotsearch.randomizedtesting.rules.NoShadowingOrOverridesOnMethodsRule$1.evaluate(NoShadowingOrOverridesOnMethodsRule.java:40)
	at app//com.carrotsearch.randomizedtesting.rules.NoShadowingOrOverridesOnMethodsRule$1.evaluate(NoShadowingOrOverridesOnMethodsRule.java:40)
	at app//com.carrotsearch.randomizedtesting.rules.StatementAdapter.evaluate(StatementAdapter.java:36)
	at app//com.carrotsearch.randomizedtesting.rules.StatementAdapter.evaluate(StatementAdapter.java:36)
	at app//org.apache.lucene.util.TestRuleAssertionsRequired$1.evaluate(TestRuleAssertionsRequired.java:53)
	at app//org.apache.lucene.util.AbstractBeforeAfterRule$1.evaluate(AbstractBeforeAfterRule.java:43)
	at app//org.apache.lucene.util.TestRuleMarkFailure$1.evaluate(TestRuleMarkFailure.java:44)
	at app//org.apache.lucene.util.TestRuleIgnoreAfterMaxFailures$1.evaluate(TestRuleIgnoreAfterMaxFailures.java:60)
	at app//org.apache.lucene.util.TestRuleIgnoreTestSuites$1.evaluate(TestRuleIgnoreTestSuites.java:47)
	at app//org.junit.rules.RunRules.evaluate(RunRules.java:20)
	at app//com.carrotsearch.randomizedtesting.rules.StatementAdapter.evaluate(StatementAdapter.java:36)
	at app//com.carrotsearch.randomizedtesting.ThreadLeakControl$StatementRunner.run(ThreadLeakControl.java:370)
	at app//com.carrotsearch.randomizedtesting.ThreadLeakControl.lambda$forkTimeoutingTask$0(ThreadLeakControl.java:826)
	at java.base@11.0.11/java.lang.Thread.run(Thread.java:834)




Build Log:
[...truncated 4209 lines...]
ERROR: The following test(s) have failed:
  - org.apache.solr.cloud.TestConfigSetsAPI.testUploadLegacyManagedSchemaFile (:solr:core)
    Test output: /home/jenkins/jenkins-slave/workspace/Solr/Solr-Check-main/solr/core/build/test-results/test/outputs/OUTPUT-org.apache.solr.cloud.TestConfigSetsAPI.txt
    Reproduce with: gradlew :solr:core:test --tests "org.apache.solr.cloud.TestConfigSetsAPI.testUploadLegacyManagedSchemaFile" -Ptests.jvms=4 -Ptests.haltonfailure=false -Ptests.jvmargs=-XX:TieredStopAtLevel=1 -Ptests.seed=F30BCF4B5409E2CD -Ptests.multiplier=2 -Ptests.badapples=false -Ptests.file.encoding=ISO-8859-1

  - org.apache.solr.cloud.TestConfigSetsAPI.testOverwriteWithCleanupV1 (:solr:core)
    Test output: /home/jenkins/jenkins-slave/workspace/Solr/Solr-Check-main/solr/core/build/test-results/test/outputs/OUTPUT-org.apache.solr.cloud.TestConfigSetsAPI.txt
    Reproduce with: gradlew :solr:core:test --tests "org.apache.solr.cloud.TestConfigSetsAPI.testOverwriteWithCleanupV1" -Ptests.jvms=4 -Ptests.haltonfailure=false -Ptests.jvmargs=-XX:TieredStopAtLevel=1 -Ptests.seed=F30BCF4B5409E2CD -Ptests.multiplier=2 -Ptests.badapples=false -Ptests.file.encoding=ISO-8859-1

  - org.apache.solr.cloud.TestConfigSetsAPI.testSingleFileOverwriteV1 (:solr:core)
    Test output: /home/jenkins/jenkins-slave/workspace/Solr/Solr-Check-main/solr/core/build/test-results/test/outputs/OUTPUT-org.apache.solr.cloud.TestConfigSetsAPI.txt
    Reproduce with: gradlew :solr:core:test --tests "org.apache.solr.cloud.TestConfigSetsAPI.testSingleFileOverwriteV1" -Ptests.jvms=4 -Ptests.haltonfailure=false -Ptests.jvmargs=-XX:TieredStopAtLevel=1 -Ptests.seed=F30BCF4B5409E2CD -Ptests.multiplier=2 -Ptests.badapples=false -Ptests.file.encoding=ISO-8859-1

  - org.apache.solr.cloud.TestConfigSetsAPI.testDeleteErrors (:solr:core)
    Test output: /home/jenkins/jenkins-slave/workspace/Solr/Solr-Check-main/solr/core/build/test-results/test/outputs/OUTPUT-org.apache.solr.cloud.TestConfigSetsAPI.txt
    Reproduce with: gradlew :solr:core:test --tests "org.apache.solr.cloud.TestConfigSetsAPI.testDeleteErrors" -Ptests.jvms=4 -Ptests.haltonfailure=false -Ptests.jvmargs=-XX:TieredStopAtLevel=1 -Ptests.seed=F30BCF4B5409E2CD -Ptests.multiplier=2 -Ptests.badapples=false -Ptests.file.encoding=ISO-8859-1

  - org.apache.solr.cloud.TestConfigSetsAPI.testUpload (:solr:core)
    Test output: /home/jenkins/jenkins-slave/workspace/Solr/Solr-Check-main/solr/core/build/test-results/test/outputs/OUTPUT-org.apache.solr.cloud.TestConfigSetsAPI.txt
    Reproduce with: gradlew :solr:core:test --tests "org.apache.solr.cloud.TestConfigSetsAPI.testUpload" -Ptests.jvms=4 -Ptests.haltonfailure=false -Ptests.jvmargs=-XX:TieredStopAtLevel=1 -Ptests.seed=F30BCF4B5409E2CD -Ptests.multiplier=2 -Ptests.badapples=false -Ptests.file.encoding=ISO-8859-1


Deprecated Gradle features were used in this build, making it incompatible with Gradle 8.0.

You can use '--warning-mode all' to show the individual deprecation warnings and determine if they come from your own scripts or plugins.

See https://docs.gradle.org/7.2/userguide/command_line_interface.html#sec:command_line_warnings

BUILD SUCCESSFUL in 51m 37s
407 actionable tasks: 407 executed
Build step 'Invoke Gradle script' changed build result to SUCCESS
Archiving artifacts
java.lang.InterruptedException: no matches found within 10000
	at hudson.FilePath$ValidateAntFileMask.hasMatch(FilePath.java:3069)
	at hudson.FilePath$ValidateAntFileMask.invoke(FilePath.java:2948)
	at hudson.FilePath$ValidateAntFileMask.invoke(FilePath.java:2929)
	at hudson.FilePath$FileCallableWrapper.call(FilePath.java:3317)
Also:   hudson.remoting.Channel$CallSiteStackTrace: Remote call to lucene-solr-2
		at hudson.remoting.Channel.attachCallSiteStackTrace(Channel.java:1800)
		at hudson.remoting.UserRequest$ExceptionResponse.retrieve(UserRequest.java:356)
		at hudson.remoting.Channel.call(Channel.java:1001)
		at hudson.FilePath.act(FilePath.java:1159)
		at hudson.FilePath.act(FilePath.java:1148)
		at hudson.FilePath.validateAntFileMask(FilePath.java:2927)
		at hudson.tasks.ArtifactArchiver.perform(ArtifactArchiver.java:270)
		at hudson.tasks.BuildStepCompatibilityLayer.perform(BuildStepCompatibilityLayer.java:80)
		at hudson.tasks.BuildStepMonitor$1.perform(BuildStepMonitor.java:20)
		at hudson.model.AbstractBuild$AbstractBuildExecution.perform(AbstractBuild.java:803)
		at hudson.model.AbstractBuild$AbstractBuildExecution.performAllBuildSteps(AbstractBuild.java:752)
		at hudson.model.Build$BuildExecution.post2(Build.java:177)
		at hudson.model.AbstractBuild$AbstractBuildExecution.post(AbstractBuild.java:697)
		at hudson.model.Run.execute(Run.java:1931)
		at hudson.model.FreeStyleBuild.run(FreeStyleBuild.java:43)
		at hudson.model.ResourceController.execute(ResourceController.java:97)
		at hudson.model.Executor.run(Executor.java:429)
Caused: hudson.FilePath$TunneledInterruptedException
	at hudson.FilePath$FileCallableWrapper.call(FilePath.java:3319)
	at hudson.remoting.UserRequest.perform(UserRequest.java:211)
	at hudson.remoting.UserRequest.perform(UserRequest.java:54)
	at hudson.remoting.Request$2.run(Request.java:376)
	at hudson.remoting.InterceptingExecutorService.lambda$wrap$0(InterceptingExecutorService.java:78)
	at java.util.concurrent.FutureTask.run(FutureTask.java:266)
	at java.util.concurrent.ThreadPoolExecutor.runWorker(ThreadPoolExecutor.java:1149)
	at java.util.concurrent.ThreadPoolExecutor$Worker.run(ThreadPoolExecutor.java:624)
	at java.lang.Thread.run(Thread.java:748)
Caused: java.lang.InterruptedException: java.lang.InterruptedException: no matches found within 10000
	at hudson.FilePath.act(FilePath.java:1161)
	at hudson.FilePath.act(FilePath.java:1148)
	at hudson.FilePath.validateAntFileMask(FilePath.java:2927)
	at hudson.tasks.ArtifactArchiver.perform(ArtifactArchiver.java:270)
	at hudson.tasks.BuildStepCompatibilityLayer.perform(BuildStepCompatibilityLayer.java:80)
	at hudson.tasks.BuildStepMonitor$1.perform(BuildStepMonitor.java:20)
	at hudson.model.AbstractBuild$AbstractBuildExecution.perform(AbstractBuild.java:803)
	at hudson.model.AbstractBuild$AbstractBuildExecution.performAllBuildSteps(AbstractBuild.java:752)
	at hudson.model.Build$BuildExecution.post2(Build.java:177)
	at hudson.model.AbstractBuild$AbstractBuildExecution.post(AbstractBuild.java:697)
	at hudson.model.Run.execute(Run.java:1931)
	at hudson.model.FreeStyleBuild.run(FreeStyleBuild.java:43)
	at hudson.model.ResourceController.execute(ResourceController.java:97)
	at hudson.model.Executor.run(Executor.java:429)
No artifacts found that match the file pattern "**/*.events,heapdumps/**,**/hs_err_pid*". Configuration error?
Recording test results
[Checks API] No suitable checks publisher found.
Build step 'Publish JUnit test result report' changed build result to UNSTABLE
Email was triggered for: Unstable (Test Failures)
Sending email for trigger: Unstable (Test Failures)