You are viewing a plain text version of this content. The canonical link for it is here.
Posted to builds@beam.apache.org by Apache Jenkins Server <je...@builds.apache.org> on 2019/04/03 01:21:19 UTC
Build failed in Jenkins: beam_PreCommit_Java_Cron #1138
See <https://builds.apache.org/job/beam_PreCommit_Java_Cron/1138/display/redirect?page=changes>
Changes:
[david.moravek] [BEAM-6895] Update joda-time to 2.10.1
[25622840+adude3141] [BEAM-6971] remove :beam-website:testWebsite from gradle build target
[github] Merge pull request #7952: [BEAM-6753] Set the stage to make schema coder
------------------------------------------
[...truncated 1.04 MB...]
> Task :beam-sdks-java-extensions-kryo:analyzeTestClassesDependencies SKIPPED
> Task :beam-sdks-java-extensions-kryo:analyzeDependencies SKIPPED
> Task :beam-sdks-java-extensions-kryo:checkstyleTest
> Task :beam-sdks-java-extensions-euphoria:compileTestJava FROM-CACHE
> Task :beam-sdks-java-extensions-euphoria:testClasses UP-TO-DATE
> Task :beam-sdks-java-extensions-euphoria:packageTests
> Task :beam-sdks-java-extensions-euphoria:assemble
> Task :beam-sdks-java-extensions-euphoria:analyzeTestClassesDependencies SKIPPED
> Task :beam-sdks-java-extensions-euphoria:analyzeDependencies SKIPPED
> Task :beam-runners-direct-java:checkstyleMain
> Task :beam-sdks-java-extensions-euphoria:checkstyleTest
> Task :beam-runners-direct-java:checkstyleTest
> Task :beam-sdks-java-extensions-kryo:test
> Task :beam-sdks-java-extensions-kryo:check
> Task :beam-sdks-java-extensions-kryo:build
> Task :beam-runners-direct-java:javadoc
<https://builds.apache.org/job/beam_PreCommit_Java_Cron/ws/src/runners/direct-java/src/main/java/org/apache/beam/runners/direct/portable/ReferenceRunner.java>:119: warning: no @return
public static ReferenceRunner forPipeline(
^
<https://builds.apache.org/job/beam_PreCommit_Java_Cron/ws/src/runners/direct-java/src/main/java/org/apache/beam/runners/direct/portable/ReferenceRunner.java>:168: warning: no @throws for java.lang.Exception
public void execute() throws Exception {
^
<https://builds.apache.org/job/beam_PreCommit_Java_Cron/ws/src/runners/direct-java/src/main/java/org/apache/beam/runners/direct/Clock.java>:28: warning: no @return
Instant now();
^
<https://builds.apache.org/job/beam_PreCommit_Java_Cron/ws/src/runners/direct-java/src/main/java/org/apache/beam/runners/direct/DirectRunner.java>:135: warning: no @param for options
public static DirectRunner fromOptions(PipelineOptions options) {
^
<https://builds.apache.org/job/beam_PreCommit_Java_Cron/ws/src/runners/direct-java/src/main/java/org/apache/beam/runners/direct/DirectRunner.java>:135: warning: no @return
public static DirectRunner fromOptions(PipelineOptions options) {
^
<https://builds.apache.org/job/beam_PreCommit_Java_Cron/ws/src/runners/direct-java/src/main/java/org/apache/beam/runners/direct/WatermarkManager.java>:841: warning: no @param for <ExecutableT>
WatermarkManager<ExecutableT, ? super CollectionT> create(
^
<https://builds.apache.org/job/beam_PreCommit_Java_Cron/ws/src/runners/direct-java/src/main/java/org/apache/beam/runners/direct/WatermarkManager.java>:841: warning: no @param for <CollectionT>
WatermarkManager<ExecutableT, ? super CollectionT> create(
^
<https://builds.apache.org/job/beam_PreCommit_Java_Cron/ws/src/runners/direct-java/src/main/java/org/apache/beam/runners/direct/WatermarkManager.java>:841: warning: no @return
WatermarkManager<ExecutableT, ? super CollectionT> create(
^
<https://builds.apache.org/job/beam_PreCommit_Java_Cron/ws/src/runners/direct-java/src/main/java/org/apache/beam/runners/direct/WatermarkManager.java>:941: warning: no @param for executable
public TransformWatermarks getWatermarks(ExecutableT executable) {
^
<https://builds.apache.org/job/beam_PreCommit_Java_Cron/ws/src/runners/direct-java/src/main/java/org/apache/beam/runners/direct/WatermarkManager.java>:1140: warning: no @return
public Collection<FiredTimers<ExecutableT>> extractFiredTimers() {
^
<https://builds.apache.org/job/beam_PreCommit_Java_Cron/ws/src/runners/direct-java/src/main/java/org/apache/beam/runners/direct/WatermarkManager.java>:1575: warning: no @return
public Collection<TimerData> getTimers() {
^
<https://builds.apache.org/job/beam_PreCommit_Java_Cron/ws/src/runners/direct-java/src/main/java/org/apache/beam/runners/direct/WatermarkManager.java>:1408: warning: no @return
public static TimerUpdate empty() {
^
<https://builds.apache.org/job/beam_PreCommit_Java_Cron/ws/src/runners/direct-java/src/main/java/org/apache/beam/runners/direct/WatermarkManager.java>:1417: warning: no @param for key
public static TimerUpdateBuilder builder(StructuralKey<?> key) {
^
<https://builds.apache.org/job/beam_PreCommit_Java_Cron/ws/src/runners/direct-java/src/main/java/org/apache/beam/runners/direct/WatermarkManager.java>:1417: warning: no @return
public static TimerUpdateBuilder builder(StructuralKey<?> key) {
^
<https://builds.apache.org/job/beam_PreCommit_Java_Cron/ws/src/runners/direct-java/src/main/java/org/apache/beam/runners/direct/WatermarkManager.java>:1518: warning: no @param for completedTimers
public TimerUpdate withCompletedTimers(Iterable<TimerData> completedTimers) {
^
<https://builds.apache.org/job/beam_PreCommit_Java_Cron/ws/src/runners/direct-java/src/main/java/org/apache/beam/runners/direct/WatermarkManager.java>:1518: warning: no @return
public TimerUpdate withCompletedTimers(Iterable<TimerData> completedTimers) {
^
<https://builds.apache.org/job/beam_PreCommit_Java_Cron/ws/src/runners/direct-java/src/main/java/org/apache/beam/runners/direct/WatermarkManager.java>:1441: warning: no @param for completedTimers
public TimerUpdateBuilder withCompletedTimers(Iterable<TimerData> completedTimers) {
^
<https://builds.apache.org/job/beam_PreCommit_Java_Cron/ws/src/runners/direct-java/src/main/java/org/apache/beam/runners/direct/WatermarkManager.java>:1441: warning: no @return
public TimerUpdateBuilder withCompletedTimers(Iterable<TimerData> completedTimers) {
^
<https://builds.apache.org/job/beam_PreCommit_Java_Cron/ws/src/runners/direct-java/src/main/java/org/apache/beam/runners/direct/WatermarkManager.java>:1450: warning: no @param for setTimer
public TimerUpdateBuilder setTimer(TimerData setTimer) {
^
<https://builds.apache.org/job/beam_PreCommit_Java_Cron/ws/src/runners/direct-java/src/main/java/org/apache/beam/runners/direct/WatermarkManager.java>:1450: warning: no @return
public TimerUpdateBuilder setTimer(TimerData setTimer) {
^
<https://builds.apache.org/job/beam_PreCommit_Java_Cron/ws/src/runners/direct-java/src/main/java/org/apache/beam/runners/direct/WatermarkManager.java>:1465: warning: no @param for deletedTimer
public TimerUpdateBuilder deletedTimer(TimerData deletedTimer) {
^
<https://builds.apache.org/job/beam_PreCommit_Java_Cron/ws/src/runners/direct-java/src/main/java/org/apache/beam/runners/direct/WatermarkManager.java>:1465: warning: no @return
public TimerUpdateBuilder deletedTimer(TimerData deletedTimer) {
^
<https://builds.apache.org/job/beam_PreCommit_Java_Cron/ws/src/runners/direct-java/src/main/java/org/apache/beam/runners/direct/WatermarkManager.java>:1475: warning: no @return
public TimerUpdate build() {
^
<https://builds.apache.org/job/beam_PreCommit_Java_Cron/ws/src/runners/direct-java/src/main/java/org/apache/beam/runners/direct/WatermarkManager.java>:1282: warning: no @return
public Instant getInputWatermark() {
^
<https://builds.apache.org/job/beam_PreCommit_Java_Cron/ws/src/runners/direct-java/src/main/java/org/apache/beam/runners/direct/WatermarkManager.java>:1287: warning: no @return
public Instant getOutputWatermark() {
^
<https://builds.apache.org/job/beam_PreCommit_Java_Cron/ws/src/runners/direct-java/src/main/java/org/apache/beam/runners/direct/WatermarkManager.java>:1297: warning: no @return
public synchronized Instant getSynchronizedProcessingInputTime() {
^
<https://builds.apache.org/job/beam_PreCommit_Java_Cron/ws/src/runners/direct-java/src/main/java/org/apache/beam/runners/direct/WatermarkManager.java>:1311: warning: no @return
public synchronized Instant getSynchronizedProcessingOutputTime() {
^
> Task :beam-runners-flink-1.7:test
[IOManagerAsync shutdown hook] INFO org.apache.flink.runtime.io.disk.iomanager.IOManager - I/O manager removed spill file directory /tmp/flink-io-5485bb33-9a31-4ae6-bb34-5eb72e22011e
[IOManagerAsync shutdown hook] INFO org.apache.flink.runtime.io.disk.iomanager.IOManager - I/O manager removed spill file directory /tmp/flink-io-4fb1f7e5-0f9c-4bec-adea-f2799ab2b716
[IOManagerAsync shutdown hook] INFO org.apache.flink.runtime.io.disk.iomanager.IOManager - I/O manager removed spill file directory /tmp/flink-io-ab1b10e2-4939-4f9c-bec3-5b5d9aa82078
[IOManagerAsync shutdown hook] INFO org.apache.flink.runtime.io.disk.iomanager.IOManager - I/O manager removed spill file directory /tmp/flink-io-1f52886c-cd4f-40d8-bc5d-b5f7fe7e4e37
[IOManagerAsync shutdown hook] INFO org.apache.flink.runtime.io.disk.iomanager.IOManager - I/O manager removed spill file directory /tmp/flink-io-647deed1-e3a1-4f2b-977b-6838eebc044f
[IOManagerAsync shutdown hook] INFO org.apache.flink.runtime.io.disk.iomanager.IOManager - I/O manager removed spill file directory /tmp/flink-io-2ccbbe70-f748-45ce-9939-2a71b9b57223
[IOManagerAsync shutdown hook] INFO org.apache.flink.runtime.io.disk.iomanager.IOManager - I/O manager removed spill file directory /tmp/flink-io-cb90c19e-4c9d-494f-a391-fd2ec9a55246
[IOManagerAsync shutdown hook] INFO org.apache.flink.runtime.io.disk.iomanager.IOManager - I/O manager removed spill file directory /tmp/flink-io-64df3bcb-94b5-4be6-940b-568f7b953b2d
[IOManagerAsync shutdown hook] INFO org.apache.flink.runtime.io.disk.iomanager.IOManager - I/O manager removed spill file directory /tmp/flink-io-0fa0a35b-d73c-484f-b3a9-08ad92ad0196
[IOManagerAsync shutdown hook] INFO org.apache.flink.runtime.io.disk.iomanager.IOManager - I/O manager removed spill file directory /tmp/flink-io-3f10002e-044f-4fac-9f00-eed4593afb21
[IOManagerAsync shutdown hook] INFO org.apache.flink.runtime.io.disk.iomanager.IOManager - I/O manager removed spill file directory /tmp/flink-io-988d496f-3880-4508-adbc-b7fe1b320d99
[IOManagerAsync shutdown hook] INFO org.apache.flink.runtime.io.disk.iomanager.IOManager - I/O manager removed spill file directory /tmp/flink-io-bdd9fec4-6e36-431a-bbd7-e8ecca7bd664
[IOManagerAsync shutdown hook] INFO org.apache.flink.runtime.io.disk.iomanager.IOManager - I/O manager removed spill file directory /tmp/flink-io-6996876d-54c4-4608-be87-f0eed3ca7ad1
[IOManagerAsync shutdown hook] INFO org.apache.flink.runtime.io.disk.iomanager.IOManager - I/O manager removed spill file directory /tmp/flink-io-32e94dd3-99c1-424c-b073-7c5b3b1d3e74
[IOManagerAsync shutdown hook] INFO org.apache.flink.runtime.io.disk.iomanager.IOManager - I/O manager removed spill file directory /tmp/flink-io-5dc92a39-4977-41a0-b837-fe30020f5407
[IOManagerAsync shutdown hook] INFO org.apache.flink.runtime.io.disk.iomanager.IOManager - I/O manager removed spill file directory /tmp/flink-io-95e05077-247a-44f0-a27e-50dd3bf63709
[IOManagerAsync shutdown hook] INFO org.apache.flink.runtime.io.disk.iomanager.IOManager - I/O manager removed spill file directory /tmp/flink-io-84b3142e-ffea-4b6c-a71c-3eab7bb04698
[IOManagerAsync shutdown hook] INFO org.apache.flink.runtime.io.disk.iomanager.IOManager - I/O manager removed spill file directory /tmp/flink-io-9bfb98b2-fd73-486d-ba0e-52f6f27d004d
[IOManagerAsync shutdown hook] INFO org.apache.flink.runtime.io.disk.iomanager.IOManager - I/O manager removed spill file directory /tmp/flink-io-1a1b5575-689e-4055-8c84-d875858e3259
[IOManagerAsync shutdown hook] INFO org.apache.flink.runtime.io.disk.iomanager.IOManager - I/O manager removed spill file directory /tmp/flink-io-9c924cf4-11e6-4802-bd6b-aa6013fed244
[IOManagerAsync shutdown hook] INFO org.apache.flink.runtime.io.disk.iomanager.IOManager - I/O manager removed spill file directory /tmp/flink-io-f55e41ee-24c9-47cc-81dc-b45b45fcd356
[IOManagerAsync shutdown hook] INFO org.apache.flink.runtime.io.disk.iomanager.IOManager - I/O manager removed spill file directory /tmp/flink-io-436532bc-d9d8-43ba-9576-ee65678b68cd
[IOManagerAsync shutdown hook] INFO org.apache.flink.runtime.io.disk.iomanager.IOManager - I/O manager removed spill file directory /tmp/flink-io-93b7183c-3733-488f-aec4-360e4491d3db
[IOManagerAsync shutdown hook] INFO org.apache.flink.runtime.io.disk.iomanager.IOManager - I/O manager removed spill file directory /tmp/flink-io-eb1b72da-40b9-4c27-aadd-3c7caf850d74
[IOManagerAsync shutdown hook] INFO org.apache.flink.runtime.io.disk.iomanager.IOManager - I/O manager removed spill file directory /tmp/flink-io-1c50f7c1-55ea-4919-ab99-2c27c14b1bc8
[IOManagerAsync shutdown hook] INFO org.apache.flink.runtime.io.disk.iomanager.IOManager - I/O manager removed spill file directory /tmp/flink-io-28b4a3a0-27bc-4ca0-a9f3-ff32727c178d
[IOManagerAsync shutdown hook] INFO org.apache.flink.runtime.io.disk.iomanager.IOManager - I/O manager removed spill file directory /tmp/flink-io-8809c183-6837-44d4-b1e9-9bda2c6c89bc
[IOManagerAsync shutdown hook] INFO org.apache.flink.runtime.io.disk.iomanager.IOManager - I/O manager removed spill file directory /tmp/flink-io-918baa80-3f68-47ca-ab2e-8374b34a417b
[IOManagerAsync shutdown hook] INFO org.apache.flink.runtime.io.disk.iomanager.IOManager - I/O manager removed spill file directory /tmp/flink-io-f0503901-41c6-467f-b77c-cd9e1866fd11
[IOManagerAsync shutdown hook] INFO org.apache.flink.runtime.io.disk.iomanager.IOManager - I/O manager removed spill file directory /tmp/flink-io-2fc1317b-f7ed-4db9-8d53-327e333cce94
[IOManagerAsync shutdown hook] INFO org.apache.flink.runtime.io.disk.iomanager.IOManager - I/O manager removed spill file directory /tmp/flink-io-0a061db4-4f8b-4443-830c-886ef5f0cd9b
[IOManagerAsync shutdown hook] INFO org.apache.flink.runtime.io.disk.iomanager.IOManager - I/O manager removed spill file directory /tmp/flink-io-06149136-15ee-44fb-836e-a503626c2c7c
[IOManagerAsync shutdown hook] INFO org.apache.flink.runtime.io.disk.iomanager.IOManager - I/O manager removed spill file directory /tmp/flink-io-9b972c32-0631-4f45-bccb-2b7040f4c197
[IOManagerAsync shutdown hook] INFO org.apache.flink.runtime.io.disk.iomanager.IOManager - I/O manager removed spill file directory /tmp/flink-io-db928211-bc03-4e60-9b4b-e3259ee4ab04
[IOManagerAsync shutdown hook] INFO org.apache.flink.runtime.io.disk.iomanager.IOManager - I/O manager removed spill file directory /tmp/flink-io-d9d82f81-0c9a-46c0-bcee-670388808d72
[IOManagerAsync shutdown hook] INFO org.apache.flink.runtime.io.disk.iomanager.IOManager - I/O manager removed spill file directory /tmp/flink-io-69b6b728-4a51-4a3a-a0a9-8f19cd870162
[IOManagerAsync shutdown hook] INFO org.apache.flink.runtime.io.disk.iomanager.IOManager - I/O manager removed spill file directory /tmp/flink-io-5ed7e567-6ddc-4e48-9a4b-636588dd3d75
[IOManagerAsync shutdown hook] INFO org.apache.flink.runtime.io.disk.iomanager.IOManager - I/O manager removed spill file directory /tmp/flink-io-5f238b30-f432-4b55-ab77-6c4d2cef40e2
[IOManagerAsync shutdown hook] INFO org.apache.flink.runtime.io.disk.iomanager.IOManager - I/O manager removed spill file directory /tmp/flink-io-2bc21d4f-7c97-4ad2-959e-d523fea59bcb
[IOManagerAsync shutdown hook] INFO org.apache.flink.runtime.io.disk.iomanager.IOManager - I/O manager removed spill file directory /tmp/flink-io-d4664689-54e2-4244-b962-f40146fab93e
[IOManagerAsync shutdown hook] INFO org.apache.flink.runtime.io.disk.iomanager.IOManager - I/O manager removed spill file directory /tmp/flink-io-0fa7761b-931c-401b-99c5-b18e55267699
[IOManagerAsync shutdown hook] INFO org.apache.flink.runtime.io.disk.iomanager.IOManager - I/O manager removed spill file directory /tmp/flink-io-3e5b0ceb-0d94-44b6-97e3-a67741583200
[IOManagerAsync shutdown hook] INFO org.apache.flink.runtime.io.disk.iomanager.IOManager - I/O manager removed spill file directory /tmp/flink-io-9ff1ae3e-46c4-43ee-802e-6f67f7ce874e
[IOManagerAsync shutdown hook] INFO org.apache.flink.runtime.io.disk.iomanager.IOManager - I/O manager removed spill file directory /tmp/flink-io-1de763a7-848d-41a5-841c-de55084857ec
[IOManagerAsync shutdown hook] INFO org.apache.flink.runtime.io.disk.iomanager.IOManager - I/O manager removed spill file directory /tmp/flink-io-d75cda8b-adbe-4b47-8308-29355533d9df
[IOManagerAsync shutdown hook] INFO org.apache.flink.runtime.io.disk.iomanager.IOManager - I/O manager removed spill file directory /tmp/flink-io-4558c314-db54-49cf-9677-a10f74a7893c
[IOManagerAsync shutdown hook] INFO org.apache.flink.runtime.io.disk.iomanager.IOManager - I/O manager removed spill file directory /tmp/flink-io-d43f2ba1-e345-4453-8050-d07f843add40
[IOManagerAsync shutdown hook] INFO org.apache.flink.runtime.io.disk.iomanager.IOManager - I/O manager removed spill file directory /tmp/flink-io-20294179-1d02-492f-9f8e-4e10fd5dba19
[IOManagerAsync shutdown hook] INFO org.apache.flink.runtime.io.disk.iomanager.IOManager - I/O manager removed spill file directory /tmp/flink-io-c12ec934-843a-4d47-b355-bba585c9c5e6
[IOManagerAsync shutdown hook] INFO org.apache.flink.runtime.io.disk.iomanager.IOManager - I/O manager removed spill file directory /tmp/flink-io-ae7dd22d-af6b-491d-853b-d6a899a931db
[IOManagerAsync shutdown hook] INFO org.apache.flink.runtime.io.disk.iomanager.IOManager - I/O manager removed spill file directory /tmp/flink-io-c821ce8e-77f0-496f-9163-34b7896f034f
[IOManagerAsync shutdown hook] INFO org.apache.flink.runtime.io.disk.iomanager.IOManager - I/O manager removed spill file directory /tmp/flink-io-9ac361dd-99f7-4d4e-9239-17564a65ba91
[IOManagerAsync shutdown hook] INFO org.apache.flink.runtime.io.disk.iomanager.IOManager - I/O manager removed spill file directory /tmp/flink-io-c80b0564-2455-429f-8521-7f440339aa64
[IOManagerAsync shutdown hook] INFO org.apache.flink.runtime.io.disk.iomanager.IOManager - I/O manager removed spill file directory /tmp/flink-io-55437971-922d-47ec-b245-9f4e57c7eeee
[IOManagerAsync shutdown hook] INFO org.apache.flink.runtime.io.disk.iomanager.IOManager - I/O manager removed spill file directory /tmp/flink-io-1017d00c-f2b6-4694-a5d6-2eeac143bcc6
[IOManagerAsync shutdown hook] INFO org.apache.flink.runtime.io.disk.iomanager.IOManager - I/O manager removed spill file directory /tmp/flink-io-7ccc420c-04f5-48e3-af83-41eb55a59c70
[IOManagerAsync shutdown hook] INFO org.apache.flink.runtime.io.disk.iomanager.IOManager - I/O manager removed spill file directory /tmp/flink-io-ea6def62-5578-476d-8091-a36e86739538
[IOManagerAsync shutdown hook] INFO org.apache.flink.runtime.io.disk.iomanager.IOManager - I/O manager removed spill file directory /tmp/flink-io-1d966aaa-f359-46fc-b05e-ef18fc89af02
[IOManagerAsync shutdown hook] INFO org.apache.flink.runtime.io.disk.iomanager.IOManager - I/O manager removed spill file directory /tmp/flink-io-a2a1fed4-0f58-48f9-af40-3ac44085fa40
[IOManagerAsync shutdown hook] INFO org.apache.flink.runtime.io.disk.iomanager.IOManager - I/O manager removed spill file directory /tmp/flink-io-9bb98b01-72cd-422d-a5bd-19b83e299693
[IOManagerAsync shutdown hook] INFO org.apache.flink.runtime.io.disk.iomanager.IOManager - I/O manager removed spill file directory /tmp/flink-io-723cd634-3ecc-4a43-b60f-f6b03df1c76a
[IOManagerAsync shutdown hook] INFO org.apache.flink.runtime.io.disk.iomanager.IOManager - I/O manager removed spill file directory /tmp/flink-io-2f6a69f6-435c-466d-8e06-2763f359966f
[IOManagerAsync shutdown hook] INFO org.apache.flink.runtime.io.disk.iomanager.IOManager - I/O manager removed spill file directory /tmp/flink-io-0c257dce-894c-42be-ac9f-4e3b8b626e24
[IOManagerAsync shutdown hook] INFO org.apache.flink.runtime.io.disk.iomanager.IOManager - I/O manager removed spill file directory /tmp/flink-io-c62da79f-0611-45ab-9260-7ae60c156ca9
[IOManagerAsync shutdown hook] INFO org.apache.flink.runtime.io.disk.iomanager.IOManager - I/O manager removed spill file directory /tmp/flink-io-559b23f9-fa53-48ad-85f8-cd154a5fcca2
[IOManagerAsync shutdown hook] INFO org.apache.flink.runtime.io.disk.iomanager.IOManager - I/O manager removed spill file directory /tmp/flink-io-e1ea75e7-5cdd-4201-a10a-24f4b0f5de0f
[IOManagerAsync shutdown hook] INFO org.apache.flink.runtime.io.disk.iomanager.IOManager - I/O manager removed spill file directory /tmp/flink-io-2877be4d-5923-4b02-bf59-35b8e787f19c
[IOManagerAsync shutdown hook] INFO org.apache.flink.runtime.io.disk.iomanager.IOManager - I/O manager removed spill file directory /tmp/flink-io-78faeccf-9b43-4d25-897e-3d3803fa0c0c
[IOManagerAsync shutdown hook] INFO org.apache.flink.runtime.io.disk.iomanager.IOManager - I/O manager removed spill file directory /tmp/flink-io-625bd25d-c08a-4fc5-ad19-91db2c164ec7
[IOManagerAsync shutdown hook] INFO org.apache.flink.runtime.io.disk.iomanager.IOManager - I/O manager removed spill file directory /tmp/flink-io-2f61e538-768c-4780-97ba-0a3947cd7d97
[IOManagerAsync shutdown hook] INFO org.apache.flink.runtime.io.disk.iomanager.IOManager - I/O manager removed spill file directory /tmp/flink-io-a369b1aa-e84c-4c2c-b6e9-1f2f196ef052
[IOManagerAsync shutdown hook] INFO org.apache.flink.runtime.io.disk.iomanager.IOManager - I/O manager removed spill file directory /tmp/flink-io-522782be-6b86-496f-ac02-97972018653c
[IOManagerAsync shutdown hook] INFO org.apache.flink.runtime.io.disk.iomanager.IOManager - I/O manager removed spill file directory /tmp/flink-io-d2b1e883-9c34-4a44-90c1-fec25f268118
[IOManagerAsync shutdown hook] INFO org.apache.flink.runtime.io.disk.iomanager.IOManager - I/O manager removed spill file directory /tmp/flink-io-c2195f95-155a-4ecb-8912-238ef672d24e
[IOManagerAsync shutdown hook] INFO org.apache.flink.runtime.io.disk.iomanager.IOManager - I/O manager removed spill file directory /tmp/flink-io-ae73cef7-4b29-43f7-9bfb-15f74b3d650b
[IOManagerAsync shutdown hook] INFO org.apache.flink.runtime.io.disk.iomanager.IOManager - I/O manager removed spill file directory /tmp/flink-io-bd6109d4-5036-4e3e-bb16-75d76d500570
[IOManagerAsync shutdown hook] INFO org.apache.flink.runtime.io.disk.iomanager.IOManager - I/O manager removed spill file directory /tmp/flink-io-90ca7069-4c52-4909-8f1e-2bce44278bda
[IOManagerAsync shutdown hook] INFO org.apache.flink.runtime.io.disk.iomanager.IOManager - I/O manager removed spill file directory /tmp/flink-io-f5deb82a-4725-46d7-adf2-06c8677437f1
[IOManagerAsync shutdown hook] INFO org.apache.flink.runtime.io.disk.iomanager.IOManager - I/O manager removed spill file directory /tmp/flink-io-4343e1c1-839f-4279-a104-fb54a69ddc2e
[IOManagerAsync shutdown hook] INFO org.apache.flink.runtime.io.disk.iomanager.IOManager - I/O manager removed spill file directory /tmp/flink-io-00ae3751-bd25-4ada-bacf-507065410d15
[IOManagerAsync shutdown hook] INFO org.apache.flink.runtime.io.disk.iomanager.IOManager - I/O manager removed spill file directory /tmp/flink-io-faedb478-9a8e-4af8-8319-7265352201c1
[IOManagerAsync shutdown hook] INFO org.apache.flink.runtime.io.disk.iomanager.IOManager - I/O manager removed spill file directory /tmp/flink-io-f8c1dd73-fcff-42dd-af97-5626133dd91a
[IOManagerAsync shutdown hook] INFO org.apache.flink.runtime.io.disk.iomanager.IOManager - I/O manager removed spill file directory /tmp/flink-io-e86fb670-e8e0-4320-bdf5-060be6709f05
> Task :beam-runners-direct-java:javadoc
27 warnings
> Task :beam-sdks-java-javadoc:allJavadoc
> Task :beam-runners-flink-1.7:check
> Task :beam-runners-flink-1.7:build
> Task :beam-runners-flink-1.7:buildDependents
> Task :beam-sdks-java-core:validateShadedJarDoesntLeakNonProjectClasses
> Task :beam-sdks-java-core:check
> Task :beam-sdks-java-core:build
> Task :beam-sdks-java-core:buildNeeded
> Task :beam-sdks-java-io-hbase:check
> Task :beam-sdks-java-io-hbase:build
> Task :beam-sdks-java-io-hbase:buildDependents
> Task :beam-sdks-java-io-hadoop-common:buildDependents
> Task :beam-runners-direct-java:spotbugsMain
The following classes needed for analysis were missing:
com.google.auto.value.AutoValue$Builder
com.google.auto.value.AutoValue
> Task :beam-sdks-java-extensions-euphoria:test
> Task :beam-runners-direct-java:test
> Task :beam-sdks-java-extensions-euphoria:check
> Task :beam-sdks-java-extensions-euphoria:build
> Task :beam-sdks-java-extensions-euphoria:buildDependents
> Task :beam-sdks-java-extensions-kryo:buildDependents
> Task :beam-runners-direct-java:validateShadedJarDoesntLeakNonProjectClasses
> Task :beam-runners-direct-java:check
> Task :beam-runners-direct-java:build
> Task :beam-sdks-java-nexmark:shadowJar
> Task :beam-sdks-java-nexmark:validateShadedJarDoesntLeakNonProjectClasses
> Task :beam-sdks-java-nexmark:check
> Task :beam-sdks-java-nexmark:build
> Task :beam-sdks-java-nexmark:buildDependents
> Task :beam-sdks-java-extensions-sql:buildDependents
> Task :beam-sdks-java-io-kafka:buildDependents
> Task :beam-sdks-java-io-google-cloud-platform:buildDependents
> Task :beam-sdks-java-test-utils:buildDependents
> Task :beam-sdks-java-extensions-join-library:buildDependents
> Task :beam-sdks-java-extensions-protobuf:buildDependents
FAILURE: Build failed with an exception.
* What went wrong:
Execution failed for task ':beam-sdks-java-io-cassandra:test'.
> There were failing tests. See the report at: file://<https://builds.apache.org/job/beam_PreCommit_Java_Cron/ws/src/sdks/java/io/cassandra/build/reports/tests/test/index.html>
* Try:
Run with --stacktrace option to get the stack trace. Run with --info or --debug option to get more log output. Run with --scan to get full insights.
* Get more help at https://help.gradle.org
Deprecated Gradle features were used in this build, making it incompatible with Gradle 6.0.
Use '--warning-mode all' to show the individual deprecation warnings.
See https://docs.gradle.org/5.2.1/userguide/command_line_interface.html#sec:command_line_warnings
BUILD FAILED in 20m 0s
918 actionable tasks: 791 executed, 127 from cache
Publishing build scan...
https://gradle.com/s/tehv7cxhin4vk
Build step 'Invoke Gradle script' changed build result to FAILURE
Build step 'Invoke Gradle script' marked build as failure
---------------------------------------------------------------------
To unsubscribe, e-mail: builds-unsubscribe@beam.apache.org
For additional commands, e-mail: builds-help@beam.apache.org
Build failed in Jenkins: beam_PreCommit_Java_Cron #1141
Posted by Apache Jenkins Server <je...@builds.apache.org>.
See <https://builds.apache.org/job/beam_PreCommit_Java_Cron/1141/display/redirect?page=changes>
Changes:
[github] Fix documentation on graph/coder.NewVarInt
[25622840+adude3141] BEAM-6948 remove superseded ant.xml
[migryz] Added MetricsConstants class
[migryz] Utilize MonitoringInfoConstants across codebase.
[echauchot] [BEAM-6982] Use the random CQL port set by Achilles. Use a local free
[echauchot] [BEAM-6773] Clean cassandra username and cassandra password leftovers
[iemejia] [BEAM-2590] Implement basic Spark portable runner
------------------------------------------
[...truncated 1.07 MB...]
<https://builds.apache.org/job/beam_PreCommit_Java_Cron/ws/src/runners/samza/src/main/java/org/apache/beam/runners/samza/translation/TransformTranslator.java>:29: warning: no @param for node
default void translate(T transform, TransformHierarchy.Node node, TranslationContext ctx) {
^
<https://builds.apache.org/job/beam_PreCommit_Java_Cron/ws/src/runners/samza/src/main/java/org/apache/beam/runners/samza/translation/TransformTranslator.java>:29: warning: no @param for ctx
default void translate(T transform, TransformHierarchy.Node node, TranslationContext ctx) {
^
<https://builds.apache.org/job/beam_PreCommit_Java_Cron/ws/src/runners/samza/src/main/java/org/apache/beam/runners/samza/translation/TransformTranslator.java>:38: warning: no @param for transform
default void translatePortable(
^
<https://builds.apache.org/job/beam_PreCommit_Java_Cron/ws/src/runners/samza/src/main/java/org/apache/beam/runners/samza/translation/TransformTranslator.java>:38: warning: no @param for pipeline
default void translatePortable(
^
<https://builds.apache.org/job/beam_PreCommit_Java_Cron/ws/src/runners/samza/src/main/java/org/apache/beam/runners/samza/translation/TransformTranslator.java>:38: warning: no @param for ctx
default void translatePortable(
^
<https://builds.apache.org/job/beam_PreCommit_Java_Cron/ws/src/runners/samza/src/main/java/org/apache/beam/runners/samza/translation/PortableTranslationContext.java>:110: warning: no @param for <OutT>
public <OutT> OutputStream<OutT> getOutputStream(OutputDescriptor<OutT, ?> outputDescriptor) {
^
<https://builds.apache.org/job/beam_PreCommit_Java_Cron/ws/src/runners/samza/src/main/java/org/apache/beam/runners/samza/translation/PortableTranslationContext.java>:110: warning: no @param for outputDescriptor
public <OutT> OutputStream<OutT> getOutputStream(OutputDescriptor<OutT, ?> outputDescriptor) {
^
<https://builds.apache.org/job/beam_PreCommit_Java_Cron/ws/src/runners/samza/src/main/java/org/apache/beam/runners/samza/translation/PortableTranslationContext.java>:110: warning: no @return
public <OutT> OutputStream<OutT> getOutputStream(OutputDescriptor<OutT, ?> outputDescriptor) {
^
<https://builds.apache.org/job/beam_PreCommit_Java_Cron/ws/src/runners/samza/src/main/java/org/apache/beam/runners/samza/translation/PortableTranslationContext.java>:115: warning: no @param for <T>
public <T> void registerInputMessageStream(
^
<https://builds.apache.org/job/beam_PreCommit_Java_Cron/ws/src/runners/samza/src/main/java/org/apache/beam/runners/samza/translation/PortableTranslationContext.java>:115: warning: no @param for id
public <T> void registerInputMessageStream(
^
<https://builds.apache.org/job/beam_PreCommit_Java_Cron/ws/src/runners/samza/src/main/java/org/apache/beam/runners/samza/translation/PortableTranslationContext.java>:115: warning: no @param for inputDescriptor
public <T> void registerInputMessageStream(
^
<https://builds.apache.org/job/beam_PreCommit_Java_Cron/ws/src/runners/samza/src/main/java/org/apache/beam/runners/samza/translation/TransformConfigGenerator.java>:29: warning: no @param for transform
default Map<String, String> createConfig(
^
<https://builds.apache.org/job/beam_PreCommit_Java_Cron/ws/src/runners/samza/src/main/java/org/apache/beam/runners/samza/translation/TransformConfigGenerator.java>:29: warning: no @param for node
default Map<String, String> createConfig(
^
<https://builds.apache.org/job/beam_PreCommit_Java_Cron/ws/src/runners/samza/src/main/java/org/apache/beam/runners/samza/translation/TransformConfigGenerator.java>:29: warning: no @param for ctx
default Map<String, String> createConfig(
^
<https://builds.apache.org/job/beam_PreCommit_Java_Cron/ws/src/runners/samza/src/main/java/org/apache/beam/runners/samza/translation/TransformConfigGenerator.java>:29: warning: no @return
default Map<String, String> createConfig(
^
<https://builds.apache.org/job/beam_PreCommit_Java_Cron/ws/src/runners/samza/src/main/java/org/apache/beam/runners/samza/translation/TransformConfigGenerator.java>:35: warning: no @param for transform
default Map<String, String> createPortableConfig(PipelineNode.PTransformNode transform) {
^
<https://builds.apache.org/job/beam_PreCommit_Java_Cron/ws/src/runners/samza/src/main/java/org/apache/beam/runners/samza/translation/TransformConfigGenerator.java>:35: warning: no @return
default Map<String, String> createPortableConfig(PipelineNode.PTransformNode transform) {
^
65 warnings
> Task :beam-sdks-java-io-synthetic:test
> Task :beam-sdks-java-io-rabbitmq:check
> Task :beam-sdks-java-io-rabbitmq:build
> Task :beam-sdks-java-io-rabbitmq:buildDependents
> Task :beam-sdks-java-io-tika:check
> Task :beam-sdks-java-io-tika:build
> Task :beam-sdks-java-io-tika:buildDependents
> Task :beam-sdks-java-io-synthetic:validateShadedJarDoesntLeakNonProjectClasses
> Task :beam-sdks-java-io-synthetic:check
> Task :beam-sdks-java-io-synthetic:build
> Task :beam-sdks-java-io-synthetic:buildDependents
> Task :beam-sdks-java-io-solr:check
> Task :beam-sdks-java-io-solr:build
> Task :beam-sdks-java-io-solr:buildDependents
> Task :beam-sdks-java-io-xml:check
> Task :beam-sdks-java-io-xml:build
> Task :beam-sdks-java-io-xml:buildDependents
> Task :beam-sdks-java-extensions-sql-jdbc:shadowJarTest
> Task :beam-runners-samza:spotbugsMain
> Task :beam-sdks-java-extensions-sql-jdbc:preCommit
> Task :beam-runners-samza:test
> Task :beam-runners-samza:shadowJar
> Task :beam-runners-samza:validateShadedJarDoesntLeakNonProjectClasses
> Task :beam-runners-samza:check
> Task :beam-runners-samza:build
> Task :beam-runners-samza:buildDependents
> Task :beam-sdks-java-io-hbase:check
> Task :beam-sdks-java-io-hbase:build
> Task :beam-sdks-java-io-hbase:buildDependents
> Task :beam-runners-direct-java:jar
> Task :beam-runners-direct-java:packageTests
> Task :beam-runners-direct-java:assemble
> Task :beam-runners-direct-java:analyzeClassesDependencies SKIPPED
> Task :beam-runners-direct-java:analyzeTestClassesDependencies SKIPPED
> Task :beam-runners-direct-java:analyzeDependencies SKIPPED
> Task :beam-runners-direct-java:checkstyleMain
> Task :beam-runners-direct-java:checkstyleTest
> Task :beam-runners-direct-java:javadoc
<https://builds.apache.org/job/beam_PreCommit_Java_Cron/ws/src/runners/direct-java/src/main/java/org/apache/beam/runners/direct/portable/ReferenceRunner.java>:119: warning: no @return
public static ReferenceRunner forPipeline(
^
<https://builds.apache.org/job/beam_PreCommit_Java_Cron/ws/src/runners/direct-java/src/main/java/org/apache/beam/runners/direct/portable/ReferenceRunner.java>:168: warning: no @throws for java.lang.Exception
public void execute() throws Exception {
^
<https://builds.apache.org/job/beam_PreCommit_Java_Cron/ws/src/runners/direct-java/src/main/java/org/apache/beam/runners/direct/Clock.java>:28: warning: no @return
Instant now();
^
> Task :beam-sdks-java-extensions-kryo:compileTestJava
> Task :beam-sdks-java-extensions-kryo:testClasses
> Task :beam-sdks-java-extensions-kryo:packageTests
> Task :beam-sdks-java-extensions-kryo:assemble
> Task :beam-sdks-java-extensions-kryo:analyzeTestClassesDependencies SKIPPED
> Task :beam-sdks-java-extensions-kryo:analyzeDependencies SKIPPED
> Task :beam-sdks-java-extensions-kryo:checkstyleTest
> Task :beam-runners-direct-java:javadoc
<https://builds.apache.org/job/beam_PreCommit_Java_Cron/ws/src/runners/direct-java/src/main/java/org/apache/beam/runners/direct/DirectRunner.java>:135: warning: no @param for options
public static DirectRunner fromOptions(PipelineOptions options) {
^
<https://builds.apache.org/job/beam_PreCommit_Java_Cron/ws/src/runners/direct-java/src/main/java/org/apache/beam/runners/direct/DirectRunner.java>:135: warning: no @return
public static DirectRunner fromOptions(PipelineOptions options) {
^
<https://builds.apache.org/job/beam_PreCommit_Java_Cron/ws/src/runners/direct-java/src/main/java/org/apache/beam/runners/direct/WatermarkManager.java>:841: warning: no @param for <ExecutableT>
WatermarkManager<ExecutableT, ? super CollectionT> create(
^
<https://builds.apache.org/job/beam_PreCommit_Java_Cron/ws/src/runners/direct-java/src/main/java/org/apache/beam/runners/direct/WatermarkManager.java>:841: warning: no @param for <CollectionT>
WatermarkManager<ExecutableT, ? super CollectionT> create(
^
<https://builds.apache.org/job/beam_PreCommit_Java_Cron/ws/src/runners/direct-java/src/main/java/org/apache/beam/runners/direct/WatermarkManager.java>:841: warning: no @return
WatermarkManager<ExecutableT, ? super CollectionT> create(
^
<https://builds.apache.org/job/beam_PreCommit_Java_Cron/ws/src/runners/direct-java/src/main/java/org/apache/beam/runners/direct/WatermarkManager.java>:941: warning: no @param for executable
public TransformWatermarks getWatermarks(ExecutableT executable) {
^
<https://builds.apache.org/job/beam_PreCommit_Java_Cron/ws/src/runners/direct-java/src/main/java/org/apache/beam/runners/direct/WatermarkManager.java>:1140: warning: no @return
public Collection<FiredTimers<ExecutableT>> extractFiredTimers() {
^
<https://builds.apache.org/job/beam_PreCommit_Java_Cron/ws/src/runners/direct-java/src/main/java/org/apache/beam/runners/direct/WatermarkManager.java>:1575: warning: no @return
public Collection<TimerData> getTimers() {
^
<https://builds.apache.org/job/beam_PreCommit_Java_Cron/ws/src/runners/direct-java/src/main/java/org/apache/beam/runners/direct/WatermarkManager.java>:1408: warning: no @return
public static TimerUpdate empty() {
^
<https://builds.apache.org/job/beam_PreCommit_Java_Cron/ws/src/runners/direct-java/src/main/java/org/apache/beam/runners/direct/WatermarkManager.java>:1417: warning: no @param for key
public static TimerUpdateBuilder builder(StructuralKey<?> key) {
^
<https://builds.apache.org/job/beam_PreCommit_Java_Cron/ws/src/runners/direct-java/src/main/java/org/apache/beam/runners/direct/WatermarkManager.java>:1417: warning: no @return
public static TimerUpdateBuilder builder(StructuralKey<?> key) {
^
<https://builds.apache.org/job/beam_PreCommit_Java_Cron/ws/src/runners/direct-java/src/main/java/org/apache/beam/runners/direct/WatermarkManager.java>:1518: warning: no @param for completedTimers
public TimerUpdate withCompletedTimers(Iterable<TimerData> completedTimers) {
^
<https://builds.apache.org/job/beam_PreCommit_Java_Cron/ws/src/runners/direct-java/src/main/java/org/apache/beam/runners/direct/WatermarkManager.java>:1518: warning: no @return
public TimerUpdate withCompletedTimers(Iterable<TimerData> completedTimers) {
^
<https://builds.apache.org/job/beam_PreCommit_Java_Cron/ws/src/runners/direct-java/src/main/java/org/apache/beam/runners/direct/WatermarkManager.java>:1441: warning: no @param for completedTimers
public TimerUpdateBuilder withCompletedTimers(Iterable<TimerData> completedTimers) {
^
<https://builds.apache.org/job/beam_PreCommit_Java_Cron/ws/src/runners/direct-java/src/main/java/org/apache/beam/runners/direct/WatermarkManager.java>:1441: warning: no @return
public TimerUpdateBuilder withCompletedTimers(Iterable<TimerData> completedTimers) {
^
<https://builds.apache.org/job/beam_PreCommit_Java_Cron/ws/src/runners/direct-java/src/main/java/org/apache/beam/runners/direct/WatermarkManager.java>:1450: warning: no @param for setTimer
public TimerUpdateBuilder setTimer(TimerData setTimer) {
^
<https://builds.apache.org/job/beam_PreCommit_Java_Cron/ws/src/runners/direct-java/src/main/java/org/apache/beam/runners/direct/WatermarkManager.java>:1450: warning: no @return
public TimerUpdateBuilder setTimer(TimerData setTimer) {
^
<https://builds.apache.org/job/beam_PreCommit_Java_Cron/ws/src/runners/direct-java/src/main/java/org/apache/beam/runners/direct/WatermarkManager.java>:1465: warning: no @param for deletedTimer
public TimerUpdateBuilder deletedTimer(TimerData deletedTimer) {
^
<https://builds.apache.org/job/beam_PreCommit_Java_Cron/ws/src/runners/direct-java/src/main/java/org/apache/beam/runners/direct/WatermarkManager.java>:1465: warning: no @return
public TimerUpdateBuilder deletedTimer(TimerData deletedTimer) {
^
<https://builds.apache.org/job/beam_PreCommit_Java_Cron/ws/src/runners/direct-java/src/main/java/org/apache/beam/runners/direct/WatermarkManager.java>:1475: warning: no @return
public TimerUpdate build() {
^
<https://builds.apache.org/job/beam_PreCommit_Java_Cron/ws/src/runners/direct-java/src/main/java/org/apache/beam/runners/direct/WatermarkManager.java>:1282: warning: no @return
public Instant getInputWatermark() {
^
<https://builds.apache.org/job/beam_PreCommit_Java_Cron/ws/src/runners/direct-java/src/main/java/org/apache/beam/runners/direct/WatermarkManager.java>:1287: warning: no @return
public Instant getOutputWatermark() {
^
<https://builds.apache.org/job/beam_PreCommit_Java_Cron/ws/src/runners/direct-java/src/main/java/org/apache/beam/runners/direct/WatermarkManager.java>:1297: warning: no @return
public synchronized Instant getSynchronizedProcessingInputTime() {
^
<https://builds.apache.org/job/beam_PreCommit_Java_Cron/ws/src/runners/direct-java/src/main/java/org/apache/beam/runners/direct/WatermarkManager.java>:1311: warning: no @return
public synchronized Instant getSynchronizedProcessingOutputTime() {
^
27 warnings
> Task :beam-sdks-java-javadoc:allJavadoc
> Task :beam-sdks-java-extensions-kryo:test
> Task :beam-sdks-java-extensions-kryo:check
> Task :beam-sdks-java-extensions-kryo:build
> Task :beam-runners-direct-java:spotbugsMain
The following classes needed for analysis were missing:
com.google.auto.value.AutoValue$Builder
com.google.auto.value.AutoValue
> Task :beam-sdks-java-extensions-euphoria:compileTestJava
> Task :beam-sdks-java-extensions-euphoria:testClasses
> Task :beam-sdks-java-extensions-euphoria:packageTests
> Task :beam-sdks-java-extensions-euphoria:assemble
> Task :beam-sdks-java-extensions-euphoria:analyzeTestClassesDependencies SKIPPED
> Task :beam-sdks-java-extensions-euphoria:analyzeDependencies SKIPPED
> Task :beam-sdks-java-io-redis:check
> Task :beam-sdks-java-io-redis:build
> Task :beam-sdks-java-io-redis:buildDependents
> Task :beam-sdks-java-extensions-euphoria:checkstyleTest
> Task :beam-runners-direct-java:test
> Task :beam-sdks-java-extensions-euphoria:test
> Task :beam-runners-direct-java:validateShadedJarDoesntLeakNonProjectClasses
> Task :beam-runners-direct-java:check
> Task :beam-runners-direct-java:build
> Task :beam-sdks-java-extensions-euphoria:check
> Task :beam-sdks-java-extensions-euphoria:build
> Task :beam-sdks-java-extensions-euphoria:buildDependents
> Task :beam-sdks-java-extensions-kryo:buildDependents
> Task :beam-sdks-java-nexmark:shadowJar
> Task :beam-sdks-java-nexmark:validateShadedJarDoesntLeakNonProjectClasses
> Task :beam-sdks-java-nexmark:check
> Task :beam-sdks-java-nexmark:build
> Task :beam-sdks-java-nexmark:buildDependents
> Task :beam-sdks-java-extensions-sql:buildDependents
> Task :beam-sdks-java-io-kafka:buildDependents
> Task :beam-sdks-java-test-utils:buildDependents
> Task :beam-sdks-java-extensions-join-library:buildDependents
FAILURE: Build failed with an exception.
* What went wrong:
Execution failed for task ':beam-sdks-java-io-hadoop-input-format:test'.
> Process 'Gradle Test Executor 25' finished with non-zero exit value 1
This problem might be caused by incorrect test process configuration.
Please refer to the test execution section in the User Manual at https://docs.gradle.org/5.2.1/userguide/java_testing.html#sec:test_execution
* Try:
Run with --stacktrace option to get the stack trace. Run with --info or --debug option to get more log output. Run with --scan to get full insights.
* Get more help at https://help.gradle.org
Deprecated Gradle features were used in this build, making it incompatible with Gradle 6.0.
Use '--warning-mode all' to show the individual deprecation warnings.
See https://docs.gradle.org/5.2.1/userguide/command_line_interface.html#sec:command_line_warnings
BUILD FAILED in 36m 32s
912 actionable tasks: 854 executed, 58 from cache
Publishing build scan...
https://gradle.com/s/uwvsug7nfbsi4
Build step 'Invoke Gradle script' changed build result to FAILURE
Build step 'Invoke Gradle script' marked build as failure
---------------------------------------------------------------------
To unsubscribe, e-mail: builds-unsubscribe@beam.apache.org
For additional commands, e-mail: builds-help@beam.apache.org
Build failed in Jenkins: beam_PreCommit_Java_Cron #1140
Posted by Apache Jenkins Server <je...@builds.apache.org>.
See <https://builds.apache.org/job/beam_PreCommit_Java_Cron/1140/display/redirect>
------------------------------------------
Started by timer
[EnvInject] - Loading node environment variables.
Building remotely on beam10 (beam) in workspace <https://builds.apache.org/job/beam_PreCommit_Java_Cron/ws/>
No credentials specified
> git rev-parse --is-inside-work-tree # timeout=10
Fetching changes from the remote Git repository
> git config remote.origin.url https://github.com/apache/beam.git # timeout=10
Fetching upstream changes from https://github.com/apache/beam.git
> git --version # timeout=10
> git fetch --tags --progress https://github.com/apache/beam.git +refs/heads/*:refs/remotes/origin/* +refs/pull/${ghprbPullId}/*:refs/remotes/origin/pr/${ghprbPullId}/*
ERROR: Error fetching remote repo 'origin'
hudson.plugins.git.GitException: Failed to fetch from https://github.com/apache/beam.git
at hudson.plugins.git.GitSCM.fetchFrom(GitSCM.java:894)
at hudson.plugins.git.GitSCM.retrieveChanges(GitSCM.java:1161)
at hudson.plugins.git.GitSCM.checkout(GitSCM.java:1192)
at hudson.scm.SCM.checkout(SCM.java:504)
at hudson.model.AbstractProject.checkout(AbstractProject.java:1208)
at hudson.model.AbstractBuild$AbstractBuildExecution.defaultCheckout(AbstractBuild.java:574)
at jenkins.scm.SCMCheckoutStrategy.checkout(SCMCheckoutStrategy.java:86)
at hudson.model.AbstractBuild$AbstractBuildExecution.run(AbstractBuild.java:499)
at hudson.model.Run.execute(Run.java:1810)
at hudson.model.FreeStyleBuild.run(FreeStyleBuild.java:43)
at hudson.model.ResourceController.execute(ResourceController.java:97)
at hudson.model.Executor.run(Executor.java:429)
Caused by: hudson.plugins.git.GitException: Command "git fetch --tags --progress https://github.com/apache/beam.git +refs/heads/*:refs/remotes/origin/* +refs/pull/${ghprbPullId}/*:refs/remotes/origin/pr/${ghprbPullId}/*" returned status code 128:
stdout:
stderr: error: cannot create thread: Resource temporarily unavailable
fatal: fetch-pack: unable to fork off sideband demultiplexer
at org.jenkinsci.plugins.gitclient.CliGitAPIImpl.launchCommandIn(CliGitAPIImpl.java:2042)
at org.jenkinsci.plugins.gitclient.CliGitAPIImpl.launchCommandWithCredentials(CliGitAPIImpl.java:1761)
at org.jenkinsci.plugins.gitclient.CliGitAPIImpl.access$400(CliGitAPIImpl.java:72)
at org.jenkinsci.plugins.gitclient.CliGitAPIImpl$1.execute(CliGitAPIImpl.java:442)
at org.jenkinsci.plugins.gitclient.RemoteGitImpl$CommandInvocationHandler$1.call(RemoteGitImpl.java:153)
at org.jenkinsci.plugins.gitclient.RemoteGitImpl$CommandInvocationHandler$1.call(RemoteGitImpl.java:146)
at hudson.remoting.UserRequest.perform(UserRequest.java:212)
at hudson.remoting.UserRequest.perform(UserRequest.java:54)
at hudson.remoting.Request$2.run(Request.java:369)
at hudson.remoting.InterceptingExecutorService$1.call(InterceptingExecutorService.java:72)
at java.util.concurrent.FutureTask.run(FutureTask.java:266)
at java.util.concurrent.ThreadPoolExecutor.runWorker(ThreadPoolExecutor.java:1142)
at java.util.concurrent.ThreadPoolExecutor$Worker.run(ThreadPoolExecutor.java:617)
at java.lang.Thread.run(Thread.java:748)
Suppressed: hudson.remoting.Channel$CallSiteStackTrace: Remote call to beam10
at hudson.remoting.Channel.attachCallSiteStackTrace(Channel.java:1741)
at hudson.remoting.UserRequest$ExceptionResponse.retrieve(UserRequest.java:357)
at hudson.remoting.Channel.call(Channel.java:955)
at org.jenkinsci.plugins.gitclient.RemoteGitImpl$CommandInvocationHandler.execute(RemoteGitImpl.java:146)
at sun.reflect.GeneratedMethodAccessor1199.invoke(Unknown Source)
at sun.reflect.DelegatingMethodAccessorImpl.invoke(DelegatingMethodAccessorImpl.java:43)
at java.lang.reflect.Method.invoke(Method.java:498)
at org.jenkinsci.plugins.gitclient.RemoteGitImpl$CommandInvocationHandler.invoke(RemoteGitImpl.java:132)
at com.sun.proxy.$Proxy116.execute(Unknown Source)
at hudson.plugins.git.GitSCM.fetchFrom(GitSCM.java:892)
at hudson.plugins.git.GitSCM.retrieveChanges(GitSCM.java:1161)
at hudson.plugins.git.GitSCM.checkout(GitSCM.java:1192)
at hudson.scm.SCM.checkout(SCM.java:504)
at hudson.model.AbstractProject.checkout(AbstractProject.java:1208)
at hudson.model.AbstractBuild$AbstractBuildExecution.defaultCheckout(AbstractBuild.java:574)
at jenkins.scm.SCMCheckoutStrategy.checkout(SCMCheckoutStrategy.java:86)
at hudson.model.AbstractBuild$AbstractBuildExecution.run(AbstractBuild.java:499)
at hudson.model.Run.execute(Run.java:1810)
at hudson.model.FreeStyleBuild.run(FreeStyleBuild.java:43)
at hudson.model.ResourceController.execute(ResourceController.java:97)
at hudson.model.Executor.run(Executor.java:429)
ERROR: Error fetching remote repo 'origin'
Retrying after 10 seconds
No credentials specified
> git rev-parse --is-inside-work-tree # timeout=10
Fetching changes from the remote Git repository
> git config remote.origin.url https://github.com/apache/beam.git # timeout=10
Fetching upstream changes from https://github.com/apache/beam.git
> git --version # timeout=10
> git fetch --tags --progress https://github.com/apache/beam.git +refs/heads/*:refs/remotes/origin/* +refs/pull/${ghprbPullId}/*:refs/remotes/origin/pr/${ghprbPullId}/*
> git rev-parse origin/master^{commit} # timeout=10
Checking out Revision 0532e2a0e9544a63eca2cb38740f04344c1cea03 (origin/master)
> git config core.sparsecheckout # timeout=10
> git checkout -f 0532e2a0e9544a63eca2cb38740f04344c1cea03
FATAL: Could not checkout 0532e2a0e9544a63eca2cb38740f04344c1cea03
hudson.plugins.git.GitException: Command "git checkout -f 0532e2a0e9544a63eca2cb38740f04344c1cea03" returned status code 128:
stdout:
stderr: fatal: unable to create threaded lstat
at org.jenkinsci.plugins.gitclient.CliGitAPIImpl.launchCommandIn(CliGitAPIImpl.java:2042)
at org.jenkinsci.plugins.gitclient.CliGitAPIImpl.access$900(CliGitAPIImpl.java:72)
at org.jenkinsci.plugins.gitclient.CliGitAPIImpl$9.execute(CliGitAPIImpl.java:2341)
Also: hudson.remoting.Channel$CallSiteStackTrace: Remote call to beam10
at hudson.remoting.Channel.attachCallSiteStackTrace(Channel.java:1741)
at hudson.remoting.UserRequest$ExceptionResponse.retrieve(UserRequest.java:357)
at hudson.remoting.Channel.call(Channel.java:955)
at org.jenkinsci.plugins.gitclient.RemoteGitImpl$CommandInvocationHandler.execute(RemoteGitImpl.java:146)
at sun.reflect.GeneratedMethodAccessor1199.invoke(Unknown Source)
at sun.reflect.DelegatingMethodAccessorImpl.invoke(DelegatingMethodAccessorImpl.java:43)
at java.lang.reflect.Method.invoke(Method.java:498)
at org.jenkinsci.plugins.gitclient.RemoteGitImpl$CommandInvocationHandler.invoke(RemoteGitImpl.java:132)
at com.sun.proxy.$Proxy138.execute(Unknown Source)
at hudson.plugins.git.GitSCM.checkout(GitSCM.java:1242)
at hudson.scm.SCM.checkout(SCM.java:504)
at hudson.model.AbstractProject.checkout(AbstractProject.java:1208)
at hudson.model.AbstractBuild$AbstractBuildExecution.defaultCheckout(AbstractBuild.java:574)
at jenkins.scm.SCMCheckoutStrategy.checkout(SCMCheckoutStrategy.java:86)
at hudson.model.AbstractBuild$AbstractBuildExecution.run(AbstractBuild.java:499)
at hudson.model.Run.execute(Run.java:1810)
at hudson.model.FreeStyleBuild.run(FreeStyleBuild.java:43)
at hudson.model.ResourceController.execute(ResourceController.java:97)
at hudson.model.Executor.run(Executor.java:429)
Caused: hudson.plugins.git.GitException: Could not checkout 0532e2a0e9544a63eca2cb38740f04344c1cea03
at org.jenkinsci.plugins.gitclient.CliGitAPIImpl$9.execute(CliGitAPIImpl.java:2365)
at org.jenkinsci.plugins.gitclient.RemoteGitImpl$CommandInvocationHandler$1.call(RemoteGitImpl.java:153)
at org.jenkinsci.plugins.gitclient.RemoteGitImpl$CommandInvocationHandler$1.call(RemoteGitImpl.java:146)
at hudson.remoting.UserRequest.perform(UserRequest.java:212)
at hudson.remoting.UserRequest.perform(UserRequest.java:54)
at hudson.remoting.Request$2.run(Request.java:369)
at hudson.remoting.InterceptingExecutorService$1.call(InterceptingExecutorService.java:72)
at java.util.concurrent.FutureTask.run(FutureTask.java:266)
at java.util.concurrent.ThreadPoolExecutor.runWorker(ThreadPoolExecutor.java:1142)
at java.util.concurrent.ThreadPoolExecutor$Worker.run(ThreadPoolExecutor.java:617)
at java.lang.Thread.run(Thread.java:748)
---------------------------------------------------------------------
To unsubscribe, e-mail: builds-unsubscribe@beam.apache.org
For additional commands, e-mail: builds-help@beam.apache.org
Build failed in Jenkins: beam_PreCommit_Java_Cron #1139
Posted by Apache Jenkins Server <je...@builds.apache.org>.
See <https://builds.apache.org/job/beam_PreCommit_Java_Cron/1139/display/redirect>
------------------------------------------
[...truncated 1.07 MB...]
> Task :beam-sdks-java-io-hadoop-common:testClasses UP-TO-DATE
> Task :beam-sdks-java-io-hadoop-common:packageTests
> Task :beam-sdks-java-io-hadoop-common:assemble
> Task :beam-sdks-java-io-hadoop-common:analyzeClassesDependencies SKIPPED
> Task :beam-sdks-java-io-hadoop-common:analyzeTestClassesDependencies SKIPPED
> Task :beam-sdks-java-io-hadoop-common:analyzeDependencies SKIPPED
> Task :beam-sdks-java-io-hadoop-common:checkstyleMain
> Task :beam-sdks-java-io-hadoop-common:checkstyleTest
> Task :beam-sdks-java-io-elasticsearch:javadoc
> Task :beam-vendor-sdks-java-extensions-protobuf:spotbugsMain
> Task :beam-sdks-java-io-elasticsearch:test NO-SOURCE
> Task :beam-sdks-java-io-elasticsearch:validateShadedJarDoesntLeakNonProjectClasses
> Task :beam-vendor-sdks-java-extensions-protobuf:test NO-SOURCE
> Task :beam-vendor-sdks-java-extensions-protobuf:validateShadedJarDoesntLeakNonProjectClasses
> Task :beam-vendor-sdks-java-extensions-protobuf:check
> Task :beam-vendor-sdks-java-extensions-protobuf:build
> Task :beam-sdks-java-fn-execution:test
> Task :beam-sdks-java-fn-execution:validateShadedJarDoesntLeakNonProjectClasses
> Task :beam-sdks-java-fn-execution:check
> Task :beam-sdks-java-fn-execution:build
> Task :beam-sdks-java-io-elasticsearch:spotbugsMain
The following classes needed for analysis were missing:
com.google.auto.value.AutoValue$Builder
com.google.auto.value.AutoValue
> Task :beam-sdks-java-io-elasticsearch:check
> Task :beam-sdks-java-io-elasticsearch:build
> Task :beam-sdks-java-io-elasticsearch:buildDependents
> Task :beam-sdks-java-io-hadoop-common:javadoc
<https://builds.apache.org/job/beam_PreCommit_Java_Cron/ws/src/sdks/java/io/hadoop-common/src/main/java/org/apache/beam/sdk/io/hadoop/SerializableConfiguration.java>:73: warning: no @param for conf
public static Job newJob(@Nullable SerializableConfiguration conf) throws IOException {
^
<https://builds.apache.org/job/beam_PreCommit_Java_Cron/ws/src/sdks/java/io/hadoop-common/src/main/java/org/apache/beam/sdk/io/hadoop/SerializableConfiguration.java>:73: warning: no @return
public static Job newJob(@Nullable SerializableConfiguration conf) throws IOException {
^
<https://builds.apache.org/job/beam_PreCommit_Java_Cron/ws/src/sdks/java/io/hadoop-common/src/main/java/org/apache/beam/sdk/io/hadoop/SerializableConfiguration.java>:73: warning: no @throws for java.io.IOException
public static Job newJob(@Nullable SerializableConfiguration conf) throws IOException {
^
<https://builds.apache.org/job/beam_PreCommit_Java_Cron/ws/src/sdks/java/io/hadoop-common/src/main/java/org/apache/beam/sdk/io/hadoop/SerializableConfiguration.java>:87: warning: no @param for conf
public static Configuration newConfiguration(@Nullable SerializableConfiguration conf) {
^
<https://builds.apache.org/job/beam_PreCommit_Java_Cron/ws/src/sdks/java/io/hadoop-common/src/main/java/org/apache/beam/sdk/io/hadoop/SerializableConfiguration.java>:87: warning: no @return
public static Configuration newConfiguration(@Nullable SerializableConfiguration conf) {
^
<https://builds.apache.org/job/beam_PreCommit_Java_Cron/ws/src/sdks/java/io/hadoop-common/src/main/java/org/apache/beam/sdk/io/hadoop/WritableCoder.java>:61: warning: no @param for clazz
public static <T extends Writable> WritableCoder<T> of(Class<T> clazz) {
^
<https://builds.apache.org/job/beam_PreCommit_Java_Cron/ws/src/sdks/java/io/hadoop-common/src/main/java/org/apache/beam/sdk/io/hadoop/WritableCoder.java>:61: warning: no @return
public static <T extends Writable> WritableCoder<T> of(Class<T> clazz) {
^
<https://builds.apache.org/job/beam_PreCommit_Java_Cron/ws/src/sdks/java/io/hadoop-common/src/main/java/org/apache/beam/sdk/io/hadoop/WritableCoder.java>:130: warning: no @return
public static CoderProvider getCoderProvider() {
^
8 warnings
> Task :beam-sdks-java-io-hadoop-common:test
> Task :beam-sdks-java-io-hadoop-common:validateShadedJarDoesntLeakNonProjectClasses
> Task :beam-sdks-java-io-hadoop-common:spotbugsMain
> Task :beam-sdks-java-io-hadoop-common:check
> Task :beam-sdks-java-io-hadoop-common:build
> Task :beam-sdks-java-io-redis:check
> Task :beam-sdks-java-io-redis:build
> Task :beam-sdks-java-io-redis:buildDependents
> Task :beam-sdks-java-core:spotbugsMain
> Task :beam-sdks-java-core:test
> Task :beam-sdks-java-extensions-sql-jdbc:shadowJarTest
> Task :beam-sdks-java-extensions-sql-jdbc:preCommit
> Task :beam-runners-flink-1.7:check
> Task :beam-runners-flink-1.7:build
> Task :beam-runners-flink-1.7:buildDependents
> Task :beam-sdks-java-core:spotbugsMain
The following classes needed for analysis were missing:
com.google.auto.value.AutoValue$Builder
com.google.auto.value.AutoValue
> Task :beam-runners-direct-java:jar
> Task :beam-runners-direct-java:packageTests
> Task :beam-runners-direct-java:assemble
> Task :beam-runners-direct-java:analyzeClassesDependencies SKIPPED
> Task :beam-runners-direct-java:analyzeTestClassesDependencies SKIPPED
> Task :beam-runners-direct-java:analyzeDependencies SKIPPED
> Task :beam-sdks-java-extensions-kryo:compileTestJava FROM-CACHE
> Task :beam-sdks-java-extensions-kryo:testClasses UP-TO-DATE
> Task :beam-sdks-java-extensions-kryo:packageTests
> Task :beam-sdks-java-extensions-kryo:assemble
> Task :beam-sdks-java-extensions-kryo:analyzeTestClassesDependencies SKIPPED
> Task :beam-sdks-java-extensions-kryo:analyzeDependencies SKIPPED
> Task :beam-sdks-java-io-hbase:check
> Task :beam-sdks-java-io-hbase:build
> Task :beam-sdks-java-io-hbase:buildDependents
> Task :beam-sdks-java-io-hadoop-common:buildDependents
> Task :beam-sdks-java-extensions-euphoria:compileTestJava FROM-CACHE
> Task :beam-sdks-java-extensions-euphoria:testClasses UP-TO-DATE
> Task :beam-sdks-java-extensions-kryo:checkstyleTest
> Task :beam-sdks-java-extensions-euphoria:packageTests
> Task :beam-sdks-java-extensions-euphoria:assemble
> Task :beam-sdks-java-extensions-euphoria:analyzeTestClassesDependencies SKIPPED
> Task :beam-sdks-java-extensions-euphoria:analyzeDependencies SKIPPED
> Task :beam-runners-direct-java:checkstyleMain
> Task :beam-sdks-java-extensions-euphoria:checkstyleTest
> Task :beam-runners-direct-java:checkstyleTest
> Task :beam-sdks-java-extensions-kryo:test
> Task :beam-sdks-java-extensions-kryo:check
> Task :beam-sdks-java-extensions-kryo:build
> Task :beam-runners-direct-java:javadoc
<https://builds.apache.org/job/beam_PreCommit_Java_Cron/ws/src/runners/direct-java/src/main/java/org/apache/beam/runners/direct/portable/ReferenceRunner.java>:119: warning: no @return
public static ReferenceRunner forPipeline(
^
<https://builds.apache.org/job/beam_PreCommit_Java_Cron/ws/src/runners/direct-java/src/main/java/org/apache/beam/runners/direct/portable/ReferenceRunner.java>:168: warning: no @throws for java.lang.Exception
public void execute() throws Exception {
^
<https://builds.apache.org/job/beam_PreCommit_Java_Cron/ws/src/runners/direct-java/src/main/java/org/apache/beam/runners/direct/Clock.java>:28: warning: no @return
Instant now();
^
<https://builds.apache.org/job/beam_PreCommit_Java_Cron/ws/src/runners/direct-java/src/main/java/org/apache/beam/runners/direct/DirectRunner.java>:135: warning: no @param for options
public static DirectRunner fromOptions(PipelineOptions options) {
^
<https://builds.apache.org/job/beam_PreCommit_Java_Cron/ws/src/runners/direct-java/src/main/java/org/apache/beam/runners/direct/DirectRunner.java>:135: warning: no @return
public static DirectRunner fromOptions(PipelineOptions options) {
^
<https://builds.apache.org/job/beam_PreCommit_Java_Cron/ws/src/runners/direct-java/src/main/java/org/apache/beam/runners/direct/WatermarkManager.java>:841: warning: no @param for <ExecutableT>
WatermarkManager<ExecutableT, ? super CollectionT> create(
^
<https://builds.apache.org/job/beam_PreCommit_Java_Cron/ws/src/runners/direct-java/src/main/java/org/apache/beam/runners/direct/WatermarkManager.java>:841: warning: no @param for <CollectionT>
WatermarkManager<ExecutableT, ? super CollectionT> create(
^
<https://builds.apache.org/job/beam_PreCommit_Java_Cron/ws/src/runners/direct-java/src/main/java/org/apache/beam/runners/direct/WatermarkManager.java>:841: warning: no @return
WatermarkManager<ExecutableT, ? super CollectionT> create(
^
<https://builds.apache.org/job/beam_PreCommit_Java_Cron/ws/src/runners/direct-java/src/main/java/org/apache/beam/runners/direct/WatermarkManager.java>:941: warning: no @param for executable
public TransformWatermarks getWatermarks(ExecutableT executable) {
^
<https://builds.apache.org/job/beam_PreCommit_Java_Cron/ws/src/runners/direct-java/src/main/java/org/apache/beam/runners/direct/WatermarkManager.java>:1140: warning: no @return
public Collection<FiredTimers<ExecutableT>> extractFiredTimers() {
^
<https://builds.apache.org/job/beam_PreCommit_Java_Cron/ws/src/runners/direct-java/src/main/java/org/apache/beam/runners/direct/WatermarkManager.java>:1575: warning: no @return
public Collection<TimerData> getTimers() {
^
<https://builds.apache.org/job/beam_PreCommit_Java_Cron/ws/src/runners/direct-java/src/main/java/org/apache/beam/runners/direct/WatermarkManager.java>:1408: warning: no @return
public static TimerUpdate empty() {
^
<https://builds.apache.org/job/beam_PreCommit_Java_Cron/ws/src/runners/direct-java/src/main/java/org/apache/beam/runners/direct/WatermarkManager.java>:1417: warning: no @param for key
public static TimerUpdateBuilder builder(StructuralKey<?> key) {
^
<https://builds.apache.org/job/beam_PreCommit_Java_Cron/ws/src/runners/direct-java/src/main/java/org/apache/beam/runners/direct/WatermarkManager.java>:1417: warning: no @return
public static TimerUpdateBuilder builder(StructuralKey<?> key) {
^
<https://builds.apache.org/job/beam_PreCommit_Java_Cron/ws/src/runners/direct-java/src/main/java/org/apache/beam/runners/direct/WatermarkManager.java>:1518: warning: no @param for completedTimers
public TimerUpdate withCompletedTimers(Iterable<TimerData> completedTimers) {
^
<https://builds.apache.org/job/beam_PreCommit_Java_Cron/ws/src/runners/direct-java/src/main/java/org/apache/beam/runners/direct/WatermarkManager.java>:1518: warning: no @return
public TimerUpdate withCompletedTimers(Iterable<TimerData> completedTimers) {
^
<https://builds.apache.org/job/beam_PreCommit_Java_Cron/ws/src/runners/direct-java/src/main/java/org/apache/beam/runners/direct/WatermarkManager.java>:1441: warning: no @param for completedTimers
public TimerUpdateBuilder withCompletedTimers(Iterable<TimerData> completedTimers) {
^
<https://builds.apache.org/job/beam_PreCommit_Java_Cron/ws/src/runners/direct-java/src/main/java/org/apache/beam/runners/direct/WatermarkManager.java>:1441: warning: no @return
public TimerUpdateBuilder withCompletedTimers(Iterable<TimerData> completedTimers) {
^
<https://builds.apache.org/job/beam_PreCommit_Java_Cron/ws/src/runners/direct-java/src/main/java/org/apache/beam/runners/direct/WatermarkManager.java>:1450: warning: no @param for setTimer
public TimerUpdateBuilder setTimer(TimerData setTimer) {
^
<https://builds.apache.org/job/beam_PreCommit_Java_Cron/ws/src/runners/direct-java/src/main/java/org/apache/beam/runners/direct/WatermarkManager.java>:1450: warning: no @return
public TimerUpdateBuilder setTimer(TimerData setTimer) {
^
<https://builds.apache.org/job/beam_PreCommit_Java_Cron/ws/src/runners/direct-java/src/main/java/org/apache/beam/runners/direct/WatermarkManager.java>:1465: warning: no @param for deletedTimer
public TimerUpdateBuilder deletedTimer(TimerData deletedTimer) {
^
<https://builds.apache.org/job/beam_PreCommit_Java_Cron/ws/src/runners/direct-java/src/main/java/org/apache/beam/runners/direct/WatermarkManager.java>:1465: warning: no @return
public TimerUpdateBuilder deletedTimer(TimerData deletedTimer) {
^
<https://builds.apache.org/job/beam_PreCommit_Java_Cron/ws/src/runners/direct-java/src/main/java/org/apache/beam/runners/direct/WatermarkManager.java>:1475: warning: no @return
public TimerUpdate build() {
^
<https://builds.apache.org/job/beam_PreCommit_Java_Cron/ws/src/runners/direct-java/src/main/java/org/apache/beam/runners/direct/WatermarkManager.java>:1282: warning: no @return
public Instant getInputWatermark() {
^
<https://builds.apache.org/job/beam_PreCommit_Java_Cron/ws/src/runners/direct-java/src/main/java/org/apache/beam/runners/direct/WatermarkManager.java>:1287: warning: no @return
public Instant getOutputWatermark() {
^
<https://builds.apache.org/job/beam_PreCommit_Java_Cron/ws/src/runners/direct-java/src/main/java/org/apache/beam/runners/direct/WatermarkManager.java>:1297: warning: no @return
public synchronized Instant getSynchronizedProcessingInputTime() {
^
<https://builds.apache.org/job/beam_PreCommit_Java_Cron/ws/src/runners/direct-java/src/main/java/org/apache/beam/runners/direct/WatermarkManager.java>:1311: warning: no @return
public synchronized Instant getSynchronizedProcessingOutputTime() {
^
27 warnings
> Task :beam-sdks-java-javadoc:allJavadoc
> Task :beam-runners-direct-java:spotbugsMain
The following classes needed for analysis were missing:
com.google.auto.value.AutoValue$Builder
com.google.auto.value.AutoValue
> Task :beam-sdks-java-extensions-euphoria:test
> Task :beam-runners-direct-java:test
> Task :beam-sdks-java-core:validateShadedJarDoesntLeakNonProjectClasses
> Task :beam-sdks-java-core:check
> Task :beam-sdks-java-core:build
> Task :beam-sdks-java-core:buildNeeded
> Task :beam-sdks-java-extensions-euphoria:check
> Task :beam-sdks-java-extensions-euphoria:build
> Task :beam-sdks-java-extensions-euphoria:buildDependents
> Task :beam-sdks-java-extensions-kryo:buildDependents
> Task :beam-runners-direct-java:validateShadedJarDoesntLeakNonProjectClasses
> Task :beam-runners-direct-java:check
> Task :beam-runners-direct-java:build
> Task :beam-sdks-java-nexmark:shadowJar
> Task :beam-sdks-java-nexmark:validateShadedJarDoesntLeakNonProjectClasses
> Task :beam-sdks-java-nexmark:check
> Task :beam-sdks-java-nexmark:build
> Task :beam-sdks-java-nexmark:buildDependents
> Task :beam-sdks-java-extensions-sql:buildDependents
> Task :beam-sdks-java-io-kafka:buildDependents
> Task :beam-sdks-java-extensions-join-library:buildDependents
> Task :beam-sdks-java-io-google-cloud-platform:buildDependents
> Task :beam-sdks-java-test-utils:buildDependents
> Task :beam-sdks-java-extensions-protobuf:buildDependents
FAILURE: Build failed with an exception.
* What went wrong:
Execution failed for task ':beam-sdks-java-io-cassandra:test'.
> Process 'Gradle Test Executor 51' finished with non-zero exit value 1
This problem might be caused by incorrect test process configuration.
Please refer to the test execution section in the User Manual at https://docs.gradle.org/5.2.1/userguide/java_testing.html#sec:test_execution
* Try:
Run with --stacktrace option to get the stack trace. Run with --info or --debug option to get more log output. Run with --scan to get full insights.
* Get more help at https://help.gradle.org
Deprecated Gradle features were used in this build, making it incompatible with Gradle 6.0.
Use '--warning-mode all' to show the individual deprecation warnings.
See https://docs.gradle.org/5.2.1/userguide/command_line_interface.html#sec:command_line_warnings
BUILD FAILED in 22m 16s
918 actionable tasks: 788 executed, 130 from cache
Publishing build scan...
https://gradle.com/s/3zarz2sm6qnsw
Build step 'Invoke Gradle script' changed build result to FAILURE
Build step 'Invoke Gradle script' marked build as failure
---------------------------------------------------------------------
To unsubscribe, e-mail: builds-unsubscribe@beam.apache.org
For additional commands, e-mail: builds-help@beam.apache.org