You are viewing a plain text version of this content. The canonical link for it is here.
Posted to dev@poi.apache.org by Apache Jenkins Server <je...@builds.apache.org> on 2014/10/20 22:13:19 UTC
Build failed in Jenkins: POI-JDK8 #173
See <https://builds.apache.org/job/POI-JDK8/173/changes>
Changes:
[centic] Bug 57010: Add implementation of function PROPER
------------------------------------------
Started by an SCM change
Building remotely on ubuntu-2 (docker Ubuntu ubuntu) in workspace <https://builds.apache.org/job/POI-JDK8/ws/>
Updating http://svn.apache.org/repos/asf/poi/trunk at revision '2014-10-20T20:13:00.594 +0000'
U src/ooxml/testcases/org/apache/poi/xssf/extractor/TestXSSFExcelExtractorUsingFactory.java
U src/ooxml/testcases/org/apache/poi/xssf/extractor/TestXSSFEventBasedExcelExtractorUsingFactory.java
U src/ooxml/testcases/org/apache/poi/xssf/extractor/TestXSSFExcelExtractor.java
U src/ooxml/testcases/org/apache/poi/xssf/extractor/TestXSSFEventBasedExcelExtractor.java
A src/testcases/org/apache/poi/ss/formula/functions/TestProper.java
U src/java/org/apache/poi/ss/formula/functions/TextFunction.java
U src/java/org/apache/poi/ss/formula/eval/FunctionEval.java
U build.xml
Fetching 'https://svn.apache.org/repos/asf/poi/site/forrest.properties' at -1 into '<https://builds.apache.org/job/POI-JDK8/ws/forrest.properties'>
Fetching 'https://svn.apache.org/repos/asf/poi/site/src/documentation' at -1 into '<https://builds.apache.org/job/POI-JDK8/ws/src/documentation'>
At revision 1633218
At revision 1633218
no change for http://svn.apache.org/repos/asf/poi/trunk/forrest.properties since the previous build
no change for https://svn.apache.org/repos/asf/poi/site/src/documentation since the previous build
Deleting old artifacts from #171
[POI-JDK8] $ /home/jenkins/tools/ant/latest/bin/ant -DDISABLED.coverage.enabled=true clean jenkins
Buildfile: <https://builds.apache.org/job/POI-JDK8/ws/build.xml>
clean:
[delete] Deleting directory <https://builds.apache.org/job/POI-JDK8/ws/build>
check-jars:
[delete] Deleting <https://builds.apache.org/job/POI-JDK8/ws/lib/xercesImpl-2.6.1.jar>
fetch-jars:
check-ooxml-jars:
fetch-ooxml-jars:
init:
[mkdir] Created dir: <https://builds.apache.org/job/POI-JDK8/ws/build>
[mkdir] Created dir: <https://builds.apache.org/job/POI-JDK8/ws/build/classes>
[mkdir] Created dir: <https://builds.apache.org/job/POI-JDK8/ws/build/test-classes>
[mkdir] Created dir: <https://builds.apache.org/job/POI-JDK8/ws/build/test-results>
[mkdir] Created dir: <https://builds.apache.org/job/POI-JDK8/ws/build/scratchpad-classes>
[mkdir] Created dir: <https://builds.apache.org/job/POI-JDK8/ws/build/scratchpad-test-classes>
[mkdir] Created dir: <https://builds.apache.org/job/POI-JDK8/ws/build/scratchpad-test-results>
[mkdir] Created dir: <https://builds.apache.org/job/POI-JDK8/ws/build/ooxml-classes>
[mkdir] Created dir: <https://builds.apache.org/job/POI-JDK8/ws/build/ooxml-test-classes>
[mkdir] Created dir: <https://builds.apache.org/job/POI-JDK8/ws/build/ooxml-test-results>
[mkdir] Created dir: <https://builds.apache.org/job/POI-JDK8/ws/build/excelant-classes>
[mkdir] Created dir: <https://builds.apache.org/job/POI-JDK8/ws/build/excelant-test-classes>
[mkdir] Created dir: <https://builds.apache.org/job/POI-JDK8/ws/build/excelant-test-results>
[mkdir] Created dir: <https://builds.apache.org/job/POI-JDK8/ws/build/examples-classes>
[mkdir] Created dir: <https://builds.apache.org/job/POI-JDK8/ws/build/dist>
[mkdir] Created dir: <https://builds.apache.org/job/POI-JDK8/ws/build/tmp/site/build/site>
[echo] Using Java: 1.8.0_20/1.8.0_20-b26/25.20-b23/Java HotSpot(TM) 64-Bit Server VM from Oracle Corporation on Linux: 3.13.0-36-lowlatency
compile-main:
[javac] Compiling 965 source files to <https://builds.apache.org/job/POI-JDK8/ws/build/classes>
[javac] warning: [options] bootstrap class path not set in conjunction with -source 1.6
[javac] Note: Some input files use or override a deprecated API.
[javac] Note: Recompile with -Xlint:deprecation for details.
[javac] Note: Some input files use unchecked or unsafe operations.
[javac] Note: Recompile with -Xlint:unchecked for details.
[javac] 1 warning
[javac] Compiling 497 source files to <https://builds.apache.org/job/POI-JDK8/ws/build/test-classes>
[javac] warning: [options] bootstrap class path not set in conjunction with -source 1.6
[javac] <https://builds.apache.org/job/POI-JDK8/ws/src/testcases/org/apache/poi/ss/formula/functions/TestProper.java>:60: error: unmappable character for encoding ASCII
[javac] confirm("PROPER(\"dr��b��'�� ��lo��|���� \")", "Dr��b��'�� ��lo��|���� ");
[javac] ^
[javac] <https://builds.apache.org/job/POI-JDK8/ws/src/testcases/org/apache/poi/ss/formula/functions/TestProper.java>:60: error: unmappable character for encoding ASCII
[javac] confirm("PROPER(\"dr��b��'�� ��lo��|���� \")", "Dr��b��'�� ��lo��|���� ");
[javac] ^
[javac] <https://builds.apache.org/job/POI-JDK8/ws/src/testcases/org/apache/poi/ss/formula/functions/TestProper.java>:60: error: unmappable character for encoding ASCII
[javac] confirm("PROPER(\"dr��b��'�� ��lo��|���� \")", "Dr��b��'�� ��lo��|���� ");
[javac] ^
[javac] <https://builds.apache.org/job/POI-JDK8/ws/src/testcases/org/apache/poi/ss/formula/functions/TestProper.java>:60: error: unmappable character for encoding ASCII
[javac] confirm("PROPER(\"dr��b��'�� ��lo��|���� \")", "Dr��b��'�� ��lo��|���� ");
[javac] ^
[javac] <https://builds.apache.org/job/POI-JDK8/ws/src/testcases/org/apache/poi/ss/formula/functions/TestProper.java>:60: error: unmappable character for encoding ASCII
[javac] confirm("PROPER(\"dr��b��'�� ��lo��|���� \")", "Dr��b��'�� ��lo��|���� ");
[javac] ^
[javac] <https://builds.apache.org/job/POI-JDK8/ws/src/testcases/org/apache/poi/ss/formula/functions/TestProper.java>:60: error: unmappable character for encoding ASCII
[javac] confirm("PROPER(\"dr��b��'�� ��lo��|���� \")", "Dr��b��'�� ��lo��|���� ");
[javac] ^
[javac] <https://builds.apache.org/job/POI-JDK8/ws/src/testcases/org/apache/poi/ss/formula/functions/TestProper.java>:60: error: unmappable character for encoding ASCII
[javac] confirm("PROPER(\"dr��b��'�� ��lo��|���� \")", "Dr��b��'�� ��lo��|���� ");
[javac] ^
[javac] <https://builds.apache.org/job/POI-JDK8/ws/src/testcases/org/apache/poi/ss/formula/functions/TestProper.java>:60: error: unmappable character for encoding ASCII
[javac] confirm("PROPER(\"dr��b��'�� ��lo��|���� \")", "Dr��b��'�� ��lo��|���� ");
[javac] ^
[javac] <https://builds.apache.org/job/POI-JDK8/ws/src/testcases/org/apache/poi/ss/formula/functions/TestProper.java>:60: error: unmappable character for encoding ASCII
[javac] confirm("PROPER(\"dr��b��'�� ��lo��|���� \")", "Dr��b��'�� ��lo��|���� ");
[javac] ^
[javac] <https://builds.apache.org/job/POI-JDK8/ws/src/testcases/org/apache/poi/ss/formula/functions/TestProper.java>:60: error: unmappable character for encoding ASCII
[javac] confirm("PROPER(\"dr��b��'�� ��lo��|���� \")", "Dr��b��'�� ��lo��|���� ");
[javac] ^
[javac] <https://builds.apache.org/job/POI-JDK8/ws/src/testcases/org/apache/poi/ss/formula/functions/TestProper.java>:60: error: unmappable character for encoding ASCII
[javac] confirm("PROPER(\"dr��b��'�� ��lo��|���� \")", "Dr��b��'�� ��lo��|���� ");
[javac] ^
[javac] <https://builds.apache.org/job/POI-JDK8/ws/src/testcases/org/apache/poi/ss/formula/functions/TestProper.java>:60: error: unmappable character for encoding ASCII
[javac] confirm("PROPER(\"dr��b��'�� ��lo��|���� \")", "Dr��b��'�� ��lo��|���� ");
[javac] ^
[javac] <https://builds.apache.org/job/POI-JDK8/ws/src/testcases/org/apache/poi/ss/formula/functions/TestProper.java>:60: error: unmappable character for encoding ASCII
[javac] confirm("PROPER(\"dr��b��'�� ��lo��|���� \")", "Dr��b��'�� ��lo��|���� ");
[javac] ^
[javac] <https://builds.apache.org/job/POI-JDK8/ws/src/testcases/org/apache/poi/ss/formula/functions/TestProper.java>:60: error: unmappable character for encoding ASCII
[javac] confirm("PROPER(\"dr��b��'�� ��lo��|���� \")", "Dr��b��'�� ��lo��|���� ");
[javac] ^
[javac] <https://builds.apache.org/job/POI-JDK8/ws/src/testcases/org/apache/poi/ss/formula/functions/TestProper.java>:60: error: unmappable character for encoding ASCII
[javac] confirm("PROPER(\"dr��b��'�� ��lo��|���� \")", "Dr��b��'�� ��lo��|���� ");
[javac] ^
[javac] <https://builds.apache.org/job/POI-JDK8/ws/src/testcases/org/apache/poi/ss/formula/functions/TestProper.java>:60: error: unmappable character for encoding ASCII
[javac] confirm("PROPER(\"dr��b��'�� ��lo��|���� \")", "Dr��b��'�� ��lo��|���� ");
[javac] ^
[javac] <https://builds.apache.org/job/POI-JDK8/ws/src/testcases/org/apache/poi/ss/formula/functions/TestProper.java>:60: error: unmappable character for encoding ASCII
[javac] confirm("PROPER(\"dr��b��'�� ��lo��|���� \")", "Dr��b��'�� ��lo��|���� ");
[javac] ^
[javac] <https://builds.apache.org/job/POI-JDK8/ws/src/testcases/org/apache/poi/ss/formula/functions/TestProper.java>:60: error: unmappable character for encoding ASCII
[javac] confirm("PROPER(\"dr��b��'�� ��lo��|���� \")", "Dr��b��'�� ��lo��|���� ");
[javac] ^
[javac] <https://builds.apache.org/job/POI-JDK8/ws/src/testcases/org/apache/poi/ss/formula/functions/TestProper.java>:60: error: unmappable character for encoding ASCII
[javac] confirm("PROPER(\"dr��b��'�� ��lo��|���� \")", "Dr��b��'�� ��lo��|���� ");
[javac] ^
[javac] <https://builds.apache.org/job/POI-JDK8/ws/src/testcases/org/apache/poi/ss/formula/functions/TestProper.java>:60: error: unmappable character for encoding ASCII
[javac] confirm("PROPER(\"dr��b��'�� ��lo��|���� \")", "Dr��b��'�� ��lo��|���� ");
[javac] ^
[javac] <https://builds.apache.org/job/POI-JDK8/ws/src/testcases/org/apache/poi/ss/formula/functions/TestProper.java>:60: error: unmappable character for encoding ASCII
[javac] confirm("PROPER(\"dr��b��'�� ��lo��|���� \")", "Dr��b��'�� ��lo��|���� ");
[javac] ^
[javac] <https://builds.apache.org/job/POI-JDK8/ws/src/testcases/org/apache/poi/ss/formula/functions/TestProper.java>:60: error: unmappable character for encoding ASCII
[javac] confirm("PROPER(\"dr��b��'�� ��lo��|���� \")", "Dr��b��'�� ��lo��|���� ");
[javac] ^
[javac] <https://builds.apache.org/job/POI-JDK8/ws/src/testcases/org/apache/poi/ss/formula/functions/TestProper.java>:60: error: unmappable character for encoding ASCII
[javac] confirm("PROPER(\"dr��b��'�� ��lo��|���� \")", "Dr��b��'�� ��lo��|���� ");
[javac] ^
[javac] <https://builds.apache.org/job/POI-JDK8/ws/src/testcases/org/apache/poi/ss/formula/functions/TestProper.java>:60: error: unmappable character for encoding ASCII
[javac] confirm("PROPER(\"dr��b��'�� ��lo��|���� \")", "Dr��b��'�� ��lo��|���� ");
[javac] ^
[javac] <https://builds.apache.org/job/POI-JDK8/ws/src/testcases/org/apache/poi/ss/formula/functions/TestProper.java>:60: error: unmappable character for encoding ASCII
[javac] confirm("PROPER(\"dr��b��'�� ��lo��|���� \")", "Dr��b��'�� ��lo��|���� ");
[javac] ^
[javac] <https://builds.apache.org/job/POI-JDK8/ws/src/testcases/org/apache/poi/ss/formula/functions/TestProper.java>:60: error: unmappable character for encoding ASCII
[javac] confirm("PROPER(\"dr��b��'�� ��lo��|���� \")", "Dr��b��'�� ��lo��|���� ");
[javac] ^
[javac] <https://builds.apache.org/job/POI-JDK8/ws/src/testcases/org/apache/poi/ss/formula/functions/TestProper.java>:60: error: unmappable character for encoding ASCII
[javac] confirm("PROPER(\"dr��b��'�� ��lo��|���� \")", "Dr��b��'�� ��lo��|���� ");
[javac] ^
[javac] <https://builds.apache.org/job/POI-JDK8/ws/src/testcases/org/apache/poi/ss/formula/functions/TestProper.java>:60: error: unmappable character for encoding ASCII
[javac] confirm("PROPER(\"dr��b��'�� ��lo��|���� \")", "Dr��b��'�� ��lo��|���� ");
[javac] ^
[javac] <https://builds.apache.org/job/POI-JDK8/ws/src/testcases/org/apache/poi/ss/formula/functions/TestProper.java>:63: error: unmappable character for encoding ASCII
[javac] confirm("PROPER(\"!��$\")", "!��$");
[javac] ^
[javac] <https://builds.apache.org/job/POI-JDK8/ws/src/testcases/org/apache/poi/ss/formula/functions/TestProper.java>:63: error: unmappable character for encoding ASCII
[javac] confirm("PROPER(\"!��$\")", "!��$");
[javac] ^
[javac] <https://builds.apache.org/job/POI-JDK8/ws/src/testcases/org/apache/poi/ss/formula/functions/TestProper.java>:63: error: unmappable character for encoding ASCII
[javac] confirm("PROPER(\"!��$\")", "!��$");
[javac] ^
[javac] <https://builds.apache.org/job/POI-JDK8/ws/src/testcases/org/apache/poi/ss/formula/functions/TestProper.java>:63: error: unmappable character for encoding ASCII
[javac] confirm("PROPER(\"!��$\")", "!��$");
[javac] ^
[javac] 32 errors
[javac] 1 warning
BUILD FAILED
<https://builds.apache.org/job/POI-JDK8/ws/build.xml>:653: Compile failed; see the compiler error output for details.
Total time: 10 seconds
Build step 'Invoke Ant' marked build as failure
[WARNINGS] Skipping publisher since build result is FAILURE
Archiving artifacts
Recording test results
---------------------------------------------------------------------
To unsubscribe, e-mail: dev-unsubscribe@poi.apache.org
For additional commands, e-mail: dev-help@poi.apache.org
Jenkins build is back to normal : POI-JDK8 #174
Posted by Apache Jenkins Server <je...@builds.apache.org>.
See <https://builds.apache.org/job/POI-JDK8/174/changes>
---------------------------------------------------------------------
To unsubscribe, e-mail: dev-unsubscribe@poi.apache.org
For additional commands, e-mail: dev-help@poi.apache.org