You are viewing a plain text version of this content. The canonical link for it is here.
Posted to dev@poi.apache.org by Apache Jenkins Server <je...@builds.apache.org> on 2024/05/24 12:36:24 UTC

Build failed in Jenkins: POI » POI-DSL-1.21 #140

See <https://ci-builds.apache.org/job/POI/job/POI-DSL-1.21/140/display/redirect?page=changes>

Changes:

[PJ Fanning] commons-compress 1.26.2 released

[PJ Fanning] commons-compress 1.26.2 released


------------------------------------------
[...truncated 3.86 MB...]
org.apache.poi.xssf.usermodel.TestXSSFSheetShiftRows testBug57828_OnlyOneCommentShiftedInRow() PASSED
org.apache.poi.xssf.usermodel.TestXSSFSheet printSetupLandscapeNew() PASSED
org.apache.poi.xssf.model.TestSharedStringsTable testCreateNew() PASSED
org.apache.poi.xssf.model.TestSharedStringsTable testCreateUsingRichTextStrings() PASSED
org.apache.poi.xssf.usermodel.TestXSSFSheet addOverlappingMergedRegions() PASSED
org.apache.poi.xssf.usermodel.TestXSSFSheet testRightToLeft() PASSED
org.apache.poi.xssf.usermodel.TestXSSFSheet removeMerged() PASSED
org.apache.poi.xssf.usermodel.TestXSSFSheet columnBreaks() PASSED
org.apache.poi.xssf.usermodel.TestXSSFSheetShiftRows testBug53798a() PASSED
org.apache.poi.xssf.usermodel.TestXSSFSheet getCellComment() PASSED
org.apache.poi.xssf.usermodel.TestXSSFSheetShiftRows testRemoveSheetAndAdjustActiveSheet() PASSED
org.apache.poi.xssf.usermodel.TestXSSFSheet columnWidth() PASSED
org.apache.poi.xssf.usermodel.TestXSSFSheetShiftRows testShiftSharedFormulas() PASSED
org.apache.poi.xssf.usermodel.charts.TestXDDFManualLayout testDefaultValues() PASSED
org.apache.poi.xssf.usermodel.TestXSSFSheet shiftMerged() PASSED
org.apache.poi.xssf.usermodel.TestXSSFSheet createRowAfterLastRow() PASSED
org.apache.poi.xssf.usermodel.charts.TestXDDFManualLayout testAccessorMethods() PASSED
org.apache.poi.xssf.usermodel.TestXSSFSheet removeMergedRegions() PASSED
org.apache.poi.xssf.usermodel.extensions.TestXSSFHeaderFooter testGetRight() PASSED
org.apache.poi.xssf.usermodel.TestXSSFSheet cloneSheetMultipleTimes() PASSED
org.apache.poi.xssf.usermodel.extensions.TestXSSFHeaderFooter testGetValue() PASSED
org.apache.poi.xssf.usermodel.extensions.TestXSSFHeaderFooter testStripFields() PASSED
org.apache.poi.xssf.usermodel.extensions.TestXSSFHeaderFooter testGetHeaderFooter() PASSED
org.apache.poi.xssf.usermodel.TestXSSFSheet newMergedRegionAt() PASSED
org.apache.poi.xssf.usermodel.extensions.TestXSSFHeaderFooter testGetLeft() PASSED
org.apache.poi.xssf.usermodel.TestXSSFSheet addMerged() PASSED
org.apache.poi.xssf.usermodel.TestXSSFSheet sheetProperties() PASSED
org.apache.poi.xssf.usermodel.extensions.TestXSSFHeaderFooter testSetCenter() PASSED
org.apache.poi.xssf.usermodel.TestXSSFSheet protectSheet() PASSED
org.apache.poi.xssf.usermodel.extensions.TestXSSFHeaderFooter testGetCenter() PASSED
org.apache.poi.xssf.streaming.TestSXSSFDataValidation testDataValidation() PASSED
org.apache.poi.xssf.usermodel.TestXSSFSheet bug55723_Rows() PASSED
org.apache.poi.xssf.usermodel.extensions.TestXSSFHeaderFooter testSetLeft() PASSED
org.apache.poi.xssf.streaming.TestSXSSFDataValidation test53965() PASSED
org.apache.poi.xssf.usermodel.extensions.TestXSSFHeaderFooter testGetSetCenterLeftRight() PASSED
org.apache.poi.xssf.usermodel.TestXSSFSheet testNoMergedRegionsIsEmptyList() PASSED
org.apache.poi.xssf.usermodel.extensions.TestXSSFHeaderFooter testSetRight() PASSED
org.apache.poi.xssf.usermodel.TestXSSFSheet defaultColumnStyle() PASSED
org.apache.poi.xssf.usermodel.TestXSSFSheet displayOptions() PASSED
org.apache.poi.xssf.usermodel.TestXSSFSheet addMergedRegionUnsafe() PASSED
org.apache.poi.xssf.usermodel.TestXSSFSheet getFooter() PASSED
org.apache.poi.xssf.usermodel.TestXSSFSheet rowBreaks() PASSED
org.apache.poi.xssf.usermodel.TestXSSFSheet getRepeatingRowsAndColumns() PASSED
org.apache.poi.xssf.usermodel.TestXSSFSheet autoSizeDate() PASSED
org.apache.poi.xssf.usermodel.TestXSSFSheet getHyperlink() PASSED
org.apache.poi.xwpf.TestPackageCorePropertiesGetKeywords testGetSetKeywords() PASSED
org.apache.poi.xwpf.usermodel.TestXWPFChart testAddChartsToNewDocument() PASSED
org.apache.poi.xwpf.usermodel.TestXWPFChart testRead() PASSED
org.apache.poi.xwpf.usermodel.TestXWPFChart testChartRelation() PASSED
org.apache.poi.xwpf.usermodel.TestXWPFChart testChartTitle() PASSED
org.apache.poi.xssf.usermodel.TestTableStyles testBuiltinStyleInit() PASSED
org.apache.poi.xssf.usermodel.TestTableStyles testCustomStyle() PASSED
org.apache.poi.xwpf.usermodel.TestXWPFPictureData testNew() PASSED
org.apache.poi.xwpf.usermodel.TestXWPFPictureData testRead() PASSED
org.apache.poi.xwpf.usermodel.TestXWPFPictureData testCreateHeaderPicture() PASSED
org.apache.poi.xssf.usermodel.TestXSSFDataValidation testDataValidation() PASSED
org.apache.poi.xssf.usermodel.TestXSSFDataValidation testSetAllowBlankToTrue() PASSED
org.apache.poi.xwpf.usermodel.TestXWPFPictureData testBug51770() PASSED
org.apache.poi.xssf.usermodel.TestXSSFSheet showInPaneManyRowsBug55248() PASSED
org.apache.poi.xssf.usermodel.TestXSSFSheet bug55723d_RowsOver65k() PASSED
org.apache.poi.xssf.usermodel.TestXSSFSheet outlineProperties() PASSED
org.apache.poi.xwpf.usermodel.TestXWPFPictureData testPictureInHeader() PASSED
org.apache.poi.xssf.usermodel.TestXSSFSheet setRepeatingRowsAndColumns() PASSED
org.apache.poi.xssf.usermodel.TestXSSFSheet setRepeatingRowsAndColumnsBug47294() PASSED
org.apache.poi.xssf.usermodel.TestXSSFSheet removeRow() PASSED
org.apache.poi.xssf.usermodel.TestXSSFSheet getSetColumnHidden() PASSED
org.apache.poi.xssf.usermodel.TestXSSFDataValidation testAddValidations() PASSED
org.apache.poi.xwpf.usermodel.TestXWPFPictureData testReadMaxSize() PASSED
org.apache.poi.xssf.usermodel.TestXSSFDataValidation test53965() PASSED
org.apache.poi.xssf.usermodel.TestXSSFDataValidation testSetAllowBlankToFalse() PASSED
org.apache.poi.xssf.usermodel.TestXSSFDataValidation testSetErrorStyles() PASSED
org.apache.poi.xssf.usermodel.TestXSSFSheet removeAllHyperlinks() PASSED
org.apache.poi.xssf.usermodel.TestXSSFDataValidation testDefaultErrorStyle() PASSED
org.apache.poi.xssf.usermodel.TestXSSFSheet testGetSetMargin() PASSED
org.apache.poi.xssf.usermodel.TestXSSFSheet getFirstLastRowNum() PASSED
org.apache.poi.xssf.usermodel.TestXSSFSheet addMergedRegionWithSingleCellShouldFail() PASSED
org.apache.poi.xssf.usermodel.TestXSSFSheet defaultRowStyle() PASSED
org.apache.poi.xssf.usermodel.TestXSSFSheet createFreezePane() PASSED
org.apache.poi.xssf.usermodel.TestXSSFSheet cloneSheet() PASSED
org.apache.poi.xssf.usermodel.TestXSSFSheet testGetSetMarginDeprecated() PASSED
org.apache.poi.xssf.usermodel.TestXSSFDataValidation testTableBasedValidationList() PASSED
org.apache.poi.xssf.usermodel.TestXSSFDataValidation testDefaultAllowBlank() PASSED
org.apache.poi.xssf.usermodel.TestXSSFForkedEvaluator testBasic() PASSED
org.apache.poi.xssf.usermodel.TestXSSFForkedEvaluator testMissingInputCellH() PASSED
org.apache.poi.xssf.usermodel.TestXSSFSheet protectSheet_lowlevel_2013() PASSED
org.apache.poi.xssf.usermodel.TestXSSFSheet testCopyOneRow() PASSED
org.apache.poi.xssf.usermodel.TestXSSFSheet testCopyMultipleRows() PASSED
org.apache.poi.xssf.usermodel.TestXSSFSheet bug47804() PASSED
org.apache.poi.xssf.usermodel.TestXSSFSheet bug47862() PASSED
org.apache.poi.xssf.usermodel.TestXSSFPivotTableSorting testNestedSorting() PASSED
org.apache.poi.xssf.usermodel.TestXSSFSheet bug49966() PASSED
org.apache.poi.xssf.usermodel.TestXSSFSheet testGetHeaderFooterProperties() PASSED
org.apache.poi.xssf.usermodel.TestXSSFSheetUpdateArrayFormulas testModifyArrayCells_removeRow() PASSED
org.apache.poi.xssf.usermodel.TestXSSFSheetUpdateArrayFormulas testModifyArrayCells_removeCell() PASSED
org.apache.poi.xssf.usermodel.TestXSSFSheetUpdateArrayFormulas testAutoCreateOtherCells() PASSED
org.apache.poi.xssf.usermodel.TestXSSFSheetUpdateArrayFormulas testSetArrayFormula_singleCell() PASSED
org.apache.poi.xssf.usermodel.TestXSSFSheetUpdateArrayFormulas testRemoveArrayFormula() PASSED
org.apache.poi.xssf.usermodel.TestXSSFSheetUpdateArrayFormulas testSetArrayFormula_incorrectFormula() PASSED
org.apache.poi.xssf.usermodel.TestXSSFSheetUpdateArrayFormulas testReadArrayFormula() PASSED
org.apache.poi.xssf.usermodel.TestXSSFSheetUpdateArrayFormulas testModifyArrayCells_setCellType() PASSED
org.apache.poi.xssf.usermodel.TestXSSFSheetUpdateArrayFormulas testSetArrayFormula_multiCell() PASSED
org.apache.poi.xssf.usermodel.TestXSSFSheetUpdateArrayFormulas testModifyArrayCells_mergeCellsSingle() PASSED
org.apache.poi.xssf.usermodel.TestXSSFSheetUpdateArrayFormulas testModifyArrayCells_setFormulaResult() PASSED
org.apache.poi.xssf.usermodel.TestXSSFSheetUpdateArrayFormulas testModifyArrayCells_setCellFormula() PASSED
org.apache.poi.xssf.usermodel.TestXSSFSheetUpdateArrayFormulas testArrayFormulas_illegalCalls() PASSED
org.apache.poi.xssf.usermodel.TestXSSFSheetUpdateArrayFormulas shouldNotBeAbleToCreateArrayFormulaOnPreexistingMergedRegion() SKIPPED
org.apache.poi.xssf.usermodel.TestXSSFSheetUpdateArrayFormulas testModifyArrayCells_mergeCellsMulti() PASSED
org.apache.poi.xssf.usermodel.TestXSSFSheetUpdateArrayFormulas testModifyArrayCells_shiftRows() PASSED
org.apache.poi.xssf.usermodel.TestXSSFSheetUpdateArrayFormulas testXSSFSetArrayFormula_multiCell() PASSED
org.apache.poi.xssf.usermodel.TestXSSFSheetUpdateArrayFormulas testXSSFSetArrayFormula_singleCell() PASSED
org.apache.poi.xssf.usermodel.charts.TestXSSFBubbleChartData testExample() PASSED
org.apache.poi.xssf.usermodel.helpers.TestColumnHelper testAddCleanColIntoColsNewOverlapsOverhangingLeftNotRightExactRight() PASSED
org.apache.poi.xssf.usermodel.helpers.TestColumnHelper testAddCleanColIntoColsNewOverlapsOverhangingRightNotLeftExactLeft() PASSED
org.apache.poi.xssf.usermodel.helpers.TestColumnHelper testAddCleanColIntoColsOverlapsCompletelyNested() PASSED
org.apache.poi.xssf.usermodel.helpers.TestColumnHelper testCleanColumns() PASSED
org.apache.poi.xssf.usermodel.helpers.TestColumnHelper testGetOrCreateColumn() PASSED
org.apache.poi.xssf.usermodel.helpers.TestColumnHelper testAddCleanColIntoColsExactOverlap() PASSED
org.apache.poi.xssf.usermodel.helpers.TestColumnHelper testColumnsCollapsed() PASSED
org.apache.poi.xssf.usermodel.helpers.TestColumnHelper testAddCleanColIntoCols() PASSED
org.apache.poi.xssf.usermodel.helpers.TestColumnHelper testSetColumnAttributes() PASSED
org.apache.poi.xssf.usermodel.helpers.TestColumnHelper testGetColumn() PASSED
org.apache.poi.xssf.usermodel.helpers.TestColumnHelper testAddCleanColIntoColsNewOverlapsOverhangingLeftNotRight() PASSED
org.apache.poi.xssf.usermodel.helpers.TestColumnHelper testAddCleanColIntoColsOverlapsOverhangingBothSides() PASSED
org.apache.poi.xssf.usermodel.helpers.TestColumnHelper testSortColumns() PASSED
org.apache.poi.xssf.usermodel.helpers.TestColumnHelper testAddCleanColIntoColsNewOverlapsOverhangingRightNotLeft() PASSED
org.apache.poi.xssf.usermodel.helpers.TestColumnHelper testGetSetColDefaultStyle() PASSED
org.apache.poi.xssf.usermodel.helpers.TestColumnHelper testCloneCol() PASSED
org.apache.poi.xwpf.usermodel.TestXWPFComments testAddCommentsToDoc() PASSED
org.apache.poi.xwpf.usermodel.TestXWPFComments testReadComments() PASSED
org.apache.poi.xwpf.usermodel.TestXWPFSDT testNestedSDTs() PASSED
org.apache.poi.xwpf.usermodel.TestXWPFSDT test60341() PASSED
org.apache.poi.xwpf.usermodel.TestXWPFSDT test62859() PASSED
org.apache.poi.xwpf.usermodel.TestXWPFSDT testGetSDTs() PASSED
org.apache.poi.xwpf.usermodel.TestXWPFSDT testTagTitle() PASSED
org.apache.poi.xwpf.usermodel.TestXWPFSDT testSDTAsCell() PASSED
org.apache.poi.xwpf.usermodel.TestXWPFSDT testNewLinesBetweenRuns() PASSED
org.apache.poi.xssf.usermodel.TestXSSFSheet bug51585() PASSED (2s)
org.apache.poi.xssf.usermodel.TestXSSFSheet > bug54607(String, String, String) [1] 54607.xlsx, 1, 0, 0, 0, 0, 0 PASSED
org.apache.poi.xssf.usermodel.TestXSSFSheet > bug54607(String, String, String) [2] 54436.xlsx, 0, 0 PASSED
org.apache.poi.xssf.usermodel.TestXSSFSheet > bug54607(String, String, String) [3] TwoSheetsNoneHidden.xlsx, 0, 0, 0, 0 PASSED
org.apache.poi.xssf.usermodel.TestXSSFSheet > bug54607(String, String, String) [4] TwoSheetsNoneHidden.xls, 0, 0, 0, 0 PASSED
org.apache.poi.xssf.usermodel.TestXSSFSheet bug55745() PASSED
org.apache.poi.xssf.usermodel.TestXSSFSheet bug65120() PASSED
org.apache.poi.xssf.usermodel.TestXSSFSheet testRemoveRowWithCommentAndGapAbove() PASSED
org.apache.poi.xssf.usermodel.TestXSSFSheet setRowGroupCollapsed() PASSED
org.apache.poi.xssf.usermodel.TestXSSFSheet testRowShiftWithHyperlink1() PASSED
org.apache.poi.xssf.usermodel.TestXSSFSheet testRowShiftWithHyperlink2() PASSED
org.apache.poi.xssf.usermodel.TestXSSFSheet testRowShiftWithHyperlink3() PASSED
org.apache.poi.xssf.usermodel.TestXSSFSheet setDefaultColumnStyle() PASSED
org.apache.poi.xssf.usermodel.TestXSSFSheet groupUngroupRow() PASSED
org.apache.poi.xssf.usermodel.TestXSSFSheet saveGroupColumns() PASSED
org.apache.poi.xssf.usermodel.TestXSSFSheet tabColor() PASSED
org.apache.poi.xssf.usermodel.TestXSSFSheet tables() PASSED
org.apache.poi.xssf.usermodel.TestXSSFSheet testBug64536() PASSED
org.apache.poi.xssf.usermodel.TestXSSFSheet testNotCascadeWorkbookSetForceFormulaRecalculation() PASSED
org.apache.poi.xssf.usermodel.TestXSSFSheet commentsTable() PASSED
org.apache.poi.xssf.usermodel.TestXSSFSheet protectSheet_lowlevel() PASSED
org.apache.poi.xssf.usermodel.TestXSSFSheet bug55723b() PASSED
org.apache.poi.xssf.usermodel.TestXSSFSheet testCustomWidthAndHeight() PASSED
org.apache.poi.xssf.usermodel.TestXSSFSheet testReadFails() PASSED
org.apache.poi.xssf.usermodel.TestXSSFSheet testNewSheetGetDimension() PASSED
org.apache.poi.xssf.usermodel.TestXSSFSheet testCreatePivotTableInOtherSheetThanDataSheet() PASSED
org.apache.poi.xssf.usermodel.TestXSSFSheet createFreezePane_XSSF() PASSED
org.apache.poi.xssf.usermodel.TestXSSFSheet testSetBlankOnNestedSharedFormulas() PASSED
org.apache.poi.xssf.usermodel.TestXSSFSheet setAutoFilter() PASSED
org.apache.poi.xssf.usermodel.TestXSSFSheet testCreateTwoPivotTablesInTwoSheets() PASSED
org.apache.poi.xssf.usermodel.TestXSSFSheet protectSheet_emptyPassword() PASSED
org.apache.poi.xssf.usermodel.TestXSSFSheet getAllHeadersFooters() PASSED
org.apache.poi.xssf.usermodel.TestXSSFSheet defaultActivePaneType() PASSED
org.apache.poi.xssf.usermodel.TestXSSFSheet testCreatePivotTableWithConflictingDataSheets() PASSED
org.apache.poi.xssf.usermodel.TestXSSFSheet removeMergedRegion_lowlevel() PASSED
org.apache.poi.xssf.usermodel.TestXSSFSheet testSheetForceFormulaRecalculationDefaultValues() PASSED
org.apache.poi.xssf.usermodel.TestXSSFSheet testHeaderWithAmpersand() PASSED
org.apache.poi.xssf.usermodel.TestXSSFSheet headerFooterWithFormat() PASSED
org.apache.poi.xssf.usermodel.TestXSSFSheet testCreatePivotTableInOtherSheetThanDataSheetUsingAreaReference() PASSED
org.apache.poi.xssf.usermodel.TestXSSFSheet columnWidth_lowlevel() PASSED
org.apache.poi.xssf.usermodel.TestXSSFSheet createRow() PASSED
org.apache.poi.xssf.usermodel.TestXSSFSheet existingHeaderFooter() PASSED
org.apache.poi.xssf.usermodel.TestXSSFSheet collapseNonExistentGroupColumn() PASSED
org.apache.poi.xssf.usermodel.TestXSSFSheet testCreateComment() PASSED
org.apache.poi.xssf.usermodel.TestXSSFSheet testCreateTwoPivotTablesInOneSheet() PASSED
org.apache.poi.xssf.usermodel.TestXSSFSheet testWorkbookSetForceFormulaRecalculation() PASSED
org.apache.poi.xssf.usermodel.TestXSSFSheet setTabColor() PASSED
org.apache.poi.xssf.usermodel.TestXSSFSheet getTabColor() PASSED
org.apache.poi.xssf.usermodel.TestXSSFSheet groupUngroupColumn() PASSED
org.apache.poi.xssf.usermodel.TestXSSFSheet setForceFormulaRecalculation() PASSED
org.apache.poi.xssf.usermodel.TestXSSFSheet setColumnGroupCollapsed() PASSED
org.apache.poi.xssf.usermodel.TestXSSFSheet setCellComment() PASSED
org.apache.poi.xssf.usermodel.TestXSSFSheet testInsertCommentsToClonedSheet() PASSED
org.apache.poi.xssf.usermodel.TestXSSFSheet expandGroupColumn() PASSED
org.apache.poi.xssf.usermodel.TestXSSFSheet getActiveCell() PASSED
org.apache.poi.xssf.usermodel.TestXSSFSheet testIgnoredErrors() PASSED
org.apache.poi.xssf.usermodel.TestXSSFSheet collapseGroupColumn() PASSED
org.apache.poi.xssf.usermodel.TestXSSFSheet setZoom() PASSED
org.apache.poi.xssf.usermodel.TestXSSFSheet testIgnoredErrorsMultipleCalls() PASSED
org.apache.poi.xssf.usermodel.TestXSSFSheet createFreezePane_XSSF_withBug66173() PASSED
org.apache.poi.xssf.usermodel.TestXSSFSheet testCreatePivotTable() PASSED
org.apache.poi.xssf.usermodel.TestXSSFSheet testIgnoredErrorsMultipleTypes() PASSED
org.apache.poi.xssf.usermodel.TestXSSFSheet autoSizeColumn() PASSED
org.apache.poi.xssf.usermodel.TestXSSFTextRun testXSSFTextParagraph() PASSED
org.apache.poi.xssf.usermodel.charts.TestXSSFLineChartData testOneSeriesPlot() PASSED
org.apache.poi.xssf.util.TestEvilUnclosedBRFixingInputStream testOK() PASSED
org.apache.poi.xssf.util.TestEvilUnclosedBRFixingInputStream testProblem() PASSED
org.apache.poi.xssf.util.TestEvilUnclosedBRFixingInputStream testBufferSize() PASSED
org.apache.poi.xwpf.model.TestXWPFHeaderFooterPolicy testContents() PASSED
org.apache.poi.xwpf.model.TestXWPFHeaderFooterPolicy testCreate() PASSED
org.apache.poi.xwpf.model.TestXWPFHeaderFooterPolicy testPolicy() PASSED
org.apache.poi.xwpf.usermodel.TestXWPFFootnotes testLoadFootnotesOnce() PASSED
org.apache.poi.xwpf.usermodel.TestXWPFFootnotes testAddFootnotesToDocument() PASSED
org.apache.poi.xwpf.usermodel.TestXWPFFootnotes testCreateFootnotes() PASSED
org.apache.poi.xwpf.usermodel.TestXWPFTableRow testBug62174() PASSED
org.apache.poi.xwpf.usermodel.TestXWPFTableRow testIsRepeatHeader() PASSED
org.apache.poi.xwpf.usermodel.TestXWPFTableRow testGetSetHeightRule() PASSED
org.apache.poi.xwpf.usermodel.TestXWPFTableRow testRemoveCell() PASSED
org.apache.poi.xwpf.usermodel.TestXWPFTableRow testCreateCell() PASSED
org.apache.poi.xwpf.usermodel.TestXWPFTableRow testSetGetCantSplitRow() PASSED
org.apache.poi.xwpf.usermodel.TestXWPFTableRow testCreateRow() PASSED
org.apache.poi.xwpf.usermodel.TestXWPFTableRow testIsCantSplit() PASSED
org.apache.poi.xwpf.usermodel.TestXWPFTableRow testSetGetRepeatHeader() PASSED

SUCCESS: Executed 3387 tests in 1m 43s (118 skipped)


FAILURE: Build failed with an exception.

* What went wrong:
Execution failed for task ':poi-integration:test'.
> There were failing tests. See the report at: file://<https://ci-builds.apache.org/job/POI/job/POI-DSL-1.21/ws/poi-integration/build/reports/tests/test/index.html>

* Try:
> Run with --scan to get full insights.

Deprecated Gradle features were used in this build, making it incompatible with Gradle 9.0.

You can use '--warning-mode all' to show the individual deprecation warnings and determine if they come from your own scripts or plugins.

For more on this, please refer to https://docs.gradle.org/8.7/userguide/command_line_interface.html#sec:command_line_warnings in the Gradle documentation.

BUILD FAILED in 5m 26s
135 actionable tasks: 125 executed, 10 up-to-date
Build step 'Invoke Gradle script' changed build result to FAILURE
Build step 'Invoke Gradle script' marked build as failure
ERROR: Not all environment variables could be successfully injected. Check for similarly-named environment variables.
Archiving artifacts
ERROR: Not all environment variables could be successfully injected. Check for similarly-named environment variables.
Recording test results
ERROR: Not all environment variables could be successfully injected. Check for similarly-named environment variables.
[Checks API] No suitable checks publisher found.
ERROR: Not all environment variables could be successfully injected. Check for similarly-named environment variables.

---------------------------------------------------------------------
To unsubscribe, e-mail: dev-unsubscribe@poi.apache.org
For additional commands, e-mail: dev-help@poi.apache.org


Jenkins build is back to normal : POI » POI-DSL-1.21 #141

Posted by Apache Jenkins Server <je...@builds.apache.org>.
See <https://ci-builds.apache.org/job/POI/job/POI-DSL-1.21/141/display/redirect?page=changes>


---------------------------------------------------------------------
To unsubscribe, e-mail: dev-unsubscribe@poi.apache.org
For additional commands, e-mail: dev-help@poi.apache.org