You are viewing a plain text version of this content. The canonical link for it is here.
Posted to builds@mesos.apache.org by Apache Jenkins Server <je...@builds.apache.org> on 2017/08/22 22:00:21 UTC

Build failed in Jenkins: Mesos-Buildbot » autotools,clang,--verbose,GLOG_v=1 MESOS_VERBOSE=1,ubuntu:14.04,(ubuntu)&&(!ubuntu-us1)&&(!ubuntu-eu2) #4140

See <https://builds.apache.org/job/Mesos-Buildbot/BUILDTOOL=autotools,COMPILER=clang,CONFIGURATION=--verbose,ENVIRONMENT=GLOG_v=1%20MESOS_VERBOSE=1,OS=ubuntu%3A14.04,label_exp=(ubuntu)&&(!ubuntu-us1)&&(!ubuntu-eu2)/4140/display/redirect?page=changes>

Changes:

[yujie.jay] Captured the inode when scanning for sockets.

[yujie.jay] Removed diagnostic socket IPv4 assumptions.

[yujie.jay] Exposed LinuxLauncher cgroups helper.

[yujie.jay] Refactored isolator dependency checking.

[yujie.jay] Use a consistent preprocessor check for ENABLE_PORT_MAPPING_ISOLATOR.

[yujie.jay] Added IntervalSet to Ranges conversion helpers.

[yujie.jay] Used common port range interval code in the port_mapping isolator.

[yujie.jay] Moved the libnl3 configure checks into a macro.

------------------------------------------
[...truncated 30.81 MB...]
I0822 22:00:12.923166  3956 slave.cpp:253] Flags at startup: --acls="" --appc_simple_discovery_uri_prefix="http://" --appc_store_dir="/tmp/Endpoint_SlaveEndpointTest_AuthorizedRequest_2_9o9uNJ/store/appc" --authenticate_http_readonly="true" --authenticate_http_readwrite="true" --authenticatee="crammd5" --authentication_backoff_factor="1secs" --authorizer="local" --cgroups_cpu_enable_pids_and_tids_count="false" --cgroups_enable_cfs="false" --cgroups_hierarchy="/sys/fs/cgroup" --cgroups_limit_swap="false" --cgroups_root="mesos" --container_disk_watch_interval="15secs" --containerizers="mesos" --credential="/tmp/Endpoint_SlaveEndpointTest_AuthorizedRequest_2_9o9uNJ/credential" --default_role="*" --disallow_sharing_agent_pid_namespace="false" --disk_watch_interval="1mins" --docker="docker" --docker_kill_orphans="true" --docker_registry="https://registry-1.docker.io" --docker_remove_delay="6hrs" --docker_socket="/var/run/docker.sock" --docker_stop_timeout="0ns" --docker_store_dir="/tmp/Endpoint_SlaveEndpointTest_AuthorizedRequest_2_9o9uNJ/store/docker" --docker_volume_checkpoint_dir="/var/run/mesos/isolators/docker/volume" --enforce_container_disk_quota="false" --executor_registration_timeout="1mins" --executor_reregistration_timeout="2secs" --executor_shutdown_grace_period="5secs" --fetcher_cache_dir="/tmp/Endpoint_SlaveEndpointTest_AuthorizedRequest_2_9o9uNJ/fetch" --fetcher_cache_size="2GB" --frameworks_home="" --gc_delay="1weeks" --gc_disk_headroom="0.1" --hadoop_home="" --help="false" --hostname_lookup="true" --http_command_executor="false" --http_credentials="/tmp/Endpoint_SlaveEndpointTest_AuthorizedRequest_2_9o9uNJ/http_credentials" --http_heartbeat_interval="30secs" --initialize_driver_logging="true" --isolation="posix/cpu,posix/mem" --launcher="posix" --launcher_dir="/mesos/mesos-1.5.0/_build/src" --logbufsecs="0" --logging_level="INFO" --max_completed_executors_per_framework="150" --oversubscribed_resources_interval="15secs" --perf_duration="10secs" --perf_interval="1mins" --port="5051" --qos_correction_interval_min="0ns" --quiet="false" --recover="reconnect" --recovery_timeout="15mins" --registration_backoff_factor="10ms" --resources="cpus:2;gpus:0;mem:1024;disk:1024;ports:[31000-32000]" --revocable_cpu_low_priority="true" --runtime_dir="/tmp/Endpoint_SlaveEndpointTest_AuthorizedRequest_2_9o9uNJ" --sandbox_directory="/mnt/mesos/sandbox" --strict="true" --switch_user="true" --systemd_enable_support="true" --systemd_runtime_directory="/run/systemd/system" --version="false" --work_dir="/tmp/Endpoint_SlaveEndpointTest_AuthorizedRequest_2_oej4KO"
I0822 22:00:12.923488  3956 credentials.hpp:86] Loading credential for authentication from '/tmp/Endpoint_SlaveEndpointTest_AuthorizedRequest_2_9o9uNJ/credential'
I0822 22:00:12.923645  3956 slave.cpp:285] Agent using credential for: test-principal
I0822 22:00:12.923666  3956 credentials.hpp:37] Loading credentials for authentication from '/tmp/Endpoint_SlaveEndpointTest_AuthorizedRequest_2_9o9uNJ/http_credentials'
I0822 22:00:12.923882  3956 http.cpp:1026] Creating default 'basic' HTTP authenticator for realm 'mesos-agent-readonly'
I0822 22:00:12.924039  3956 http.cpp:1026] Creating default 'basic' HTTP authenticator for realm 'mesos-agent-readwrite'
I0822 22:00:12.925302  3956 slave.cpp:581] Agent resources: [{"name":"cpus","scalar":{"value":2.0},"type":"SCALAR"},{"name":"mem","scalar":{"value":1024.0},"type":"SCALAR"},{"name":"disk","scalar":{"value":1024.0},"type":"SCALAR"},{"name":"ports","ranges":{"range":[{"begin":31000,"end":32000}]},"type":"RANGES"}]
I0822 22:00:12.925503  3956 slave.cpp:589] Agent attributes: [  ]
I0822 22:00:12.925518  3956 slave.cpp:598] Agent hostname: 0af2dee3e7b2
I0822 22:00:12.925629  3946 status_update_manager.cpp:177] Pausing sending status updates
I0822 22:00:12.927018  3963 state.cpp:64] Recovering state from '/tmp/Endpoint_SlaveEndpointTest_AuthorizedRequest_2_oej4KO/meta'
I0822 22:00:12.927273  3949 status_update_manager.cpp:203] Recovering status update manager
I0822 22:00:12.927451  3961 containerizer.cpp:643] Recovering containerizer
I0822 22:00:12.928680  3958 provisioner.cpp:416] Provisioner recovery complete
I0822 22:00:12.928975  3948 slave.cpp:6226] Finished recovery
I0822 22:00:12.929412  3948 slave.cpp:6408] Querying resource estimator for oversubscribable resources
I0822 22:00:12.929601  3953 slave.cpp:6422] Received oversubscribable resources {} from the resource estimator
I0822 22:00:12.931953  3947 process.cpp:3933] Handling HTTP event for process 'slave(801)' with path: '/slave(801)/containers'
I0822 22:00:12.933017  3960 http.cpp:1166] HTTP GET for /slave(801)/containers from 172.17.0.3:35888
I0822 22:00:12.933085  3960 http.cpp:957] Authorizing principal 'test-principal' to GET the '/containers' endpoint
I0822 22:00:12.936022  3963 slave.cpp:859] Agent terminating
[       OK ] Endpoint/SlaveEndpointTest.AuthorizedRequest/2 (26 ms)
[ RUN      ] Endpoint/SlaveEndpointTest.UnauthorizedRequest/0
I0822 22:00:12.950006  3927 containerizer.cpp:288] Using isolation { environment_secret, posix/cpu, posix/mem, filesystem/posix, network/cni }
W0822 22:00:12.950439  3927 backend.cpp:76] Failed to create 'aufs' backend: AufsBackend requires root privileges
W0822 22:00:12.950546  3927 backend.cpp:76] Failed to create 'bind' backend: BindBackend requires root privileges
I0822 22:00:12.950587  3927 provisioner.cpp:255] Using default backend 'copy'
I0822 22:00:12.953524  3964 slave.cpp:252] Mesos agent started on (802)@172.17.0.3:41431
I0822 22:00:12.953553  3964 slave.cpp:253] Flags at startup: --acls="" --appc_simple_discovery_uri_prefix="http://" --appc_store_dir="/tmp/Endpoint_SlaveEndpointTest_UnauthorizedRequest_0_X1frcq/store/appc" --authenticate_http_readonly="true" --authenticate_http_readwrite="true" --authenticatee="crammd5" --authentication_backoff_factor="1secs" --authorizer="local" --cgroups_cpu_enable_pids_and_tids_count="false" --cgroups_enable_cfs="false" --cgroups_hierarchy="/sys/fs/cgroup" --cgroups_limit_swap="false" --cgroups_root="mesos" --container_disk_watch_interval="15secs" --containerizers="mesos" --credential="/tmp/Endpoint_SlaveEndpointTest_UnauthorizedRequest_0_X1frcq/credential" --default_role="*" --disallow_sharing_agent_pid_namespace="false" --disk_watch_interval="1mins" --docker="docker" --docker_kill_orphans="true" --docker_registry="https://registry-1.docker.io" --docker_remove_delay="6hrs" --docker_socket="/var/run/docker.sock" --docker_stop_timeout="0ns" --docker_store_dir="/tmp/Endpoint_SlaveEndpointTest_UnauthorizedRequest_0_X1frcq/store/docker" --docker_volume_checkpoint_dir="/var/run/mesos/isolators/docker/volume" --enforce_container_disk_quota="false" --executor_registration_timeout="1mins" --executor_reregistration_timeout="2secs" --executor_shutdown_grace_period="5secs" --fetcher_cache_dir="/tmp/Endpoint_SlaveEndpointTest_UnauthorizedRequest_0_X1frcq/fetch" --fetcher_cache_size="2GB" --frameworks_home="" --gc_delay="1weeks" --gc_disk_headroom="0.1" --hadoop_home="" --help="false" --hostname_lookup="true" --http_command_executor="false" --http_credentials="/tmp/Endpoint_SlaveEndpointTest_UnauthorizedRequest_0_X1frcq/http_credentials" --http_heartbeat_interval="30secs" --initialize_driver_logging="true" --isolation="posix/cpu,posix/mem" --launcher="posix" --launcher_dir="/mesos/mesos-1.5.0/_build/src" --logbufsecs="0" --logging_level="INFO" --max_completed_executors_per_framework="150" --oversubscribed_resources_interval="15secs" --perf_duration="10secs" --perf_interval="1mins" --port="5051" --qos_correction_interval_min="0ns" --quiet="false" --recover="reconnect" --recovery_timeout="15mins" --registration_backoff_factor="10ms" --resources="cpus:2;gpus:0;mem:1024;disk:1024;ports:[31000-32000]" --revocable_cpu_low_priority="true" --runtime_dir="/tmp/Endpoint_SlaveEndpointTest_UnauthorizedRequest_0_X1frcq" --sandbox_directory="/mnt/mesos/sandbox" --strict="true" --switch_user="true" --systemd_enable_support="true" --systemd_runtime_directory="/run/systemd/system" --version="false" --work_dir="/tmp/Endpoint_SlaveEndpointTest_UnauthorizedRequest_0_YaAr5u"
I0822 22:00:12.953866  3964 credentials.hpp:86] Loading credential for authentication from '/tmp/Endpoint_SlaveEndpointTest_UnauthorizedRequest_0_X1frcq/credential'
I0822 22:00:12.954012  3964 slave.cpp:285] Agent using credential for: test-principal
I0822 22:00:12.954033  3964 credentials.hpp:37] Loading credentials for authentication from '/tmp/Endpoint_SlaveEndpointTest_UnauthorizedRequest_0_X1frcq/http_credentials'
I0822 22:00:12.954241  3964 http.cpp:1026] Creating default 'basic' HTTP authenticator for realm 'mesos-agent-readonly'
I0822 22:00:12.954390  3964 http.cpp:1026] Creating default 'basic' HTTP authenticator for realm 'mesos-agent-readwrite'
I0822 22:00:12.955598  3964 slave.cpp:581] Agent resources: [{"name":"cpus","scalar":{"value":2.0},"type":"SCALAR"},{"name":"mem","scalar":{"value":1024.0},"type":"SCALAR"},{"name":"disk","scalar":{"value":1024.0},"type":"SCALAR"},{"name":"ports","ranges":{"range":[{"begin":31000,"end":32000}]},"type":"RANGES"}]
I0822 22:00:12.955797  3964 slave.cpp:589] Agent attributes: [  ]
I0822 22:00:12.955812  3964 slave.cpp:598] Agent hostname: 0af2dee3e7b2
I0822 22:00:12.955926  3957 status_update_manager.cpp:177] Pausing sending status updates
I0822 22:00:12.957250  3946 state.cpp:64] Recovering state from '/tmp/Endpoint_SlaveEndpointTest_UnauthorizedRequest_0_YaAr5u/meta'
I0822 22:00:12.957484  3948 status_update_manager.cpp:203] Recovering status update manager
I0822 22:00:12.957650  3960 containerizer.cpp:643] Recovering containerizer
I0822 22:00:12.958861  3963 provisioner.cpp:416] Provisioner recovery complete
I0822 22:00:12.959173  3958 slave.cpp:6226] Finished recovery
I0822 22:00:12.959574  3958 slave.cpp:6408] Querying resource estimator for oversubscribable resources
I0822 22:00:12.959765  3950 slave.cpp:6422] Received oversubscribable resources {} from the resource estimator
I0822 22:00:12.961998  3945 process.cpp:3933] Handling HTTP event for process 'slave(802)' with path: '/slave(802)/monitor/statistics'
I0822 22:00:12.963045  3965 http.cpp:1166] HTTP GET for /slave(802)/monitor/statistics from 172.17.0.3:35890
I0822 22:00:12.963110  3965 http.cpp:957] Authorizing principal 'test-principal' to GET the '/monitor/statistics' endpoint
I0822 22:00:12.964476  3965 slave.cpp:859] Agent terminating
[       OK ] Endpoint/SlaveEndpointTest.UnauthorizedRequest/0 (24 ms)
[ RUN      ] Endpoint/SlaveEndpointTest.UnauthorizedRequest/1
I0822 22:00:12.979693  3927 containerizer.cpp:288] Using isolation { environment_secret, posix/cpu, posix/mem, filesystem/posix, network/cni }
W0822 22:00:12.980319  3927 backend.cpp:76] Failed to create 'aufs' backend: AufsBackend requires root privileges
W0822 22:00:12.980425  3927 backend.cpp:76] Failed to create 'bind' backend: BindBackend requires root privileges
I0822 22:00:12.980459  3927 provisioner.cpp:255] Using default backend 'copy'
I0822 22:00:12.983441  3965 slave.cpp:252] Mesos agent started on (803)@172.17.0.3:41431
I0822 22:00:12.983474  3965 slave.cpp:253] Flags at startup: --acls="" --appc_simple_discovery_uri_prefix="http://" --appc_store_dir="/tmp/Endpoint_SlaveEndpointTest_UnauthorizedRequest_1_6dJyS6/store/appc" --authenticate_http_readonly="true" --authenticate_http_readwrite="true" --authenticatee="crammd5" --authentication_backoff_factor="1secs" --authorizer="local" --cgroups_cpu_enable_pids_and_tids_count="false" --cgroups_enable_cfs="false" --cgroups_hierarchy="/sys/fs/cgroup" --cgroups_limit_swap="false" --cgroups_root="mesos" --container_disk_watch_interval="15secs" --containerizers="mesos" --credential="/tmp/Endpoint_SlaveEndpointTest_UnauthorizedRequest_1_6dJyS6/credential" --default_role="*" --disallow_sharing_agent_pid_namespace="false" --disk_watch_interval="1mins" --docker="docker" --docker_kill_orphans="true" --docker_registry="https://registry-1.docker.io" --docker_remove_delay="6hrs" --docker_socket="/var/run/docker.sock" --docker_stop_timeout="0ns" --docker_store_dir="/tmp/Endpoint_SlaveEndpointTest_UnauthorizedRequest_1_6dJyS6/store/docker" --docker_volume_checkpoint_dir="/var/run/mesos/isolators/docker/volume" --enforce_container_disk_quota="false" --executor_registration_timeout="1mins" --executor_reregistration_timeout="2secs" --executor_shutdown_grace_period="5secs" --fetcher_cache_dir="/tmp/Endpoint_SlaveEndpointTest_UnauthorizedRequest_1_6dJyS6/fetch" --fetcher_cache_size="2GB" --frameworks_home="" --gc_delay="1weeks" --gc_disk_headroom="0.1" --hadoop_home="" --help="false" --hostname_lookup="true" --http_command_executor="false" --http_credentials="/tmp/Endpoint_SlaveEndpointTest_UnauthorizedRequest_1_6dJyS6/http_credentials" --http_heartbeat_interval="30secs" --initialize_driver_logging="true" --isolation="posix/cpu,posix/mem" --launcher="posix" --launcher_dir="/mesos/mesos-1.5.0/_build/src" --logbufsecs="0" --logging_level="INFO" --max_completed_executors_per_framework="150" --oversubscribed_resources_interval="15secs" --perf_duration="10secs" --perf_interval="1mins" --port="5051" --qos_correction_interval_min="0ns" --quiet="false" --recover="reconnect" --recovery_timeout="15mins" --registration_backoff_factor="10ms" --resources="cpus:2;gpus:0;mem:1024;disk:1024;ports:[31000-32000]" --revocable_cpu_low_priority="true" --runtime_dir="/tmp/Endpoint_SlaveEndpointTest_UnauthorizedRequest_1_6dJyS6" --sandbox_directory="/mnt/mesos/sandbox" --strict="true" --switch_user="true" --systemd_enable_support="true" --systemd_runtime_directory="/run/systemd/system" --version="false" --work_dir="/tmp/Endpoint_SlaveEndpointTest_UnauthorizedRequest_1_X9aiHb"
I0822 22:00:12.983803  3965 credentials.hpp:86] Loading credential for authentication from '/tmp/Endpoint_SlaveEndpointTest_UnauthorizedRequest_1_6dJyS6/credential'
I0822 22:00:12.983991  3965 slave.cpp:285] Agent using credential for: test-principal
I0822 22:00:12.984017  3965 credentials.hpp:37] Loading credentials for authentication from '/tmp/Endpoint_SlaveEndpointTest_UnauthorizedRequest_1_6dJyS6/http_credentials'
I0822 22:00:12.984246  3965 http.cpp:1026] Creating default 'basic' HTTP authenticator for realm 'mesos-agent-readonly'
I0822 22:00:12.984411  3965 http.cpp:1026] Creating default 'basic' HTTP authenticator for realm 'mesos-agent-readwrite'
I0822 22:00:12.985687  3965 slave.cpp:581] Agent resources: [{"name":"cpus","scalar":{"value":2.0},"type":"SCALAR"},{"name":"mem","scalar":{"value":1024.0},"type":"SCALAR"},{"name":"disk","scalar":{"value":1024.0},"type":"SCALAR"},{"name":"ports","ranges":{"range":[{"begin":31000,"end":32000}]},"type":"RANGES"}]
I0822 22:00:12.985895  3965 slave.cpp:589] Agent attributes: [  ]
I0822 22:00:12.985916  3965 slave.cpp:598] Agent hostname: 0af2dee3e7b2
I0822 22:00:12.986057  3964 status_update_manager.cpp:177] Pausing sending status updates
I0822 22:00:12.987423  3967 state.cpp:64] Recovering state from '/tmp/Endpoint_SlaveEndpointTest_UnauthorizedRequest_1_X9aiHb/meta'
I0822 22:00:12.987702  3949 status_update_manager.cpp:203] Recovering status update manager
I0822 22:00:12.987874  3968 containerizer.cpp:643] Recovering containerizer
I0822 22:00:12.989042  3961 provisioner.cpp:416] Provisioner recovery complete
I0822 22:00:12.989313  3959 slave.cpp:6226] Finished recovery
I0822 22:00:12.989764  3959 slave.cpp:6408] Querying resource estimator for oversubscribable resources
I0822 22:00:12.989974  3962 slave.cpp:6422] Received oversubscribable resources {} from the resource estimator
I0822 22:00:12.992926  3954 process.cpp:3933] Handling HTTP event for process 'slave(803)' with path: '/slave(803)/monitor/statistics.json'
I0822 22:00:12.994015  3946 http.cpp:1166] HTTP GET for /slave(803)/monitor/statistics.json from 172.17.0.3:35892
I0822 22:00:12.994087  3946 http.cpp:957] Authorizing principal 'test-principal' to GET the '/monitor/statistics.json' endpoint
I0822 22:00:12.996012  3927 slave.cpp:859] Agent terminating
[       OK ] Endpoint/SlaveEndpointTest.UnauthorizedRequest/1 (28 ms)
[ RUN      ] Endpoint/SlaveEndpointTest.UnauthorizedRequest/2
I0822 22:00:13.006496  3927 containerizer.cpp:288] Using isolation { environment_secret, posix/cpu, posix/mem, filesystem/posix, network/cni }
W0822 22:00:13.007012  3927 backend.cpp:76] Failed to create 'aufs' backend: AufsBackend requires root privileges
W0822 22:00:13.007125  3927 backend.cpp:76] Failed to create 'bind' backend: BindBackend requires root privileges
I0822 22:00:13.007167  3927 provisioner.cpp:255] Using default backend 'copy'
I0822 22:00:13.010232  3958 slave.cpp:252] Mesos agent started on (804)@172.17.0.3:41431
I0822 22:00:13.010262  3958 slave.cpp:253] Flags at startup: --acls="" --appc_simple_discovery_uri_prefix="http://" --appc_store_dir="/tmp/Endpoint_SlaveEndpointTest_UnauthorizedRequest_2_wLrIPN/store/appc" --authenticate_http_readonly="true" --authenticate_http_readwrite="true" --authenticatee="crammd5" --authentication_backoff_factor="1secs" --authorizer="local" --cgroups_cpu_enable_pids_and_tids_count="false" --cgroups_enable_cfs="false" --cgroups_hierarchy="/sys/fs/cgroup" --cgroups_limit_swap="false" --cgroups_root="mesos" --container_disk_watch_interval="15secs" --containerizers="mesos" --credential="/tmp/Endpoint_SlaveEndpointTest_UnauthorizedRequest_2_wLrIPN/credential" --default_role="*" --disallow_sharing_agent_pid_namespace="false" --disk_watch_interval="1mins" --docker="docker" --docker_kill_orphans="true" --docker_registry="https://registry-1.docker.io" --docker_remove_delay="6hrs" --docker_socket="/var/run/docker.sock" --docker_stop_timeout="0ns" --docker_store_dir="/tmp/Endpoint_SlaveEndpointTest_UnauthorizedRequest_2_wLrIPN/store/docker" --docker_volume_checkpoint_dir="/var/run/mesos/isolators/docker/volume" --enforce_container_disk_quota="false" --executor_registration_timeout="1mins" --executor_reregistration_timeout="2secs" --executor_shutdown_grace_period="5secs" --fetcher_cache_dir="/tmp/Endpoint_SlaveEndpointTest_UnauthorizedRequest_2_wLrIPN/fetch" --fetcher_cache_size="2GB" --frameworks_home="" --gc_delay="1weeks" --gc_disk_headroom="0.1" --hadoop_home="" --help="false" --hostname_lookup="true" --http_command_executor="false" --http_credentials="/tmp/Endpoint_SlaveEndpointTest_UnauthorizedRequest_2_wLrIPN/http_credentials" --http_heartbeat_interval="30secs" --initialize_driver_logging="true" --isolation="posix/cpu,posix/mem" --launcher="posix" --launcher_dir="/mesos/mesos-1.5.0/_build/src" --logbufsecs="0" --logging_level="INFO" --max_completed_executors_per_framework="150" --oversubscribed_resources_interval="15secs" --perf_duration="10secs" --perf_interval="1mins" --port="5051" --qos_correction_interval_min="0ns" --quiet="false" --recover="reconnect" --recovery_timeout="15mins" --registration_backoff_factor="10ms" --resources="cpus:2;gpus:0;mem:1024;disk:1024;ports:[31000-32000]" --revocable_cpu_low_priority="true" --runtime_dir="/tmp/Endpoint_SlaveEndpointTest_UnauthorizedRequest_2_wLrIPN" --sandbox_directory="/mnt/mesos/sandbox" --strict="true" --switch_user="true" --systemd_enable_support="true" --systemd_runtime_directory="/run/systemd/system" --version="false" --work_dir="/tmp/Endpoint_SlaveEndpointTest_UnauthorizedRequest_2_Ti7iAS"
I0822 22:00:13.010568  3958 credentials.hpp:86] Loading credential for authentication from '/tmp/Endpoint_SlaveEndpointTest_UnauthorizedRequest_2_wLrIPN/credential'
I0822 22:00:13.010713  3958 slave.cpp:285] Agent using credential for: test-principal
I0822 22:00:13.010735  3958 credentials.hpp:37] Loading credentials for authentication from '/tmp/Endpoint_SlaveEndpointTest_UnauthorizedRequest_2_wLrIPN/http_credentials'
I0822 22:00:13.010941  3958 http.cpp:1026] Creating default 'basic' HTTP authenticator for realm 'mesos-agent-readonly'
I0822 22:00:13.011082  3958 http.cpp:1026] Creating default 'basic' HTTP authenticator for realm 'mesos-agent-readwrite'
I0822 22:00:13.012272  3958 slave.cpp:581] Agent resources: [{"name":"cpus","scalar":{"value":2.0},"type":"SCALAR"},{"name":"mem","scalar":{"value":1024.0},"type":"SCALAR"},{"name":"disk","scalar":{"value":1024.0},"type":"SCALAR"},{"name":"ports","ranges":{"range":[{"begin":31000,"end":32000}]},"type":"RANGES"}]
I0822 22:00:13.012470  3958 slave.cpp:589] Agent attributes: [  ]
I0822 22:00:13.012485  3958 slave.cpp:598] Agent hostname: 0af2dee3e7b2
I0822 22:00:13.012612  3948 status_update_manager.cpp:177] Pausing sending status updates
I0822 22:00:13.013871  3951 state.cpp:64] Recovering state from '/tmp/Endpoint_SlaveEndpointTest_UnauthorizedRequest_2_Ti7iAS/meta'
I0822 22:00:13.014145  3966 status_update_manager.cpp:203] Recovering status update manager
I0822 22:00:13.014307  3964 containerizer.cpp:643] Recovering containerizer
I0822 22:00:13.015370  3962 provisioner.cpp:416] Provisioner recovery complete
I0822 22:00:13.015640  3949 slave.cpp:6226] Finished recovery
I0822 22:00:13.015998  3949 slave.cpp:6408] Querying resource estimator for oversubscribable resources
I0822 22:00:13.016185  3954 slave.cpp:6422] Received oversubscribable resources {} from the resource estimator
I0822 22:00:13.018532  3956 process.cpp:3933] Handling HTTP event for process 'slave(804)' with path: '/slave(804)/containers'
I0822 22:00:13.019523  3945 http.cpp:1166] HTTP GET for /slave(804)/containers from 172.17.0.3:35894
I0822 22:00:13.019587  3945 http.cpp:957] Authorizing principal 'test-principal' to GET the '/containers' endpoint
I0822 22:00:13.021100  3958 slave.cpp:859] Agent terminating
[       OK ] Endpoint/SlaveEndpointTest.UnauthorizedRequest/2 (23 ms)
[ RUN      ] Endpoint/SlaveEndpointTest.NoAuthorizer/0
I0822 22:00:13.045004  3927 containerizer.cpp:288] Using isolation { environment_secret, posix/cpu, posix/mem, filesystem/posix, network/cni }
W0822 22:00:13.045459  3927 backend.cpp:76] Failed to create 'aufs' backend: AufsBackend requires root privileges
W0822 22:00:13.045598  3927 backend.cpp:76] Failed to create 'bind' backend: BindBackend requires root privileges
I0822 22:00:13.045639  3927 provisioner.cpp:255] Using default backend 'copy'
I0822 22:00:13.047224  3927 cluster.cpp:448] Creating default 'local' authorizer
I0822 22:00:13.048923  3946 slave.cpp:252] Mesos agent started on (805)@172.17.0.3:41431
I0822 22:00:13.048954  3946 slave.cpp:253] Flags at startup: --acls="" --appc_simple_discovery_uri_prefix="http://" --appc_store_dir="/tmp/Endpoint_SlaveEndpointTest_NoAuthorizer_0_WviN7u/store/appc" --authenticate_http_readonly="true" --authenticate_http_readwrite="true" --authenticatee="crammd5" --authentication_backoff_factor="1secs" --authorizer="local" --cgroups_cpu_enable_pids_and_tids_count="false" --cgroups_enable_cfs="false" --cgroups_hierarchy="/sys/fs/cgroup" --cgroups_limit_swap="false" --cgroups_root="mesos" --container_disk_watch_interval="15secs" --containerizers="mesos" --credential="/tmp/Endpoint_SlaveEndpointTest_NoAuthorizer_0_WviN7u/credential" --default_role="*" --disallow_sharing_agent_pid_namespace="false" --disk_watch_interval="1mins" --docker="docker" --docker_kill_orphans="true" --docker_registry="https://registry-1.docker.io" --docker_remove_delay="6hrs" --docker_socket="/var/run/docker.sock" --docker_stop_timeout="0ns" --docker_store_dir="/tmp/Endpoint_SlaveEndpointTest_NoAuthorizer_0_WviN7u/store/docker" --docker_volume_checkpoint_dir="/var/run/mesos/isolators/docker/volume" --enforce_container_disk_quota="false" --executor_registration_timeout="1mins" --executor_reregistration_timeout="2secs" --executor_shutdown_grace_period="5secs" --fetcher_cache_dir="/tmp/Endpoint_SlaveEndpointTest_NoAuthorizer_0_WviN7u/fetch" --fetcher_cache_size="2GB" --frameworks_home="" --gc_delay="1weeks" --gc_disk_headroom="0.1" --hadoop_home="" --help="false" --hostname_lookup="true" --http_command_executor="false" --http_credentials="/tmp/Endpoint_SlaveEndpointTest_NoAuthorizer_0_WviN7u/http_credentials" --http_heartbeat_interval="30secs" --initialize_driver_logging="true" --isolation="posix/cpu,posix/mem" --launcher="posix" --launcher_dir="/mesos/mesos-1.5.0/_build/src" --logbufsecs="0" --logging_level="INFO" --max_completed_executors_per_framework="150" --oversubscribed_resources_interval="15secs" --perf_duration="10secs" --perf_interval="1mins" --port="5051" --qos_correction_interval_min="0ns" --quiet="false" --recover="reconnect" --recovery_timeout="15mins" --registration_backoff_factor="10ms" --resources="cpus:2;gpus:0;mem:1024;disk:1024;ports:[31000-32000]" --revocable_cpu_low_priority="true" --runtime_dir="/tmp/Endpoint_SlaveEndpointTest_NoAuthorizer_0_WviN7u" --sandbox_directory="/mnt/mesos/sandbox" --strict="true" --switch_user="true" --systemd_enable_support="true" --systemd_runtime_directory="/run/systemd/system" --version="false" --work_dir="/tmp/Endpoint_SlaveEndpointTest_NoAuthorizer_0_oT1HMz"
I0822 22:00:13.049273  3946 credentials.hpp:86] Loading credential for authentication from '/tmp/Endpoint_SlaveEndpointTest_NoAuthorizer_0_WviN7u/credential'
I0822 22:00:13.049446  3946 slave.cpp:285] Agent using credential for: test-principal
I0822 22:00:13.049468  3946 credentials.hpp:37] Loading credentials for authentication from '/tmp/Endpoint_SlaveEndpointTest_NoAuthorizer_0_WviN7u/http_credentials'
I0822 22:00:13.049701  3946 http.cpp:1026] Creating default 'basic' HTTP authenticator for realm 'mesos-agent-readonly'
I0822 22:00:13.049882  3946 http.cpp:1026] Creating default 'basic' HTTP authenticator for realm 'mesos-agent-readwrite'
I0822 22:00:13.051183  3946 slave.cpp:581] Agent resources: [{"name":"cpus","scalar":{"value":2.0},"type":"SCALAR"},{"name":"mem","scalar":{"value":1024.0},"type":"SCALAR"},{"name":"disk","scalar":{"value":1024.0},"type":"SCALAR"},{"name":"ports","ranges":{"range":[{"begin":31000,"end":32000}]},"type":"RANGES"}]
I0822 22:00:13.051384  3946 slave.cpp:589] Agent attributes: [  ]
I0822 22:00:13.051399  3946 slave.cpp:598] Agent hostname: 0af2dee3e7b2
I0822 22:00:13.051540  3962 status_update_manager.cpp:177] Pausing sending status updates
I0822 22:00:13.052919  3949 state.cpp:64] Recovering state from '/tmp/Endpoint_SlaveEndpointTest_NoAuthorizer_0_oT1HMz/meta'
I0822 22:00:13.053295  3967 status_update_manager.cpp:203] Recovering status update manager
I0822 22:00:13.053483  3965 containerizer.cpp:643] Recovering containerizer
I0822 22:00:13.054641  3955 provisioner.cpp:416] Provisioner recovery complete
I0822 22:00:13.054982  3946 slave.cpp:6226] Finished recovery
I0822 22:00:13.055387  3946 slave.cpp:6408] Querying resource estimator for oversubscribable resources
I0822 22:00:13.055579  3945 slave.cpp:6422] Received oversubscribable resources {} from the resource estimator
I0822 22:00:13.057806  3952 process.cpp:3933] Handling HTTP event for process 'slave(805)' with path: '/slave(805)/monitor/statistics'
I0822 22:00:13.059059  3968 http.cpp:1166] HTTP GET for /slave(805)/monitor/statistics from 172.17.0.3:35900
I0822 22:00:13.059151  3968 http.cpp:957] Authorizing principal 'test-principal' to GET the '/monitor/statistics' endpoint
I0822 22:00:13.061820  3950 slave.cpp:859] Agent terminating
[       OK ] Endpoint/SlaveEndpointTest.NoAuthorizer/0 (51 ms)
[ RUN      ] Endpoint/SlaveEndpointTest.NoAuthorizer/1
I0822 22:00:13.100313  3927 containerizer.cpp:288] Using isolation { environment_secret, posix/cpu, posix/mem, filesystem/posix, network/cni }
W0822 22:00:13.101033  3927 backend.cpp:76] Failed to create 'aufs' backend: AufsBackend requires root privileges
W0822 22:00:13.101219  3927 backend.cpp:76] Failed to create 'bind' backend: BindBackend requires root privileges
I0822 22:00:13.101258  3927 provisioner.cpp:255] Using default backend 'copy'
I0822 22:00:13.103996  3927 cluster.cpp:448] Creating default 'local' authorizer
I0822 22:00:13.106362  3955 slave.cpp:252] Mesos agent started on (806)@172.17.0.3:41431
I0822 22:00:13.106405  3955 slave.cpp:253] Flags at startup: --acls="" --appc_simple_discovery_uri_prefix="http://" --appc_store_dir="/tmp/Endpoint_SlaveEndpointTest_NoAuthorizer_1_7BTcTc/store/appc" --authenticate_http_readonly="true" --authenticate_http_readwrite="true" --authenticatee="crammd5" --authentication_backoff_factor="1secs" --authorizer="local" --cgroups_cpu_enable_pids_and_tids_count="false" --cgroups_enable_cfs="false" --cgroups_hierarchy="/sys/fs/cgroup" --cgroups_limit_swap="false" --cgroups_root="mesos" --container_disk_watch_interval="15secs" --containerizers="mesos" --credential="/tmp/Endpoint_SlaveEndpointTest_NoAuthorizer_1_7BTcTc/credential" --default_role="*" --disallow_sharing_agent_pid_namespace="false" --disk_watch_interval="1mins" --docker="docker" --docker_kill_orphans="true" --docker_registry="https://registry-1.docker.io" --docker_remove_delay="6hrs" --docker_socket="/var/run/docker.sock" --docker_stop_timeout="0ns" --docker_store_dir="/tmp/Endpoint_SlaveEndpointTest_NoAuthorizer_1_7BTcTc/store/docker" --docker_volume_checkpoint_dir="/var/run/mesos/isolators/docker/volume" --enforce_container_disk_quota="false" --executor_registration_timeout="1mins" --executor_reregistration_timeout="2secs" --executor_shutdown_grace_period="5secs" --fetcher_cache_dir="/tmp/Endpoint_SlaveEndpointTest_NoAuthorizer_1_7BTcTc/fetch" --fetcher_cache_size="2GB" --frameworks_home="" --gc_delay="1weeks" --gc_disk_headroom="0.1" --hadoop_home="" --help="false" --hostname_lookup="true" --http_command_executor="false" --http_credentials="/tmp/Endpoint_SlaveEndpointTest_NoAuthorizer_1_7BTcTc/http_credentials" --http_heartbeat_interval="30secs" --initialize_driver_logging="true" --isolation="posix/cpu,posix/mem" --launcher="posix" --launcher_dir="/mesos/mesos-1.5.0/_build/src" --logbufsecs="0" --logging_level="INFO" --max_completed_executors_per_framework="150" --oversubscribed_resources_interval="15secs" --perf_duration="10secs" --perf_interval="1mins" --port="5051" --qos_correction_interval_min="0ns" --quiet="false" --recover="reconnect" --recovery_timeout="15mins" --registration_backoff_factor="10ms" --resources="cpus:2;gpus:0;mem:1024;disk:1024;ports:[31000-32000]" --revocable_cpu_low_priority="true" --runtime_dir="/tmp/Endpoint_SlaveEndpointTest_NoAuthorizer_1_7BTcTc" --sandbox_directory="/mnt/mesos/sandbox" --strict="true" --switch_user="true" --systemd_enable_support="true" --systemd_runtime_directory="/run/systemd/system" --version="false" --work_dir="/tmp/Endpoint_SlaveEndpointTest_NoAuthorizer_1_LLfeqh"
I0822 22:00:13.106802  3955 credentials.hpp:86] Loading credential for authentication from '/tmp/Endpoint_SlaveEndpointTest_NoAuthorizer_1_7BTcTc/credential'
I0822 22:00:13.106979  3955 slave.cpp:285] Agent using credential for: test-principal
I0822 22:00:13.106999  3955 credentials.hpp:37] Loading credentials for authentication from '/tmp/Endpoint_SlaveEndpointTest_NoAuthorizer_1_7BTcTc/http_credentials'
I0822 22:00:13.107213  3955 http.cpp:1026] Creating default 'basic' HTTP authenticator for realm 'mesos-agent-readonly'
I0822 22:00:13.107378  3955 http.cpp:1026] Creating default 'basic' HTTP authenticator for realm 'mesos-agent-readwrite'
I0822 22:00:13.109026  3955 slave.cpp:581] Agent resources: [{"name":"cpus","scalar":{"value":2.0},"type":"SCALAR"},{"name":"mem","scalar":{"value":1024.0},"type":"SCALAR"},{"name":"disk","scalar":{"value":1024.0},"type":"SCALAR"},{"name":"ports","ranges":{"range":[{"begin":31000,"end":32000}]},"type":"RANGES"}]
I0822 22:00:13.109241  3955 slave.cpp:589] Agent attributes: [  ]
I0822 22:00:13.109256  3955 slave.cpp:598] Agent hostname: 0af2dee3e7b2
I0822 22:00:13.109419  3967 status_update_manager.cpp:177] Pausing sending status updates
I0822 22:00:13.110847  3959 state.cpp:64] Recovering state from '/tmp/Endpoint_SlaveEndpointTest_NoAuthorizer_1_LLfeqh/meta'
I0822 22:00:13.111168  3948 status_update_manager.cpp:203] Recovering status update manager
I0822 22:00:13.111387  3954 containerizer.cpp:643] Recovering containerizer
I0822 22:00:13.112845  3945 provisioner.cpp:416] Provisioner recovery complete
I0822 22:00:13.113325  3953 slave.cpp:6226] Finished recovery
I0822 22:00:13.113837  3953 slave.cpp:6408] Querying resource estimator for oversubscribable resources
I0822 22:00:13.114048  3965 slave.cpp:6422] Received oversubscribable resources {} from the resource estimator
I0822 22:00:13.117023  3956 process.cpp:3933] Handling HTTP event for process 'slave(806)' with path: '/slave(806)/monitor/statistics.json'
I0822 22:00:13.118232  3959 http.cpp:1166] HTTP GET for /slave(806)/monitor/statistics.json from 172.17.0.3:35902
I0822 22:00:13.118307  3959 http.cpp:957] Authorizing principal 'test-principal' to GET the '/monitor/statistics.json' endpoint
I0822 22:00:13.126024  3947 slave.cpp:859] Agent terminating
[       OK ] Endpoint/SlaveEndpointTest.NoAuthorizer/1 (40 ms)
[ RUN      ] Endpoint/SlaveEndpointTest.NoAuthorizer/2
I0822 22:00:13.144152  3927 containerizer.cpp:288] Using isolation { environment_secret, posix/cpu, posix/mem, filesystem/posix, network/cni }
W0822 22:00:13.144598  3927 backend.cpp:76] Failed to create 'aufs' backend: AufsBackend requires root privileges
W0822 22:00:13.144708  3927 backend.cpp:76] Failed to create 'bind' backend: BindBackend requires root privileges
I0822 22:00:13.144747  3927 provisioner.cpp:255] Using default backend 'copy'
I0822 22:00:13.146217  3927 cluster.cpp:448] Creating default 'local' authorizer
I0822 22:00:13.147796  3959 slave.cpp:252] Mesos agent started on (807)@172.17.0.3:41431
I0822 22:00:13.147835  3959 slave.cpp:253] Flags at startup: --acls="" --appc_simple_discovery_uri_prefix="http://" --appc_store_dir="/tmp/Endpoint_SlaveEndpointTest_NoAuthorizer_2_frJd8U/store/appc" --authenticate_http_readonly="true" --authenticate_http_readwrite="true" --authenticatee="crammd5" --authentication_backoff_factor="1secs" --authorizer="local" --cgroups_cpu_enable_pids_and_tids_count="false" --cgroups_enable_cfs="false" --cgroups_hierarchy="/sys/fs/cgroup" --cgroups_limit_swap="false" --cgroups_root="mesos" --container_disk_watch_interval="15secs" --containerizers="mesos" --credential="/tmp/Endpoint_SlaveEndpointTest_NoAuthorizer_2_frJd8U/credential" --default_role="*" --disallow_sharing_agent_pid_namespace="false" --disk_watch_interval="1mins" --docker="docker" --docker_kill_orphans="true" --docker_registry="https://registry-1.docker.io" --docker_remove_delay="6hrs" --docker_socket="/var/run/docker.sock" --docker_stop_timeout="0ns" --docker_store_dir="/tmp/Endpoint_SlaveEndpointTest_NoAuthorizer_2_frJd8U/store/docker" --docker_volume_checkpoint_dir="/var/run/mesos/isolators/docker/volume" --enforce_container_disk_quota="false" --executor_registration_timeout="1mins" --executor_reregistration_timeout="2secs" --executor_shutdown_grace_period="5secs" --fetcher_cache_dir="/tmp/Endpoint_SlaveEndpointTest_NoAuthorizer_2_frJd8U/fetch" --fetcher_cache_size="2GB" --frameworks_home="" --gc_delay="1weeks" --gc_disk_headroom="0.1" --hadoop_home="" --help="false" --hostname_lookup="true" --http_command_executor="false" --http_credentials="/tmp/Endpoint_SlaveEndpointTest_NoAuthorizer_2_frJd8U/http_credentials" --http_heartbeat_interval="30secs" --initialize_driver_logging="true" --isolation="posix/cpu,posix/mem" --launcher="posix" --launcher_dir="/mesos/mesos-1.5.0/_build/src" --logbufsecs="0" --logging_level="INFO" --max_completed_executors_per_framework="150" --oversubscribed_resources_interval="15secs" --perf_duration="10secs" --perf_interval="1mins" --port="5051" --qos_correction_interval_min="0ns" --quiet="false" --recover="reconnect" --recovery_timeout="15mins" --registration_backoff_factor="10ms" --resources="cpus:2;gpus:0;mem:1024;disk:1024;ports:[31000-32000]" --revocable_cpu_low_priority="true" --runtime_dir="/tmp/Endpoint_SlaveEndpointTest_NoAuthorizer_2_frJd8U" --sandbox_directory="/mnt/mesos/sandbox" --strict="true" --switch_user="true" --systemd_enable_support="true" --systemd_runtime_directory="/run/systemd/system" --version="false" --work_dir="/tmp/Endpoint_SlaveEndpointTest_NoAuthorizer_2_lN5lyZ"
I0822 22:00:13.148181  3959 credentials.hpp:86] Loading credential for authentication from '/tmp/Endpoint_SlaveEndpointTest_NoAuthorizer_2_frJd8U/credential'
I0822 22:00:13.148362  3959 slave.cpp:285] Agent using credential for: test-principal
I0822 22:00:13.148399  3959 credentials.hpp:37] Loading credentials for authentication from '/tmp/Endpoint_SlaveEndpointTest_NoAuthorizer_2_frJd8U/http_credentials'
I0822 22:00:13.148696  3959 http.cpp:1026] Creating default 'basic' HTTP authenticator for realm 'mesos-agent-readonly'
I0822 22:00:13.148890  3959 http.cpp:1026] Creating default 'basic' HTTP authenticator for realm 'mesos-agent-readwrite'
I0822 22:00:13.150929  3959 slave.cpp:581] Agent resources: [{"name":"cpus","scalar":{"value":2.0},"type":"SCALAR"},{"name":"mem","scalar":{"value":1024.0},"type":"SCALAR"},{"name":"disk","scalar":{"value":1024.0},"type":"SCALAR"},{"name":"ports","ranges":{"range":[{"begin":31000,"end":32000}]},"type":"RANGES"}]
I0822 22:00:13.151324  3959 slave.cpp:589] Agent attributes: [  ]
I0822 22:00:13.151350  3959 slave.cpp:598] Agent hostname: 0af2dee3e7b2
I0822 22:00:13.151542  3949 status_update_manager.cpp:177] Pausing sending status updates
I0822 22:00:13.153317  3961 state.cpp:64] Recovering state from '/tmp/Endpoint_SlaveEndpointTest_NoAuthorizer_2_lN5lyZ/meta'
I0822 22:00:13.153627  3954 status_update_manager.cpp:203] Recovering status update manager
I0822 22:00:13.153797  3958 containerizer.cpp:643] Recovering containerizer
I0822 22:00:13.154976  3967 provisioner.cpp:416] Provisioner recovery complete
I0822 22:00:13.155364  3957 slave.cpp:6226] Finished recovery
I0822 22:00:13.155926  3957 slave.cpp:6408] Querying resource estimator for oversubscribable resources
I0822 22:00:13.156160  3951 slave.cpp:6422] Received oversubscribable resources {} from the resource estimator
I0822 22:00:13.158608  3965 process.cpp:3933] Handling HTTP event for process 'slave(807)' with path: '/slave(807)/containers'
I0822 22:00:13.159728  3950 http.cpp:1166] HTTP GET for /slave(807)/containers from 172.17.0.3:35904
I0822 22:00:13.159821  3950 http.cpp:957] Authorizing principal 'test-principal' to GET the '/containers' endpoint
I0822 22:00:13.163316  3958 slave.cpp:859] Agent terminating
[       OK ] Endpoint/SlaveEndpointTest.NoAuthorizer/2 (29 ms)
[----------] 9 tests from Endpoint/SlaveEndpointTest (336 ms total)

[----------] 2 tests from ContainerizerType/DefaultContainerDNSFlagTest
[ RUN      ] ContainerizerType/DefaultContainerDNSFlagTest.ValidateFlag/0
[       OK ] ContainerizerType/DefaultContainerDNSFlagTest.ValidateFlag/0 (10 ms)
[ RUN      ] ContainerizerType/DefaultContainerDNSFlagTest.ValidateFlag/1
[       OK ] ContainerizerType/DefaultContainerDNSFlagTest.ValidateFlag/1 (8 ms)
[----------] 2 tests from ContainerizerType/DefaultContainerDNSFlagTest (18 ms total)

[----------] Global test environment tear-down
[==========] 1659 tests from 182 test cases ran. (614839 ms total)
[  PASSED  ] 1658 tests.
[  FAILED  ] 1 test, listed below:
[  FAILED  ] ExamplesTest.DynamicReservationFramework

 1 FAILED TEST
  YOU HAVE 20 DISABLED TESTS

I0822 22:00:13.250727  3969 process.cpp:1072] Failed to accept socket: future discarded
make[4]: *** [check-local] Error 1
make[4]: Leaving directory `/mesos/mesos-1.5.0/_build/src'
make[3]: *** [check-am] Error 2
make[3]: Leaving directory `/mesos/mesos-1.5.0/_build/src'
make[2]: *** [check] Error 2
make[2]: Leaving directory `/mesos/mesos-1.5.0/_build/src'
make[1]: *** [check-recursive] Error 1
make[1]: Leaving directory `/mesos/mesos-1.5.0/_build'
make: *** [distcheck] Error 1
+ docker rmi mesos-1503435565-2765
Untagged: mesos-1503435565-2765:latest
Deleted: sha256:0cda58a3cdb0305afcaa2af6328665ec84b3bcad5c361813ee62388e0a0f8ca6
Deleted: sha256:3d1f930c8090c6da4aa09d16783552c6dd1c0861da453b0677762e5670cb143c
Deleted: sha256:988c6d9c0fbf7b7ef5bdf2ddc436e0a9e7fe7db9264d7275dce1f8a6aeb347ff
Deleted: sha256:0de2e46e96165ad14e65fddbc99c1e2222d1b202bb1bbedbc6254f29ab3d94c4
Deleted: sha256:aa628b79b90927fe18844a1afeaaa43d1879c14642b1e56ecea0a12a2d435c1c
Deleted: sha256:9dbd4b9fd89f1c83c512bbdd51cca986e5bbbe3f73de718ff81c1c636f82a22a
Deleted: sha256:364a4576c746038e8f1f956447020599db633aae73be3cab96f4803aaf2c1994
Deleted: sha256:31d575af9c6e8f6ae58376aef281feda22ba2a3ea46466bc34f29956bb5e887e
Deleted: sha256:fc978d5aff413182f1007764ac53c7d6eb6efc77df1f4e97612abe77740a9da2
Deleted: sha256:c74fe3e9ca1c57ebf900e1aea859dcb6db5b03263005b83705e4452855929ed3
Deleted: sha256:0482ca0116f723ab2bb373ce06db0bf26d93891d4b3a2709359a930305bb67b5
Deleted: sha256:35f3661ade7cab1e92b0870d9b22872ddea4f98d9c7ec73d1cd9f6019155ffca
Deleted: sha256:4b6b53fb60e189693af09f15131805ed35b74055e6c9d82627e6b4456f02cb0d
Deleted: sha256:58af0c9a629de359f97152afba7b852333b22f46638014211055dfc05d41582e
Deleted: sha256:e3fe6813094d5843b8c9432da9f65591248d93c71c96060c0ab824e7e9c767dc
Deleted: sha256:44ed9234542b02473a5fb63580dc6bf836a770a64c88153b93af3899c728befb
Deleted: sha256:80d688a8b984a6fb11706ad6e31d7bff77916be923b6662d891962d1b947b9ea
Deleted: sha256:5a33f04a3734ec1b427d7218fc2842135fd0994bbf88fb3b91183b30606032fb
Deleted: sha256:b622f64c29009b62c9c5d8f40536c64fe235ce1a3c7ad9061a6cccb210685dca
Deleted: sha256:9c188e2a411c202ab3710cf80a28baed6b3aa94bab8705886e884bedfa8e7b48
Deleted: sha256:5c7c6b79c2712a78436aa76ee3fc0372436264ab7cc8d0c7257e25dd283b06c2
Deleted: sha256:7b0a862927e0ea481625b7657456ba25bd27cd570cfa28c56c479607c8c07df8
Deleted: sha256:ca8b0f501e36f60d44436c47ba0990a20af5db9b43500872ec11153aad148582
Deleted: sha256:afb1f66d85b899daf56fbe3060ef15f267cb63c9df4c7573e3cd757e98f8ad63
Build step 'Execute shell' marked build as failure
Not sending mail to unregistered user yujie.jay@gmail.com

Jenkins build is back to normal : Mesos-Buildbot » autotools,clang,--verbose,GLOG_v=1 MESOS_VERBOSE=1,ubuntu:14.04,(ubuntu)&&(!ubuntu-us1)&&(!ubuntu-eu2) #4141

Posted by Apache Jenkins Server <je...@builds.apache.org>.
See <https://builds.apache.org/job/Mesos-Buildbot/BUILDTOOL=autotools,COMPILER=clang,CONFIGURATION=--verbose,ENVIRONMENT=GLOG_v=1%20MESOS_VERBOSE=1,OS=ubuntu%3A14.04,label_exp=(ubuntu)&&(!ubuntu-us1)&&(!ubuntu-eu2)/4141/display/redirect?page=changes>