You are viewing a plain text version of this content. The canonical link for it is here.
Posted to commits@olingo.apache.org by Apache Jenkins Server <je...@builds.apache.org> on 2014/02/15 00:21:42 UTC

Build failed in Jenkins: olingo-odata4 #115

See <https://builds.apache.org/job/olingo-odata4/115/>

------------------------------------------
Started by an SCM change
Building remotely on ubuntu2 in workspace <https://builds.apache.org/job/olingo-odata4/ws/>
Fetching changes from the remote Git repository
Fetching upstream changes from https://git-wip-us.apache.org/repos/asf/incubator-olingo-odata4.git
Checking out Revision 7baecb90209417e9deaad0ba1452d6a11bdd4976 (origin/master)
[olingo-odata4] $ /home/hudson/tools/maven/apache-maven-3.0.4/bin/mvn clean deploy
[INFO] Scanning for projects...
[INFO] ------------------------------------------------------------------------
[INFO] Reactor Build Order:
[INFO] 
[INFO] olingo-odata4-parent-incubating
[INFO] olingo-odata4-lib-incubating
[INFO] olingo-odata4-commons-api-incubating
[INFO] olingo-odata4-producer-api-incubating
[INFO] olingo-odata4-commons-core-incubating
[INFO] olingo-odata4-producer-core-incubating
[INFO] olingo-odata4-consumer-api-incubating
[INFO] olingo-odata4-consumer-core-incubating
[INFO] olingo-odata4-fit-incubating
[INFO] olingo-odata4-ref-incubating
[INFO]                                                                         
[INFO] ------------------------------------------------------------------------
[INFO] Building olingo-odata4-parent-incubating 0.1.0-SNAPSHOT
[INFO] ------------------------------------------------------------------------
[INFO] 
[INFO] --- maven-clean-plugin:2.5:clean (default-clean) @ olingo-odata4-parent-incubating ---
[INFO] Deleting /home/hudson/jenkins-slave/workspace/olingo-odata4/target
[INFO] 
[INFO] --- maven-remote-resources-plugin:1.4:process (default) @ olingo-odata4-parent-incubating ---
[INFO] 
[INFO] --- apache-rat-plugin:0.9:check (rat-check) @ olingo-odata4-parent-incubating ---
[INFO] 52 implicit excludes (use -debug for more details).
[INFO] Exclude: **/MANIFEST.MF
[INFO] Exclude: .gitignore
[INFO] Exclude: .git/**
[INFO] Exclude: bin/**
[INFO] Exclude: **/*.local
[INFO] Exclude: **/*.project
[INFO] Exclude: **/*.classpath
[INFO] Exclude: **/*.json
[INFO] Exclude: **/*.batch
[INFO] Exclude: **/NOTICE
[INFO] Exclude: **/DEPENDENCIES
[INFO] 928 resources included (use -debug for more details)
[INFO] Rat check: Summary of files. Unapproved: 3 unknown: 3 generated: 0 approved: 6 licence.
[INFO] ------------------------------------------------------------------------
[INFO] Reactor Summary:
[INFO] 
[INFO] olingo-odata4-parent-incubating ................... FAILURE [8.051s]
[INFO] olingo-odata4-lib-incubating ...................... SKIPPED
[INFO] olingo-odata4-commons-api-incubating .............. SKIPPED
[INFO] olingo-odata4-producer-api-incubating ............. SKIPPED
[INFO] olingo-odata4-commons-core-incubating ............. SKIPPED
[INFO] olingo-odata4-producer-core-incubating ............ SKIPPED
[INFO] olingo-odata4-consumer-api-incubating ............. SKIPPED
[INFO] olingo-odata4-consumer-core-incubating ............ SKIPPED
[INFO] olingo-odata4-fit-incubating ...................... SKIPPED
[INFO] olingo-odata4-ref-incubating ...................... SKIPPED
[INFO] ------------------------------------------------------------------------
[INFO] BUILD FAILURE
[INFO] ------------------------------------------------------------------------
[INFO] Total time: 8.497s
[INFO] Finished at: Fri Feb 14 23:21:42 UTC 2014
[INFO] Final Memory: 9M/71M
[INFO] ------------------------------------------------------------------------
[ERROR] Failed to execute goal org.apache.rat:apache-rat-plugin:0.9:check (rat-check) on project olingo-odata4-parent-incubating: Too many files with unapproved license: 3 See RAT report in: /home/hudson/jenkins-slave/workspace/olingo-odata4/target/rat.txt -> [Help 1]
[ERROR] 
[ERROR] To see the full stack trace of the errors, re-run Maven with the -e switch.
[ERROR] Re-run Maven using the -X switch to enable full debug logging.
[ERROR] 
[ERROR] For more information about the errors and possible solutions, please read the following articles:
[ERROR] [Help 1] http://cwiki.apache.org/confluence/display/MAVEN/MojoFailureException
Build step 'Invoke top-level Maven targets' marked build as failure

Jenkins build is back to normal : olingo-odata4 #118

Posted by Apache Jenkins Server <je...@builds.apache.org>.
See <https://builds.apache.org/job/olingo-odata4/118/changes>


Build failed in Jenkins: olingo-odata4 #117

Posted by Apache Jenkins Server <je...@builds.apache.org>.
See <https://builds.apache.org/job/olingo-odata4/117/>

------------------------------------------
Started by timer
Building remotely on ubuntu3 in workspace <https://builds.apache.org/job/olingo-odata4/ws/>
Fetching changes from the remote Git repository
Fetching upstream changes from https://git-wip-us.apache.org/repos/asf/incubator-olingo-odata4.git
Checking out Revision 7baecb90209417e9deaad0ba1452d6a11bdd4976 (origin/master)
[olingo-odata4] $ /home/hudson/tools/maven/apache-maven-3.0.4/bin/mvn clean deploy
[INFO] Scanning for projects...
[INFO] ------------------------------------------------------------------------
[INFO] Reactor Build Order:
[INFO] 
[INFO] olingo-odata4-parent-incubating
[INFO] olingo-odata4-lib-incubating
[INFO] olingo-odata4-commons-api-incubating
[INFO] olingo-odata4-producer-api-incubating
[INFO] olingo-odata4-commons-core-incubating
[INFO] olingo-odata4-producer-core-incubating
[INFO] olingo-odata4-consumer-api-incubating
[INFO] olingo-odata4-consumer-core-incubating
[INFO] olingo-odata4-fit-incubating
[INFO] olingo-odata4-ref-incubating
[INFO]                                                                         
[INFO] ------------------------------------------------------------------------
[INFO] Building olingo-odata4-parent-incubating 0.1.0-SNAPSHOT
[INFO] ------------------------------------------------------------------------
[INFO] 
[INFO] --- maven-clean-plugin:2.5:clean (default-clean) @ olingo-odata4-parent-incubating ---
[INFO] Deleting /x1/jenkins/jenkins-slave/workspace/olingo-odata4/target
[INFO] 
[INFO] --- maven-remote-resources-plugin:1.4:process (default) @ olingo-odata4-parent-incubating ---
[INFO] 
[INFO] --- apache-rat-plugin:0.9:check (rat-check) @ olingo-odata4-parent-incubating ---
[INFO] 52 implicit excludes (use -debug for more details).
[INFO] Exclude: **/MANIFEST.MF
[INFO] Exclude: .gitignore
[INFO] Exclude: .git/**
[INFO] Exclude: bin/**
[INFO] Exclude: **/*.local
[INFO] Exclude: **/*.project
[INFO] Exclude: **/*.classpath
[INFO] Exclude: **/*.json
[INFO] Exclude: **/*.batch
[INFO] Exclude: **/NOTICE
[INFO] Exclude: **/DEPENDENCIES
[INFO] 928 resources included (use -debug for more details)
[INFO] Rat check: Summary of files. Unapproved: 3 unknown: 3 generated: 0 approved: 6 licence.
[INFO] ------------------------------------------------------------------------
[INFO] Reactor Summary:
[INFO] 
[INFO] olingo-odata4-parent-incubating ................... FAILURE [7.235s]
[INFO] olingo-odata4-lib-incubating ...................... SKIPPED
[INFO] olingo-odata4-commons-api-incubating .............. SKIPPED
[INFO] olingo-odata4-producer-api-incubating ............. SKIPPED
[INFO] olingo-odata4-commons-core-incubating ............. SKIPPED
[INFO] olingo-odata4-producer-core-incubating ............ SKIPPED
[INFO] olingo-odata4-consumer-api-incubating ............. SKIPPED
[INFO] olingo-odata4-consumer-core-incubating ............ SKIPPED
[INFO] olingo-odata4-fit-incubating ...................... SKIPPED
[INFO] olingo-odata4-ref-incubating ...................... SKIPPED
[INFO] ------------------------------------------------------------------------
[INFO] BUILD FAILURE
[INFO] ------------------------------------------------------------------------
[INFO] Total time: 7.546s
[INFO] Finished at: Sun Feb 16 23:13:43 UTC 2014
[INFO] Final Memory: 10M/97M
[INFO] ------------------------------------------------------------------------
[ERROR] Failed to execute goal org.apache.rat:apache-rat-plugin:0.9:check (rat-check) on project olingo-odata4-parent-incubating: Too many files with unapproved license: 3 See RAT report in: /x1/jenkins/jenkins-slave/workspace/olingo-odata4/target/rat.txt -> [Help 1]
[ERROR] 
[ERROR] To see the full stack trace of the errors, re-run Maven with the -e switch.
[ERROR] Re-run Maven using the -X switch to enable full debug logging.
[ERROR] 
[ERROR] For more information about the errors and possible solutions, please read the following articles:
[ERROR] [Help 1] http://cwiki.apache.org/confluence/display/MAVEN/MojoFailureException
Build step 'Invoke top-level Maven targets' marked build as failure

Build failed in Jenkins: olingo-odata4 #116

Posted by Apache Jenkins Server <je...@builds.apache.org>.
See <https://builds.apache.org/job/olingo-odata4/116/>

------------------------------------------
Started by timer
Building remotely on ubuntu3 in workspace <https://builds.apache.org/job/olingo-odata4/ws/>
Fetching changes from the remote Git repository
Fetching upstream changes from https://git-wip-us.apache.org/repos/asf/incubator-olingo-odata4.git
Checking out Revision 7baecb90209417e9deaad0ba1452d6a11bdd4976 (origin/master)
[olingo-odata4] $ /home/hudson/tools/maven/apache-maven-3.0.4/bin/mvn clean deploy
[INFO] Scanning for projects...
[INFO] ------------------------------------------------------------------------
[INFO] Reactor Build Order:
[INFO] 
[INFO] olingo-odata4-parent-incubating
[INFO] olingo-odata4-lib-incubating
[INFO] olingo-odata4-commons-api-incubating
[INFO] olingo-odata4-producer-api-incubating
[INFO] olingo-odata4-commons-core-incubating
[INFO] olingo-odata4-producer-core-incubating
[INFO] olingo-odata4-consumer-api-incubating
[INFO] olingo-odata4-consumer-core-incubating
[INFO] olingo-odata4-fit-incubating
[INFO] olingo-odata4-ref-incubating
[INFO]                                                                         
[INFO] ------------------------------------------------------------------------
[INFO] Building olingo-odata4-parent-incubating 0.1.0-SNAPSHOT
[INFO] ------------------------------------------------------------------------
[INFO] 
[INFO] --- maven-clean-plugin:2.5:clean (default-clean) @ olingo-odata4-parent-incubating ---
[INFO] Deleting /x1/jenkins/jenkins-slave/workspace/olingo-odata4/target
[INFO] 
[INFO] --- maven-remote-resources-plugin:1.4:process (default) @ olingo-odata4-parent-incubating ---
[INFO] 
[INFO] --- apache-rat-plugin:0.9:check (rat-check) @ olingo-odata4-parent-incubating ---
[INFO] 52 implicit excludes (use -debug for more details).
[INFO] Exclude: **/MANIFEST.MF
[INFO] Exclude: .gitignore
[INFO] Exclude: .git/**
[INFO] Exclude: bin/**
[INFO] Exclude: **/*.local
[INFO] Exclude: **/*.project
[INFO] Exclude: **/*.classpath
[INFO] Exclude: **/*.json
[INFO] Exclude: **/*.batch
[INFO] Exclude: **/NOTICE
[INFO] Exclude: **/DEPENDENCIES
[INFO] 928 resources included (use -debug for more details)
[INFO] Rat check: Summary of files. Unapproved: 3 unknown: 3 generated: 0 approved: 6 licence.
[INFO] ------------------------------------------------------------------------
[INFO] Reactor Summary:
[INFO] 
[INFO] olingo-odata4-parent-incubating ................... FAILURE [2.863s]
[INFO] olingo-odata4-lib-incubating ...................... SKIPPED
[INFO] olingo-odata4-commons-api-incubating .............. SKIPPED
[INFO] olingo-odata4-producer-api-incubating ............. SKIPPED
[INFO] olingo-odata4-commons-core-incubating ............. SKIPPED
[INFO] olingo-odata4-producer-core-incubating ............ SKIPPED
[INFO] olingo-odata4-consumer-api-incubating ............. SKIPPED
[INFO] olingo-odata4-consumer-core-incubating ............ SKIPPED
[INFO] olingo-odata4-fit-incubating ...................... SKIPPED
[INFO] olingo-odata4-ref-incubating ...................... SKIPPED
[INFO] ------------------------------------------------------------------------
[INFO] BUILD FAILURE
[INFO] ------------------------------------------------------------------------
[INFO] Total time: 3.298s
[INFO] Finished at: Sat Feb 15 23:13:00 UTC 2014
[INFO] Final Memory: 11M/175M
[INFO] ------------------------------------------------------------------------
[ERROR] Failed to execute goal org.apache.rat:apache-rat-plugin:0.9:check (rat-check) on project olingo-odata4-parent-incubating: Too many files with unapproved license: 3 See RAT report in: /x1/jenkins/jenkins-slave/workspace/olingo-odata4/target/rat.txt -> [Help 1]
[ERROR] 
[ERROR] To see the full stack trace of the errors, re-run Maven with the -e switch.
[ERROR] Re-run Maven using the -X switch to enable full debug logging.
[ERROR] 
[ERROR] For more information about the errors and possible solutions, please read the following articles:
[ERROR] [Help 1] http://cwiki.apache.org/confluence/display/MAVEN/MojoFailureException
Build step 'Invoke top-level Maven targets' marked build as failure