You are viewing a plain text version of this content. The canonical link for it is here.
Posted to notifications@maven.apache.org by Apache Jenkins Server <je...@builds.apache.org> on 2019/03/03 02:48:35 UTC
Build failed in Jenkins: Maven TLP » maven-javadoc-plugin » MJAVADOC-568 #4
See https://builds.apache.org/job/maven-box/job/maven-javadoc-plugin/job/MJAVADOC-568/4/
No changes.
All tests passed
Build log:
[...truncated 4906 lines...]
[INFO] run post-build script verify.bsh
[INFO] MJAVADOC-250\pom.xml ............................. SUCCESS (15.6 s)
[INFO] Building: MJAVADOC-257\pom.xml
[INFO] MJAVADOC-257\pom.xml ............................. SKIPPED due to JRE version
[INFO] Building: MJAVADOC-259\pom.xml
[INFO] run post-build script verify.bsh
[INFO] MJAVADOC-259\pom.xml ............................. SUCCESS (18.9 s)
[INFO] Building: MJAVADOC-262\pom.xml
[INFO] MJAVADOC-568_export-to-testcase\pom.xml .......... SUCCESS (26.5 s)
[INFO] Building: MJAVADOC-568_jar-mixed\pom.xml
[INFO] run post-build script verify.bsh
[INFO] MJAVADOC-262\pom.xml ............................. SUCCESS (9.7 s)
[INFO] Building: MJAVADOC-275\pom.xml
[INFO] MJAVADOC-568_jar-mixed\pom.xml ................... SUCCESS (19.4 s)
[INFO] Building: MJAVADOC-568_manifest-splitpackage\pom.xml
[INFO] MJAVADOC-275\pom.xml ............................. SUCCESS (18.6 s)
[INFO] Building: MJAVADOC-278\pom.xml
[INFO] run post-build script verify.bsh
[INFO] MJAVADOC-278\pom.xml ............................. SUCCESS (12.2 s)
[INFO] Building: MJAVADOC-320\pom.xml
[INFO] MJAVADOC-568_manifest-splitpackage\pom.xml ....... SUCCESS (28.1 s)
[INFO] Building: MJAVADOC-569_aggr-mixed\pom.xml
[INFO] run post-build script verify.bsh
[INFO] MJAVADOC-320\pom.xml ............................. SUCCESS (16.8 s)
[INFO] Building: MJAVADOC-325\pom.xml
[INFO] MJAVADOC-325\pom.xml ............................. SKIPPED due to JRE version
[INFO] Building: MJAVADOC-365\pom.xml
[INFO] run post-build script verify.bsh
[INFO] MJAVADOC-365\pom.xml ............................. SUCCESS (10.2 s)
[INFO] Building: MJAVADOC-369\pom.xml
[INFO] MJAVADOC-569_aggr-mixed\pom.xml .................. SUCCESS (24.4 s)
[INFO] Building: MJAVADOC-575_source8-module-info\pom.xml
[INFO] run post-build script verify.bsh
[INFO] MJAVADOC-369\pom.xml ............................. SUCCESS (18.8 s)
[INFO] Building: MJAVADOC-384\pom.xml
[INFO] run post-build script verify.groovy
[INFO] MJAVADOC-575_source8-module-info\pom.xml ......... SUCCESS (12.4 s)
[INFO] Building: site-failOnError\pom.xml
[INFO] run post-build script verify.bsh
[INFO] MJAVADOC-384\pom.xml ............................. SUCCESS (8.9 s)
[INFO] Building: MJAVADOC-407\pom.xml
[INFO] site-failOnError\pom.xml ......................... SUCCESS (10.9 s)
[INFO]
[INFO] --- mrm-maven-plugin:1.1.0:stop (repository) @ maven-javadoc-plugin ---
[INFO] Stopping Mock Repository Manager on http://localhost:64547
[INFO] Stopped SocketConnector@0.0.0.0:64547
[INFO] Mock Repository Manager http://localhost:64547 is stopped.
[INFO]
[INFO] --- mrm-maven-plugin:1.1.0:stop (3rdparty) @ maven-javadoc-plugin ---
[INFO] Stopping Mock Repository Manager on http://localhost:64548
[INFO] Stopped SocketConnector@0.0.0.0:64548
[INFO] Mock Repository Manager http://localhost:64548 is stopped.
[INFO]
[INFO] --- maven-checkstyle-plugin:3.0.0:check (checkstyle-check) @ maven-javadoc-plugin ---
[INFO] There are 4 errors reported by Checkstyle 6.18 with config/maven_checks.xml ruleset.
[INFO] Ignored 4 errors, 0 violation remaining.
[INFO]
[INFO] --- maven-invoker-plugin:3.1.0:verify (integration-test) @ maven-javadoc-plugin ---
[INFO] -------------------------------------------------
[INFO] Build Summary:
[INFO] Passed: 60, Failed: 0, Errors: 0, Skipped: 1
[INFO] -------------------------------------------------
[INFO] ------------------------------------------------------------------------
[INFO] BUILD SUCCESS
[INFO] ------------------------------------------------------------------------
[INFO] Total time: 21:24 min
[INFO] Finished at: 2019-03-02T18:39:23-08:00
[INFO] Final Memory: 51M/180M
[INFO] ------------------------------------------------------------------------
[INFO] [jenkins-event-spy] Generated F:\jenkins\jenkins-slave\workspace\aven-javadoc-plugin_MJAVADOC-568@2@tmp\withMaven0b154202\maven-spy-20190302-181758-6791621960709293497291.log
[Pipeline] }
[Pipeline] // dir
[Pipeline] }
[withMaven] artifactsPublisher - Archive artifact windows-jdk11-m3.5.x_build\pom.xml under org\apache\maven\plugins\maven-javadoc-plugin\3.1.0-SNAPSHOT\maven-javadoc-plugin-3.1.0-SNAPSHOT.pom
[withMaven] artifactsPublisher - Archive artifact windows-jdk11-m3.5.x_build\target\maven-javadoc-plugin-3.1.0-SNAPSHOT.jar under org\apache\maven\plugins\maven-javadoc-plugin\3.1.0-SNAPSHOT\maven-javadoc-plugin-3.1.0-SNAPSHOT.jar
[Fast Archiver] Compressed 487.17 KB of artifacts by 52.5% relative to #3
[withMaven] junitPublisher - Archive test results for Maven artifact org.apache.maven.plugins:maven-javadoc-plugin:maven-plugin:3.1.0-SNAPSHOT generated by maven-surefire-plugin:test (default-test): windows-jdk11-m3.5.x_build\target\surefire-reports\*.xml
Recording test results
[withMaven] openTasksPublisher - Scan Tasks for Maven artifact org.apache.maven.plugins:maven-javadoc-plugin:maven-plugin:3.1.0-SNAPSHOT in source directory windows-jdk11-m3.5.x_build\src\main\java
[TASKS] Scanning folder 'f:\jenkins\jenkins-slave\workspace\aven-javadoc-plugin_MJAVADOC-568@2' for files matching the pattern 'windows-jdk11-m3.5.x_build\src\main\java\**\*' - excludes: null
[TASKS] Found 26 files to scan for tasks
[TASKS] Found 7 open tasks.
Skipping warnings blame since pipelines do not have an SCM link.%n
[TASKS] Computing warning deltas based on reference build #3
[withMaven] invokerPublisher - Archive invoker results for Maven artifact MavenArtifact{org.apache.maven.plugins:maven-javadoc-plugin:maven-plugin:3.1.0-SNAPSHOT(version: 3.1.0-SNAPSHOT, snapshot:false) } generated by PluginInvocation{org.apache.maven.plugins:maven-invoker-plugin:3.1.0@integration-test integration-test}: windows-jdk11-m3.5.x_build\target\invoker-reports\*.xml
[INFO] run post-build script verify.bsh
[INFO] MJAVADOC-407\pom.xml ............................. SUCCESS (13.2 s)
[INFO] Building: MJAVADOC-414\pom.xml
[INFO] run post-build script verify.bsh
[INFO] MJAVADOC-414\pom.xml ............................. SUCCESS (12.7 s)
[INFO] Building: MJAVADOC-420_fixparam\pom.xml
[INFO] run post-build script verify.groovy
[INFO] MJAVADOC-420_fixparam\pom.xml .................... SUCCESS (16.1 s)
[INFO] Building: MJAVADOC-427\pom.xml
[INFO] run post-build script verify.groovy
[INFO] MJAVADOC-427\pom.xml ............................. SUCCESS (12.7 s)
[INFO] Building: MJAVADOC-434_fixcompile\pom.xml
[withMaven] Publishers: Generated Artifacts Publisher: 195 ms, Junit Publisher: 526 ms, Open Task Scanner Publisher: 280 ms, Invoker Publisher: 47937 ms, Pipeline Graph Publisher: 1 ms
[Pipeline] // withMaven
[Pipeline] cleanWs
[WS-CLEANUP] Deleting project workspace...
[WS-CLEANUP] Deferred wipeout is used...
[WS-CLEANUP] done
[Pipeline] }
[Pipeline] // stage
[Pipeline] }
[Pipeline] // ws
[Pipeline] }
[Pipeline] // node
[Pipeline] }
[INFO] MJAVADOC-434_fixcompile\pom.xml .................. SUCCESS (18.3 s)
[INFO] Building: MJAVADOC-437\pom.xml
[INFO] run post-build script verify.bsh
[INFO] MJAVADOC-437\pom.xml ............................. SUCCESS (13.2 s)
[INFO] Building: MJAVADOC-444\pom.xml
[INFO] run post-build script verify.bsh
[INFO] MJAVADOC-444\pom.xml ............................. SUCCESS (31.6 s)
[INFO] Building: MJAVADOC-449_aggr_modulepath\pom.xml
[INFO] run post-build script verify.groovy
[INFO] MJAVADOC-449_aggr_modulepath\pom.xml ............. SUCCESS (13.9 s)
[INFO] Building: MJAVADOC-452_fix-duplicateparams\pom.xml
[INFO] run post-build script verify.groovy
[INFO] MJAVADOC-452_fix-duplicateparams\pom.xml ......... SUCCESS (12.3 s)
[INFO] Building: MJAVADOC-494_aggregate-repositories\pom.xml
[INFO] MJAVADOC-494_aggregate-repositories\pom.xml ...... SUCCESS (11.6 s)
[INFO] Building: MJAVADOC-495_offline-filescheme\pom.xml
[INFO] run post-build script verify.groovy
[INFO] MJAVADOC-495_offline-filescheme\pom.xml .......... SUCCESS (18.4 s)
[INFO] Building: MJAVADOC-497\pom.xml
[INFO] run post-build script verify.bsh
[INFO] MJAVADOC-497\pom.xml ............................. SUCCESS (12.4 s)
[INFO] Building: MJAVADOC-498_aggr_modulepath\pom.xml
[INFO] MJAVADOC-498_aggr_modulepath\pom.xml ............. SUCCESS (27.5 s)
[INFO] Building: MJAVADOC-498_mm_modulepath\pom.xml
[INFO] MJAVADOC-498_mm_modulepath\pom.xml ............... SUCCESS (14.7 s)
[INFO] Building: MJAVADOC-498_modulepath\pom.xml
[INFO] run post-build script verify.groovy
[INFO] MJAVADOC-498_modulepath\pom.xml .................. SUCCESS (16.5 s)
[INFO] Building: MJAVADOC-506_excl-module-info\pom.xml
[INFO] run post-build script verify.groovy
[INFO] MJAVADOC-506_excl-module-info\pom.xml ............ SUCCESS (12.7 s)
[INFO] Building: MJAVADOC-508\pom.xml
[INFO] MJAVADOC-508\pom.xml ............................. SUCCESS (9.5 s)
[INFO] Building: MJAVADOC-514_3rdparty-doclettags\pom.xml
[INFO] MJAVADOC-514_3rdparty-doclettags\pom.xml ......... SUCCESS (10.3 s)
[INFO] Building: MJAVADOC-526_aggr-managedDeps\pom.xml
[INFO] MJAVADOC-526_aggr-managedDeps\pom.xml ............ SUCCESS (12.1 s)
[INFO] Building: MJAVADOC-528\pom.xml
[INFO] run post-build script verify.groovy
[INFO] MJAVADOC-528\pom.xml ............................. SUCCESS (12.7 s)
[INFO] Building: MJAVADOC-538\pom.xml
[INFO] MJAVADOC-538\pom.xml ............................. SUCCESS (8.2 s)
[INFO] Building: MJAVADOC-551 spaces\pom.xml
[INFO] MJAVADOC-551 spaces\pom.xml ...................... SUCCESS (7.6 s)
[INFO] Building: MJAVADOC-552_fix-author\pom.xml
[INFO] run post-build script verify.groovy
[INFO] MJAVADOC-552_fix-author\pom.xml .................. SUCCESS (11.5 s)
[INFO] Building: MJAVADOC-555_aggr_mixed\pom.xml
[INFO] run post-build script verify.groovy
[INFO] MJAVADOC-555_aggr_mixed\pom.xml .................. SUCCESS (12.1 s)
[INFO] Building: MJAVADOC-555_link-automatic-modules\pom.xml
[INFO] run post-build script verify.groovy
[INFO] MJAVADOC-555_link-automatic-modules\pom.xml ...... SUCCESS (14.8 s)
[INFO] Building: MJAVADOC-556_hide-non-exported-packages\pom.xml
[INFO] MJAVADOC-556_hide-non-exported-packages\pom.xml .. SUCCESS (11.1 s)
[INFO] Building: MJAVADOC-558_fix-unknownthrows\pom.xml
[INFO] run post-build script verify.groovy
[INFO] MJAVADOC-558_fix-unknownthrows\pom.xml ........... SUCCESS (12.0 s)
[INFO] Building: MJAVADOC-562_release\pom.xml
[INFO] MJAVADOC-562_release\pom.xml ..................... SUCCESS (13.5 s)
[INFO] Building: MJAVADOC-567_aggr-mixed\pom.xml
[INFO] run post-build script verify.groovy
[INFO] MJAVADOC-567_aggr-mixed\pom.xml .................. SUCCESS (10.1 s)
[INFO] Building: MJAVADOC-568_export-to-testcase\pom.xml
[INFO] MJAVADOC-568_export-to-testcase\pom.xml .......... SUCCESS (23.3 s)
[INFO] Building: MJAVADOC-568_jar-mixed\pom.xml
[INFO] MJAVADOC-568_jar-mixed\pom.xml ................... SUCCESS (16.0 s)
[INFO] Building: MJAVADOC-568_manifest-splitpackage\pom.xml
[INFO] MJAVADOC-568_manifest-splitpackage\pom.xml ....... SUCCESS (20.5 s)
[INFO] Building: MJAVADOC-569_aggr-mixed\pom.xml
[INFO] MJAVADOC-569_aggr-mixed\pom.xml .................. SUCCESS (18.0 s)
[INFO] Building: MJAVADOC-575_source8-module-info\pom.xml
[INFO] run post-build script verify.groovy
[INFO] MJAVADOC-575_source8-module-info\pom.xml ......... SUCCESS (12.1 s)
[INFO] Building: site-failOnError\pom.xml
[INFO] site-failOnError\pom.xml ......................... SUCCESS (13.2 s)
[INFO]
[INFO] --- mrm-maven-plugin:1.1.0:stop (repository) @ maven-javadoc-plugin ---
[INFO] Stopping Mock Repository Manager on http://localhost:60770
[INFO] Stopped SocketConnector@0.0.0.0:60770
[INFO] Mock Repository Manager http://localhost:60770 is stopped.
[INFO]
[INFO] --- mrm-maven-plugin:1.1.0:stop (3rdparty) @ maven-javadoc-plugin ---
[INFO] Stopping Mock Repository Manager on http://localhost:60771
[INFO] Stopped SocketConnector@0.0.0.0:60771
[INFO] Mock Repository Manager http://localhost:60771 is stopped.
[INFO]
[INFO] --- maven-checkstyle-plugin:3.0.0:check (checkstyle-check) @ maven-javadoc-plugin ---
[INFO] There are 4 errors reported by Checkstyle 6.18 with config/maven_checks.xml ruleset.
[INFO] Ignored 4 errors, 0 violation remaining.
[INFO]
[INFO] --- maven-invoker-plugin:3.1.0:verify (integration-test) @ maven-javadoc-plugin ---
[INFO] -------------------------------------------------
[INFO] Build Summary:
[INFO] Passed: 59, Failed: 0, Errors: 0, Skipped: 2
[INFO] -------------------------------------------------
[INFO] ------------------------------------------------------------------------
[INFO] BUILD SUCCESS
[INFO] ------------------------------------------------------------------------
[INFO] Total time: 18:56 min
[INFO] Finished at: 2019-03-03T02:47:46Z
[INFO] Final Memory: 51M/177M
[INFO] ------------------------------------------------------------------------
[INFO] [jenkins-event-spy] Generated F:\jenkins\jenkins-slave\workspace\aven-javadoc-plugin_MJAVADOC-568@3@2@tmp\withMaven3513395d\maven-spy-20190303-022849-58012274021761752485376.log
[Pipeline] }
[Pipeline] // dir
[Pipeline] }
[withMaven] artifactsPublisher - Archive artifact windows-jdk12-m3.5.x_build\pom.xml under org\apache\maven\plugins\maven-javadoc-plugin\3.1.0-SNAPSHOT\maven-javadoc-plugin-3.1.0-SNAPSHOT.pom
[withMaven] artifactsPublisher - Archive artifact windows-jdk12-m3.5.x_build\target\maven-javadoc-plugin-3.1.0-SNAPSHOT.jar under org\apache\maven\plugins\maven-javadoc-plugin\3.1.0-SNAPSHOT\maven-javadoc-plugin-3.1.0-SNAPSHOT.jar
[Fast Archiver] Compressed 487.17 KB of artifacts by 52.5% relative to #3
[withMaven] junitPublisher - Archive test results for Maven artifact org.apache.maven.plugins:maven-javadoc-plugin:maven-plugin:3.1.0-SNAPSHOT generated by maven-surefire-plugin:test (default-test): windows-jdk12-m3.5.x_build\target\surefire-reports\*.xml
Recording test results
[withMaven] openTasksPublisher - Scan Tasks for Maven artifact org.apache.maven.plugins:maven-javadoc-plugin:maven-plugin:3.1.0-SNAPSHOT in source directory windows-jdk12-m3.5.x_build\src\main\java
[TASKS] Scanning folder 'f:\jenkins\jenkins-slave\workspace\aven-javadoc-plugin_MJAVADOC-568@3@2' for files matching the pattern 'windows-jdk12-m3.5.x_build\src\main\java\**\*' - excludes: null
[TASKS] Found 26 files to scan for tasks
[TASKS] Found 7 open tasks.
Skipping warnings blame since pipelines do not have an SCM link.%n
[TASKS] Computing warning deltas based on reference build #3
[withMaven] invokerPublisher - Archive invoker results for Maven artifact MavenArtifact{org.apache.maven.plugins:maven-javadoc-plugin:maven-plugin:3.1.0-SNAPSHOT(version: 3.1.0-SNAPSHOT, snapshot:false) } generated by PluginInvocation{org.apache.maven.plugins:maven-invoker-plugin:3.1.0@integration-test integration-test}: windows-jdk12-m3.5.x_build\target\invoker-reports\*.xml
[withMaven] Publishers: Generated Artifacts Publisher: 321 ms, Junit Publisher: 648 ms, Open Task Scanner Publisher: 251 ms, Dependencies Fingerprint Publisher: 1 ms, Invoker Publisher: 46280 ms, Pipeline Graph Publisher: 1 ms
[Pipeline] // withMaven
[Pipeline] cleanWs
[WS-CLEANUP] Deleting project workspace...
[WS-CLEANUP] Deferred wipeout is used...
[WS-CLEANUP] done
[Pipeline] }
[Pipeline] // stage
[Pipeline] }
[Pipeline] // ws
[Pipeline] }
[Pipeline] // node
[Pipeline] }
[Pipeline] // parallel
[Pipeline] stage
[Pipeline] { (Notifications)
[Pipeline] echo
Build result: FAILURE
[Pipeline] jiraIssueSelector
[Pipeline] emailext
Build unstable in Jenkins: Maven TLP » maven-javadoc-plugin » MJAVADOC-568 #6
Posted by Apache Jenkins Server <je...@builds.apache.org>.
See https://builds.apache.org/job/maven-box/job/maven-javadoc-plugin/job/MJAVADOC-568/6/
Changes:
* [INFRA-18014] Provide GPG on Jenkins Windows nodes
* Switch back to Windows label
* Change workspace path for Windows
* Shorten wsDir
* Fix groovy script
* rewrite groovy statement
* Keep original stageId
* Reduce stageDir
* More shortening of path
* maven-invoker keeps lock on jar (under investigation), so can't fully
2 tests failed.
FAILED: org.apache.maven.plugins.javadoc.JavadocReportTest.linux-jdk12-m3.5.x_build / Build linux-jdk12-m3.5.x_build / testDefaultConfiguration
Error Message:
null
Stack Trace:
junit.framework.AssertionFailedError
at org.apache.maven.plugins.javadoc.JavadocReportTest.testDefaultConfiguration(JavadocReportTest.java:246)
FAILED: org.apache.maven.plugins.javadoc.JavadocReportTest.windows-jdk12-m3.5.x_build / Build windows-jdk12-m3.5.x_build / testDefaultConfiguration
Error Message:
null
Stack Trace:
junit.framework.AssertionFailedError
at org.apache.maven.plugins.javadoc.JavadocReportTest.testDefaultConfiguration(JavadocReportTest.java:246)
Build log:
[...truncated 6331 lines...]
[INFO] MJAVADOC-568_jar-mixed\pom.xml ................... SKIPPED due to JRE version
[INFO] Building: MJAVADOC-568_manifest-splitpackage\pom.xml
[INFO] MJAVADOC-568_manifest-splitpackage\pom.xml ....... SKIPPED due to JRE version
[INFO] Building: MJAVADOC-569_aggr-mixed\pom.xml
[INFO] MJAVADOC-569_aggr-mixed\pom.xml .................. SKIPPED due to JRE version
[INFO] Building: MJAVADOC-575_source8-module-info\pom.xml
[INFO] MJAVADOC-575_source8-module-info\pom.xml ......... SKIPPED due to JRE version
[INFO] Building: site-failOnError\pom.xml
[INFO] MJAVADOC-568_export-to-testcase\pom.xml .......... SUCCESS (18.0 s)
[INFO] Building: MJAVADOC-568_jar-mixed\pom.xml
[INFO] site-failOnError\pom.xml ......................... SUCCESS (18.3 s)
[INFO]
[INFO] --- mrm-maven-plugin:1.1.0:stop (repository) @ maven-javadoc-plugin ---
[INFO] Stopping Mock Repository Manager on http://localhost:54492
[INFO] Stopped SocketConnector@0.0.0.0:54492
[INFO] Mock Repository Manager http://localhost:54492 is stopped.
[INFO]
[INFO] --- mrm-maven-plugin:1.1.0:stop (3rdparty) @ maven-javadoc-plugin ---
[INFO] Stopping Mock Repository Manager on http://localhost:54493
[INFO] Stopped SocketConnector@0.0.0.0:54493
[INFO] Mock Repository Manager http://localhost:54493 is stopped.
[INFO]
[INFO] --- maven-checkstyle-plugin:3.0.0:check (checkstyle-check) @ maven-javadoc-plugin ---
[INFO] MJAVADOC-498_mm_modulepath\pom.xml ............... SUCCESS (20.9 s)
[INFO] Building: MJAVADOC-498_modulepath\pom.xml
[INFO] There are 4 errors reported by Checkstyle 6.18 with config/maven_checks.xml ruleset.
[INFO] Ignored 4 errors, 0 violation remaining.
[INFO]
[INFO] --- maven-invoker-plugin:3.1.0:verify (integration-test) @ maven-javadoc-plugin ---
[INFO] -------------------------------------------------
[INFO] Build Summary:
[INFO] Passed: 46, Failed: 0, Errors: 0, Skipped: 15
[INFO] -------------------------------------------------
[INFO] ------------------------------------------------------------------------
[INFO] BUILD SUCCESS
[INFO] ------------------------------------------------------------------------
[INFO] Total time: 22:31 min
[INFO] Finished at: 2019-04-10T03:36:50+00:00
[INFO] Final Memory: 64M/1110M
[INFO] ------------------------------------------------------------------------
[INFO] [jenkins-event-spy] Generated F:\jenkins\jenkins-slave\workspace\aven-javadoc-plugin_MJAVADOC-568@2@tmp\withMaven6692d8d0\maven-spy-20190410-031417-9514141746907767044839.log
Picked up JAVA_TOOL_OPTIONS: -Dmaven.ext.class.path="f:\jenkins\jenkins-slave\workspace\aven-javadoc-plugin_MJAVADOC-568@2@tmp\withMaven6692d8d0\pipeline-maven-spy.jar" -Dorg.jenkinsci.plugins.pipeline.maven.reportsFolder="f:\jenkins\jenkins-slave\workspace\aven-javadoc-plugin_MJAVADOC-568@2@tmp\withMaven6692d8d0"
[Pipeline] }
[Pipeline] // dir
[Pipeline] }
[withMaven] artifactsPublisher - Archive artifact windows-jdk7-m3.3.x_build\pom.xml under org\apache\maven\plugins\maven-javadoc-plugin\3.1.0-SNAPSHOT\maven-javadoc-plugin-3.1.0-SNAPSHOT.pom
[withMaven] artifactsPublisher - Archive artifact windows-jdk7-m3.3.x_build\target\maven-javadoc-plugin-3.1.0-SNAPSHOT.jar under org\apache\maven\plugins\maven-javadoc-plugin\3.1.0-SNAPSHOT\maven-javadoc-plugin-3.1.0-SNAPSHOT.jar
[Fast Archiver] Compressed 488.20 KB of artifacts by 45.9% relative to #5
[withMaven] junitPublisher - Archive test results for Maven artifact org.apache.maven.plugins:maven-javadoc-plugin:maven-plugin:3.1.0-SNAPSHOT generated by maven-surefire-plugin:test (default-test): windows-jdk7-m3.3.x_build\target\surefire-reports\*.xml
Recording test results
[withMaven] openTasksPublisher - Scan Tasks for Maven artifact org.apache.maven.plugins:maven-javadoc-plugin:maven-plugin:3.1.0-SNAPSHOT in source directory windows-jdk7-m3.3.x_build\src\main\java
[TASKS] Scanning folder 'f:\jenkins\jenkins-slave\workspace\aven-javadoc-plugin_MJAVADOC-568@2' for files matching the pattern 'windows-jdk7-m3.3.x_build\src\main\java\**\*' - excludes: null
[TASKS] Found 26 files to scan for tasks
[TASKS] Found 7 open tasks.
Skipping warnings blame since pipelines do not have an SCM link.%n
[TASKS] Computing warning deltas based on reference build #5
[withMaven] invokerPublisher - Archive invoker results for Maven artifact MavenArtifact{org.apache.maven.plugins:maven-javadoc-plugin:maven-plugin:3.1.0-SNAPSHOT(version: 3.1.0-SNAPSHOT, snapshot:false) } generated by PluginInvocation{org.apache.maven.plugins:maven-invoker-plugin:3.1.0@integration-test integration-test}: windows-jdk7-m3.3.x_build\target\invoker-reports\*.xml
[INFO] MJAVADOC-568_jar-mixed\pom.xml ................... SUCCESS (17.0 s)
[INFO] Building: MJAVADOC-568_manifest-splitpackage\pom.xml
[INFO] MJAVADOC-568_manifest-splitpackage\pom.xml ....... SUCCESS (15.7 s)
[INFO] Building: MJAVADOC-569_aggr-mixed\pom.xml
[INFO] run post-build script verify.groovy
[INFO] MJAVADOC-498_modulepath\pom.xml .................. SUCCESS (23.6 s)
[INFO] Building: MJAVADOC-506_excl-module-info\pom.xml
[INFO] run post-build script verify.groovy
[INFO] MJAVADOC-506_excl-module-info\pom.xml ............ SUCCESS (13.3 s)
[INFO] Building: MJAVADOC-508\pom.xml
[INFO] MJAVADOC-508\pom.xml ............................. SUCCESS (11.3 s)
[INFO] Building: MJAVADOC-514_3rdparty-doclettags\pom.xml
[INFO] MJAVADOC-569_aggr-mixed\pom.xml .................. SUCCESS (16.3 s)
[INFO] Building: MJAVADOC-575_source8-module-info\pom.xml
[INFO] run post-build script verify.groovy
[INFO] MJAVADOC-575_source8-module-info\pom.xml ......... SUCCESS (11.7 s)
[INFO] Building: site-failOnError\pom.xml
[INFO] MJAVADOC-514_3rdparty-doclettags\pom.xml ......... SUCCESS (12.8 s)
[INFO] Building: MJAVADOC-526_aggr-managedDeps\pom.xml
[INFO] site-failOnError\pom.xml ......................... SUCCESS (14.0 s)
[INFO]
[INFO] --- mrm-maven-plugin:1.1.0:stop (repository) @ maven-javadoc-plugin ---
[INFO] Stopping Mock Repository Manager on http://localhost:53475
[INFO] Stopped SocketConnector@0.0.0.0:53475
[INFO] Mock Repository Manager http://localhost:53475 is stopped.
[INFO]
[INFO] --- mrm-maven-plugin:1.1.0:stop (3rdparty) @ maven-javadoc-plugin ---
[INFO] Stopping Mock Repository Manager on http://localhost:53476
[INFO] Stopped SocketConnector@0.0.0.0:53476
[INFO] Mock Repository Manager http://localhost:53476 is stopped.
[INFO]
[INFO] --- maven-checkstyle-plugin:3.0.0:check (checkstyle-check) @ maven-javadoc-plugin ---
[INFO] There are 4 errors reported by Checkstyle 6.18 with config/maven_checks.xml ruleset.
[INFO] Ignored 4 errors, 0 violation remaining.
[INFO]
[INFO] --- maven-invoker-plugin:3.1.0:verify (integration-test) @ maven-javadoc-plugin ---
[INFO] -------------------------------------------------
[INFO] Build Summary:
[INFO] Passed: 59, Failed: 0, Errors: 0, Skipped: 2
[INFO] -------------------------------------------------
[INFO] ------------------------------------------------------------------------
[INFO] BUILD SUCCESS
[INFO] ------------------------------------------------------------------------
[INFO] Total time: 18:24 min
[INFO] Finished at: 2019-04-10T03:38:03Z
[INFO] Final Memory: 50M/170M
[INFO] ------------------------------------------------------------------------
[INFO] [jenkins-event-spy] Generated F:\jenkins\jenkins-slave\workspace\aven-javadoc-plugin_MJAVADOC-568@3@2@tmp\withMavenb505b4ff\maven-spy-20190410-031937-81910086595618246467895.log
[Pipeline] }
[Pipeline] // dir
[Pipeline] }
[INFO] MJAVADOC-526_aggr-managedDeps\pom.xml ............ SUCCESS (16.0 s)
[INFO] Building: MJAVADOC-528\pom.xml
[withMaven] artifactsPublisher - Archive artifact windows-jdk12-m3.5.x_build\pom.xml under org\apache\maven\plugins\maven-javadoc-plugin\3.1.0-SNAPSHOT\maven-javadoc-plugin-3.1.0-SNAPSHOT.pom
[withMaven] artifactsPublisher - Archive artifact windows-jdk12-m3.5.x_build\target\maven-javadoc-plugin-3.1.0-SNAPSHOT.jar under org\apache\maven\plugins\maven-javadoc-plugin\3.1.0-SNAPSHOT\maven-javadoc-plugin-3.1.0-SNAPSHOT.jar
[Fast Archiver] Compressed 487.17 KB of artifacts by 52.5% relative to #5
[withMaven] junitPublisher - Archive test results for Maven artifact org.apache.maven.plugins:maven-javadoc-plugin:maven-plugin:3.1.0-SNAPSHOT generated by maven-surefire-plugin:test (default-test): windows-jdk12-m3.5.x_build\target\surefire-reports\*.xml
Recording test results
[withMaven] openTasksPublisher - Scan Tasks for Maven artifact org.apache.maven.plugins:maven-javadoc-plugin:maven-plugin:3.1.0-SNAPSHOT in source directory windows-jdk12-m3.5.x_build\src\main\java
[TASKS] Scanning folder 'f:\jenkins\jenkins-slave\workspace\aven-javadoc-plugin_MJAVADOC-568@3@2' for files matching the pattern 'windows-jdk12-m3.5.x_build\src\main\java\**\*' - excludes: null
[TASKS] Found 26 files to scan for tasks
[TASKS] Found 7 open tasks.
Skipping warnings blame since pipelines do not have an SCM link.%n
[TASKS] Computing warning deltas based on reference build #5
[withMaven] invokerPublisher - Archive invoker results for Maven artifact MavenArtifact{org.apache.maven.plugins:maven-javadoc-plugin:maven-plugin:3.1.0-SNAPSHOT(version: 3.1.0-SNAPSHOT, snapshot:false) } generated by PluginInvocation{org.apache.maven.plugins:maven-invoker-plugin:3.1.0@integration-test integration-test}: windows-jdk12-m3.5.x_build\target\invoker-reports\*.xml
[INFO] run post-build script verify.groovy
[INFO] MJAVADOC-528\pom.xml ............................. SUCCESS (13.1 s)
[INFO] Building: MJAVADOC-538\pom.xml
[withMaven] Publishers: Generated Artifacts Publisher: 231 ms, Junit Publisher: 565 ms, Open Task Scanner Publisher: 288 ms, Dependencies Fingerprint Publisher: 1 ms, Invoker Publisher: 87645 ms, Pipeline Graph Publisher: 1 ms
[Pipeline] // withMaven
[Pipeline] cleanWs
[WS-CLEANUP] Deleting project workspace...
[WS-CLEANUP] Deferred wipeout is used...
[WS-CLEANUP] done
[Pipeline] }
[Pipeline] // stage
[Pipeline] }
[Pipeline] // ws
[Pipeline] }
[Pipeline] // node
[Pipeline] }
[INFO] MJAVADOC-538\pom.xml ............................. SUCCESS (11.5 s)
[INFO] Building: MJAVADOC-551 spaces\pom.xml
[INFO] MJAVADOC-551 spaces\pom.xml ...................... SUCCESS (9.6 s)
[INFO] Building: MJAVADOC-552_fix-author\pom.xml
[INFO] run post-build script verify.groovy
[INFO] MJAVADOC-552_fix-author\pom.xml .................. SUCCESS (14.7 s)
[INFO] Building: MJAVADOC-555_aggr_mixed\pom.xml
[INFO] run post-build script verify.groovy
[INFO] MJAVADOC-555_aggr_mixed\pom.xml .................. SUCCESS (20.5 s)
[INFO] Building: MJAVADOC-555_link-automatic-modules\pom.xml
[withMaven] Publishers: Generated Artifacts Publisher: 259 ms, Junit Publisher: 1449 ms, Open Task Scanner Publisher: 218 ms, Dependencies Fingerprint Publisher: 1 ms, Invoker Publisher: 63793 ms, Pipeline Graph Publisher: 1 ms
[Pipeline] // withMaven
[Pipeline] cleanWs
[WS-CLEANUP] Deleting project workspace...
[WS-CLEANUP] Deferred wipeout is used...
[WS-CLEANUP] done
[Pipeline] }
[Pipeline] // stage
[Pipeline] }
[Pipeline] // ws
[Pipeline] }
[Pipeline] // node
[Pipeline] }
[INFO] run post-build script verify.groovy
[INFO] MJAVADOC-555_link-automatic-modules\pom.xml ...... SUCCESS (17.7 s)
[INFO] Building: MJAVADOC-556_hide-non-exported-packages\pom.xml
[INFO] MJAVADOC-556_hide-non-exported-packages\pom.xml .. SUCCESS (15.8 s)
[INFO] Building: MJAVADOC-558_fix-unknownthrows\pom.xml
[INFO] run post-build script verify.groovy
[INFO] MJAVADOC-558_fix-unknownthrows\pom.xml ........... SUCCESS (14.9 s)
[INFO] Building: MJAVADOC-562_release\pom.xml
[INFO] MJAVADOC-562_release\pom.xml ..................... SUCCESS (14.1 s)
[INFO] Building: MJAVADOC-567_aggr-mixed\pom.xml
[INFO] run post-build script verify.groovy
[INFO] MJAVADOC-567_aggr-mixed\pom.xml .................. SUCCESS (12.5 s)
[INFO] Building: MJAVADOC-568_export-to-testcase\pom.xml
[INFO] MJAVADOC-568_export-to-testcase\pom.xml .......... SUCCESS (29.5 s)
[INFO] Building: MJAVADOC-568_jar-mixed\pom.xml
[INFO] MJAVADOC-568_jar-mixed\pom.xml ................... SUCCESS (21.5 s)
[INFO] Building: MJAVADOC-568_manifest-splitpackage\pom.xml
[INFO] MJAVADOC-568_manifest-splitpackage\pom.xml ....... SUCCESS (28.3 s)
[INFO] Building: MJAVADOC-569_aggr-mixed\pom.xml
[INFO] MJAVADOC-569_aggr-mixed\pom.xml .................. SUCCESS (27.1 s)
[INFO] Building: MJAVADOC-575_source8-module-info\pom.xml
[INFO] run post-build script verify.groovy
[INFO] MJAVADOC-575_source8-module-info\pom.xml ......... SUCCESS (13.1 s)
[INFO] Building: site-failOnError\pom.xml
[INFO] site-failOnError\pom.xml ......................... SUCCESS (14.0 s)
[INFO]
[INFO] --- mrm-maven-plugin:1.1.0:stop (repository) @ maven-javadoc-plugin ---
[INFO] Stopping Mock Repository Manager on http://localhost:55860
[INFO] Stopped SocketConnector@0.0.0.0:55860
[INFO] Mock Repository Manager http://localhost:55860 is stopped.
[INFO]
[INFO] --- mrm-maven-plugin:1.1.0:stop (3rdparty) @ maven-javadoc-plugin ---
[INFO] Stopping Mock Repository Manager on http://localhost:55861
[INFO] Stopped SocketConnector@0.0.0.0:55861
[INFO] Mock Repository Manager http://localhost:55861 is stopped.
[INFO]
[INFO] --- maven-checkstyle-plugin:3.0.0:check (checkstyle-check) @ maven-javadoc-plugin ---
[INFO] There are 4 errors reported by Checkstyle 6.18 with config/maven_checks.xml ruleset.
[INFO] Ignored 4 errors, 0 violation remaining.
[INFO]
[INFO] --- maven-invoker-plugin:3.1.0:verify (integration-test) @ maven-javadoc-plugin ---
[INFO] -------------------------------------------------
[INFO] Build Summary:
[INFO] Passed: 60, Failed: 0, Errors: 0, Skipped: 1
[INFO] -------------------------------------------------
[INFO] ------------------------------------------------------------------------
[INFO] BUILD SUCCESS
[INFO] ------------------------------------------------------------------------
[INFO] Total time: 25:19 min
[INFO] Finished at: 2019-04-09T20:42:42-07:00
[INFO] Final Memory: 51M/177M
[INFO] ------------------------------------------------------------------------
[INFO] [jenkins-event-spy] Generated F:\jenkins\jenkins-slave\workspace\aven-javadoc-plugin_MJAVADOC-568@2@tmp\withMaven85344300\maven-spy-20190409-201722-66813716715389772669220.log
[Pipeline] }
[Pipeline] // dir
[Pipeline] }
[withMaven] artifactsPublisher - Archive artifact windows-jdk11-m3.5.x_build\pom.xml under org\apache\maven\plugins\maven-javadoc-plugin\3.1.0-SNAPSHOT\maven-javadoc-plugin-3.1.0-SNAPSHOT.pom
[withMaven] artifactsPublisher - Archive artifact windows-jdk11-m3.5.x_build\target\maven-javadoc-plugin-3.1.0-SNAPSHOT.jar under org\apache\maven\plugins\maven-javadoc-plugin\3.1.0-SNAPSHOT\maven-javadoc-plugin-3.1.0-SNAPSHOT.jar
[Fast Archiver] Compressed 487.17 KB of artifacts by 52.5% relative to #5
[withMaven] junitPublisher - Archive test results for Maven artifact org.apache.maven.plugins:maven-javadoc-plugin:maven-plugin:3.1.0-SNAPSHOT generated by maven-surefire-plugin:test (default-test): windows-jdk11-m3.5.x_build\target\surefire-reports\*.xml
Recording test results
[withMaven] openTasksPublisher - Scan Tasks for Maven artifact org.apache.maven.plugins:maven-javadoc-plugin:maven-plugin:3.1.0-SNAPSHOT in source directory windows-jdk11-m3.5.x_build\src\main\java
[TASKS] Scanning folder 'f:\jenkins\jenkins-slave\workspace\aven-javadoc-plugin_MJAVADOC-568@2' for files matching the pattern 'windows-jdk11-m3.5.x_build\src\main\java\**\*' - excludes: null
[TASKS] Found 26 files to scan for tasks
[TASKS] Found 7 open tasks.
Skipping warnings blame since pipelines do not have an SCM link.%n
[TASKS] Computing warning deltas based on reference build #5
[withMaven] invokerPublisher - Archive invoker results for Maven artifact MavenArtifact{org.apache.maven.plugins:maven-javadoc-plugin:maven-plugin:3.1.0-SNAPSHOT(version: 3.1.0-SNAPSHOT, snapshot:false) } generated by PluginInvocation{org.apache.maven.plugins:maven-invoker-plugin:3.1.0@integration-test integration-test}: windows-jdk11-m3.5.x_build\target\invoker-reports\*.xml
[withMaven] Publishers: Generated Artifacts Publisher: 291 ms, Junit Publisher: 605 ms, Open Task Scanner Publisher: 294 ms, Dependencies Fingerprint Publisher: 1 ms, Invoker Publisher: 111468 ms, Pipeline Graph Publisher: 2 ms
[Pipeline] // withMaven
[Pipeline] cleanWs
[WS-CLEANUP] Deleting project workspace...
[WS-CLEANUP] Deferred wipeout is used...
[WS-CLEANUP] done
[Pipeline] }
[Pipeline] // stage
[Pipeline] }
[Pipeline] // ws
[Pipeline] }
[Pipeline] // node
[Pipeline] }
[Pipeline] // parallel
[Pipeline] stage
[Pipeline] { (Notifications)
[Pipeline] echo
Build result: UNSTABLE
[Pipeline] jiraIssueSelector
[Pipeline] emailext
Build unstable in Jenkins: Maven TLP » maven-javadoc-plugin » MJAVADOC-568 #5
Posted by Apache Jenkins Server <je...@builds.apache.org>.
See https://builds.apache.org/job/maven-box/job/maven-javadoc-plugin/job/MJAVADOC-568/5/
No changes.
2 tests failed.
FAILED: org.apache.maven.plugins.javadoc.JavadocReportTest.linux-jdk12-m3.5.x_build / Build linux-jdk12-m3.5.x_build / testDefaultConfiguration
Error Message:
null
Stack Trace:
junit.framework.AssertionFailedError
at org.apache.maven.plugins.javadoc.JavadocReportTest.testDefaultConfiguration(JavadocReportTest.java:246)
FAILED: org.apache.maven.plugins.javadoc.JavadocReportTest.windows-jdk12-m3.5.x_build / Build windows-jdk12-m3.5.x_build / testDefaultConfiguration
Error Message:
null
Stack Trace:
junit.framework.AssertionFailedError
at org.apache.maven.plugins.javadoc.JavadocReportTest.testDefaultConfiguration(JavadocReportTest.java:246)
Build log:
[...truncated 6240 lines...]
[INFO] run post-build script verify.bsh
[INFO] MJAVADOC-365\pom.xml ............................. SUCCESS (8.1 s)
[INFO] Building: MJAVADOC-369\pom.xml
[INFO] MJAVADOC-551 spaces\pom.xml ...................... SUCCESS (7.2 s)
[INFO] Building: MJAVADOC-552_fix-author\pom.xml
[INFO] run post-build script verify.groovy
[INFO] MJAVADOC-552_fix-author\pom.xml .................. SUCCESS (10.3 s)
[INFO] Building: MJAVADOC-555_aggr_mixed\pom.xml
[INFO] run post-build script verify.bsh
[INFO] MJAVADOC-369\pom.xml ............................. SUCCESS (14.8 s)
[INFO] Building: MJAVADOC-384\pom.xml
[INFO] run post-build script verify.bsh
[INFO] MJAVADOC-384\pom.xml ............................. SUCCESS (7.6 s)
[INFO] Building: MJAVADOC-407\pom.xml
[INFO] run post-build script verify.groovy
[INFO] MJAVADOC-555_aggr_mixed\pom.xml .................. SUCCESS (11.8 s)
[INFO] Building: MJAVADOC-555_link-automatic-modules\pom.xml
[INFO] run post-build script verify.bsh
[INFO] MJAVADOC-407\pom.xml ............................. SUCCESS (11.0 s)
[INFO] Building: MJAVADOC-414\pom.xml
[INFO] run post-build script verify.groovy
[INFO] MJAVADOC-555_link-automatic-modules\pom.xml ...... SUCCESS (14.3 s)
[INFO] Building: MJAVADOC-556_hide-non-exported-packages\pom.xml
[INFO] run post-build script verify.bsh
[INFO] MJAVADOC-414\pom.xml ............................. SUCCESS (10.5 s)
[INFO] Building: MJAVADOC-420_fixparam\pom.xml
[INFO] MJAVADOC-556_hide-non-exported-packages\pom.xml .. SUCCESS (9.7 s)
[INFO] Building: MJAVADOC-558_fix-unknownthrows\pom.xml
[INFO] run post-build script verify.groovy
[INFO] MJAVADOC-420_fixparam\pom.xml .................... SUCCESS (13.9 s)
[INFO] Building: MJAVADOC-427\pom.xml
[INFO] run post-build script verify.groovy
[INFO] MJAVADOC-558_fix-unknownthrows\pom.xml ........... SUCCESS (11.1 s)
[INFO] Building: MJAVADOC-562_release\pom.xml
[INFO] run post-build script verify.groovy
[INFO] MJAVADOC-427\pom.xml ............................. SUCCESS (11.6 s)
[INFO] Building: MJAVADOC-434_fixcompile\pom.xml
[INFO] MJAVADOC-562_release\pom.xml ..................... SUCCESS (11.3 s)
[INFO] Building: MJAVADOC-567_aggr-mixed\pom.xml
[INFO] run post-build script verify.groovy
[INFO] MJAVADOC-567_aggr-mixed\pom.xml .................. SUCCESS (8.5 s)
[INFO] Building: MJAVADOC-568_export-to-testcase\pom.xml
[INFO] MJAVADOC-434_fixcompile\pom.xml .................. SUCCESS (15.1 s)
[INFO] Building: MJAVADOC-437\pom.xml
[INFO] run post-build script verify.bsh
[INFO] MJAVADOC-437\pom.xml ............................. SUCCESS (11.9 s)
[INFO] Building: MJAVADOC-444\pom.xml
[INFO] MJAVADOC-568_export-to-testcase\pom.xml .......... SUCCESS (21.7 s)
[INFO] Building: MJAVADOC-568_jar-mixed\pom.xml
[INFO] MJAVADOC-568_jar-mixed\pom.xml ................... SUCCESS (15.8 s)
[INFO] Building: MJAVADOC-568_manifest-splitpackage\pom.xml
[INFO] run post-build script verify.bsh
[INFO] MJAVADOC-444\pom.xml ............................. SUCCESS (32.9 s)
[INFO] Building: MJAVADOC-449_aggr_modulepath\pom.xml
[INFO] MJAVADOC-568_manifest-splitpackage\pom.xml ....... SUCCESS (17.2 s)
[INFO] Building: MJAVADOC-569_aggr-mixed\pom.xml
[INFO] run post-build script verify.groovy
[INFO] MJAVADOC-449_aggr_modulepath\pom.xml ............. SUCCESS (13.5 s)
[INFO] Building: MJAVADOC-452_fix-duplicateparams\pom.xml
[INFO] MJAVADOC-569_aggr-mixed\pom.xml .................. SUCCESS (14.9 s)
[INFO] Building: MJAVADOC-575_source8-module-info\pom.xml
[INFO] run post-build script verify.groovy
[INFO] MJAVADOC-452_fix-duplicateparams\pom.xml ......... SUCCESS (9.8 s)
[INFO] Building: MJAVADOC-494_aggregate-repositories\pom.xml
[INFO] run post-build script verify.groovy
[INFO] MJAVADOC-575_source8-module-info\pom.xml ......... SUCCESS (10.5 s)
[INFO] Building: site-failOnError\pom.xml
[INFO] MJAVADOC-494_aggregate-repositories\pom.xml ...... SUCCESS (10.6 s)
[INFO] Building: MJAVADOC-495_offline-filescheme\pom.xml
[INFO] site-failOnError\pom.xml ......................... SUCCESS (11.6 s)
[INFO]
[INFO] --- mrm-maven-plugin:1.1.0:stop (repository) @ maven-javadoc-plugin ---
[INFO] Stopping Mock Repository Manager on http://localhost:59651
[INFO] Stopped SocketConnector@0.0.0.0:59651
[INFO] Mock Repository Manager http://localhost:59651 is stopped.
[INFO]
[INFO] --- mrm-maven-plugin:1.1.0:stop (3rdparty) @ maven-javadoc-plugin ---
[INFO] Stopping Mock Repository Manager on http://localhost:59652
[INFO] Stopped SocketConnector@0.0.0.0:59652
[INFO] Mock Repository Manager http://localhost:59652 is stopped.
[INFO]
[INFO] --- maven-checkstyle-plugin:3.0.0:check (checkstyle-check) @ maven-javadoc-plugin ---
[INFO] There are 4 errors reported by Checkstyle 6.18 with config/maven_checks.xml ruleset.
[INFO] Ignored 4 errors, 0 violation remaining.
[INFO]
[INFO] --- maven-invoker-plugin:3.1.0:verify (integration-test) @ maven-javadoc-plugin ---
[INFO] -------------------------------------------------
[INFO] Build Summary:
[INFO] Passed: 60, Failed: 0, Errors: 0, Skipped: 1
[INFO] -------------------------------------------------
[INFO] ------------------------------------------------------------------------
[INFO] BUILD SUCCESS
[INFO] ------------------------------------------------------------------------
[INFO] Total time: 17:59 min
[INFO] Finished at: 2019-03-16T03:34:42Z
[INFO] Final Memory: 51M/177M
[INFO] ------------------------------------------------------------------------
[INFO] [jenkins-event-spy] Generated F:\jenkins\jenkins-slave\workspace\aven-javadoc-plugin_MJAVADOC-568@2@tmp\withMaven95584861\maven-spy-20190316-031643-214347542530846822990.log
[Pipeline] }
[Pipeline] // dir
[Pipeline] }
[withMaven] artifactsPublisher - Archive artifact windows-jdk11-m3.5.x_build\pom.xml under org\apache\maven\plugins\maven-javadoc-plugin\3.1.0-SNAPSHOT\maven-javadoc-plugin-3.1.0-SNAPSHOT.pom
[withMaven] artifactsPublisher - Archive artifact windows-jdk11-m3.5.x_build\target\maven-javadoc-plugin-3.1.0-SNAPSHOT.jar under org\apache\maven\plugins\maven-javadoc-plugin\3.1.0-SNAPSHOT\maven-javadoc-plugin-3.1.0-SNAPSHOT.jar
[Fast Archiver] Compressed 487.17 KB of artifacts by 52.5% relative to #3
[withMaven] junitPublisher - Archive test results for Maven artifact org.apache.maven.plugins:maven-javadoc-plugin:maven-plugin:3.1.0-SNAPSHOT generated by maven-surefire-plugin:test (default-test): windows-jdk11-m3.5.x_build\target\surefire-reports\*.xml
Recording test results
[withMaven] openTasksPublisher - Scan Tasks for Maven artifact org.apache.maven.plugins:maven-javadoc-plugin:maven-plugin:3.1.0-SNAPSHOT in source directory windows-jdk11-m3.5.x_build\src\main\java
[TASKS] Scanning folder 'f:\jenkins\jenkins-slave\workspace\aven-javadoc-plugin_MJAVADOC-568@2' for files matching the pattern 'windows-jdk11-m3.5.x_build\src\main\java\**\*' - excludes: null
[TASKS] Found 26 files to scan for tasks
[TASKS] Found 7 open tasks.
Skipping warnings blame since pipelines do not have an SCM link.%n
[TASKS] Computing warning deltas based on reference build #3
[withMaven] invokerPublisher - Archive invoker results for Maven artifact MavenArtifact{org.apache.maven.plugins:maven-javadoc-plugin:maven-plugin:3.1.0-SNAPSHOT(version: 3.1.0-SNAPSHOT, snapshot:false) } generated by PluginInvocation{org.apache.maven.plugins:maven-invoker-plugin:3.1.0@integration-test integration-test}: windows-jdk11-m3.5.x_build\target\invoker-reports\*.xml
[INFO] run post-build script verify.groovy
[INFO] MJAVADOC-495_offline-filescheme\pom.xml .......... SUCCESS (20.4 s)
[INFO] Building: MJAVADOC-497\pom.xml
[INFO] run post-build script verify.bsh
[INFO] MJAVADOC-497\pom.xml ............................. SUCCESS (11.0 s)
[INFO] Building: MJAVADOC-498_aggr_modulepath\pom.xml
[withMaven] Publishers: Generated Artifacts Publisher: 218 ms, Junit Publisher: 537 ms, Open Task Scanner Publisher: 556 ms, Dependencies Fingerprint Publisher: 1 ms, Invoker Publisher: 39829 ms, Pipeline Graph Publisher: 1 ms
[Pipeline] // withMaven
[Pipeline] cleanWs
[WS-CLEANUP] Deleting project workspace...
[WS-CLEANUP] Deferred wipeout is used...
[WS-CLEANUP] done
[Pipeline] }
[Pipeline] // stage
[Pipeline] }
[Pipeline] // ws
[Pipeline] }
[Pipeline] // node
[Pipeline] }
[INFO] MJAVADOC-498_aggr_modulepath\pom.xml ............. SUCCESS (25.8 s)
[INFO] Building: MJAVADOC-498_mm_modulepath\pom.xml
[INFO] MJAVADOC-498_mm_modulepath\pom.xml ............... SUCCESS (13.6 s)
[INFO] Building: MJAVADOC-498_modulepath\pom.xml
[INFO] run post-build script verify.groovy
[INFO] MJAVADOC-498_modulepath\pom.xml .................. SUCCESS (15.1 s)
[INFO] Building: MJAVADOC-506_excl-module-info\pom.xml
[INFO] run post-build script verify.groovy
[INFO] MJAVADOC-506_excl-module-info\pom.xml ............ SUCCESS (11.1 s)
[INFO] Building: MJAVADOC-508\pom.xml
[INFO] MJAVADOC-508\pom.xml ............................. SUCCESS (7.9 s)
[INFO] Building: MJAVADOC-514_3rdparty-doclettags\pom.xml
[INFO] MJAVADOC-514_3rdparty-doclettags\pom.xml ......... SUCCESS (8.3 s)
[INFO] Building: MJAVADOC-526_aggr-managedDeps\pom.xml
[INFO] MJAVADOC-526_aggr-managedDeps\pom.xml ............ SUCCESS (11.1 s)
[INFO] Building: MJAVADOC-528\pom.xml
[INFO] run post-build script verify.groovy
[INFO] MJAVADOC-528\pom.xml ............................. SUCCESS (9.5 s)
[INFO] Building: MJAVADOC-538\pom.xml
[INFO] MJAVADOC-538\pom.xml ............................. SUCCESS (8.9 s)
[INFO] Building: MJAVADOC-551 spaces\pom.xml
[INFO] MJAVADOC-551 spaces\pom.xml ...................... SUCCESS (8.6 s)
[INFO] Building: MJAVADOC-552_fix-author\pom.xml
[INFO] run post-build script verify.groovy
[INFO] MJAVADOC-552_fix-author\pom.xml .................. SUCCESS (11.6 s)
[INFO] Building: MJAVADOC-555_aggr_mixed\pom.xml
[INFO] run post-build script verify.groovy
[INFO] MJAVADOC-555_aggr_mixed\pom.xml .................. SUCCESS (12.4 s)
[INFO] Building: MJAVADOC-555_link-automatic-modules\pom.xml
[INFO] run post-build script verify.groovy
[INFO] MJAVADOC-555_link-automatic-modules\pom.xml ...... SUCCESS (16.1 s)
[INFO] Building: MJAVADOC-556_hide-non-exported-packages\pom.xml
[INFO] MJAVADOC-556_hide-non-exported-packages\pom.xml .. SUCCESS (12.1 s)
[INFO] Building: MJAVADOC-558_fix-unknownthrows\pom.xml
[INFO] run post-build script verify.groovy
[INFO] MJAVADOC-558_fix-unknownthrows\pom.xml ........... SUCCESS (11.6 s)
[INFO] Building: MJAVADOC-562_release\pom.xml
[INFO] MJAVADOC-562_release\pom.xml ..................... SUCCESS (14.6 s)
[INFO] Building: MJAVADOC-567_aggr-mixed\pom.xml
[INFO] run post-build script verify.groovy
[INFO] MJAVADOC-567_aggr-mixed\pom.xml .................. SUCCESS (8.7 s)
[INFO] Building: MJAVADOC-568_export-to-testcase\pom.xml
[INFO] MJAVADOC-568_export-to-testcase\pom.xml .......... SUCCESS (21.8 s)
[INFO] Building: MJAVADOC-568_jar-mixed\pom.xml
[INFO] MJAVADOC-568_jar-mixed\pom.xml ................... SUCCESS (17.1 s)
[INFO] Building: MJAVADOC-568_manifest-splitpackage\pom.xml
[INFO] MJAVADOC-568_manifest-splitpackage\pom.xml ....... SUCCESS (19.2 s)
[INFO] Building: MJAVADOC-569_aggr-mixed\pom.xml
[INFO] MJAVADOC-569_aggr-mixed\pom.xml .................. SUCCESS (17.8 s)
[INFO] Building: MJAVADOC-575_source8-module-info\pom.xml
[INFO] run post-build script verify.groovy
[INFO] MJAVADOC-575_source8-module-info\pom.xml ......... SUCCESS (10.6 s)
[INFO] Building: site-failOnError\pom.xml
[INFO] site-failOnError\pom.xml ......................... SUCCESS (13.0 s)
[INFO]
[INFO] --- mrm-maven-plugin:1.1.0:stop (repository) @ maven-javadoc-plugin ---
[INFO] Stopping Mock Repository Manager on http://localhost:51615
[INFO] Stopped SocketConnector@0.0.0.0:51615
[INFO] Mock Repository Manager http://localhost:51615 is stopped.
[INFO]
[INFO] --- mrm-maven-plugin:1.1.0:stop (3rdparty) @ maven-javadoc-plugin ---
[INFO] Stopping Mock Repository Manager on http://localhost:51616
[INFO] Stopped SocketConnector@0.0.0.0:51616
[INFO] Mock Repository Manager http://localhost:51616 is stopped.
[INFO]
[INFO] --- maven-checkstyle-plugin:3.0.0:check (checkstyle-check) @ maven-javadoc-plugin ---
[INFO] There are 4 errors reported by Checkstyle 6.18 with config/maven_checks.xml ruleset.
[INFO] Ignored 4 errors, 0 violation remaining.
[INFO]
[INFO] --- maven-invoker-plugin:3.1.0:verify (integration-test) @ maven-javadoc-plugin ---
[INFO] -------------------------------------------------
[INFO] Build Summary:
[INFO] Passed: 59, Failed: 0, Errors: 0, Skipped: 2
[INFO] -------------------------------------------------
[INFO] ------------------------------------------------------------------------
[INFO] BUILD SUCCESS
[INFO] ------------------------------------------------------------------------
[INFO] Total time: 18:36 min
[INFO] Finished at: 2019-03-16T03:40:15Z
[INFO] Final Memory: 54M/184M
[INFO] ------------------------------------------------------------------------
[INFO] [jenkins-event-spy] Generated F:\jenkins\jenkins-slave\workspace\aven-javadoc-plugin_MJAVADOC-568@2@tmp\withMavenc483e62b\maven-spy-20190316-032138-12315020565896805255994.log
[Pipeline] }
[Pipeline] // dir
[Pipeline] }
[withMaven] artifactsPublisher - Archive artifact windows-jdk12-m3.5.x_build\pom.xml under org\apache\maven\plugins\maven-javadoc-plugin\3.1.0-SNAPSHOT\maven-javadoc-plugin-3.1.0-SNAPSHOT.pom
[withMaven] artifactsPublisher - Archive artifact windows-jdk12-m3.5.x_build\target\maven-javadoc-plugin-3.1.0-SNAPSHOT.jar under org\apache\maven\plugins\maven-javadoc-plugin\3.1.0-SNAPSHOT\maven-javadoc-plugin-3.1.0-SNAPSHOT.jar
[Fast Archiver] Compressed 487.17 KB of artifacts by 52.5% relative to #3
[withMaven] junitPublisher - Archive test results for Maven artifact org.apache.maven.plugins:maven-javadoc-plugin:maven-plugin:3.1.0-SNAPSHOT generated by maven-surefire-plugin:test (default-test): windows-jdk12-m3.5.x_build\target\surefire-reports\*.xml
Recording test results
[withMaven] openTasksPublisher - Scan Tasks for Maven artifact org.apache.maven.plugins:maven-javadoc-plugin:maven-plugin:3.1.0-SNAPSHOT in source directory windows-jdk12-m3.5.x_build\src\main\java
[TASKS] Scanning folder 'f:\jenkins\jenkins-slave\workspace\aven-javadoc-plugin_MJAVADOC-568@2' for files matching the pattern 'windows-jdk12-m3.5.x_build\src\main\java\**\*' - excludes: null
[TASKS] Found 26 files to scan for tasks
[TASKS] Found 7 open tasks.
Skipping warnings blame since pipelines do not have an SCM link.%n
[TASKS] Computing warning deltas based on reference build #3
[withMaven] invokerPublisher - Archive invoker results for Maven artifact MavenArtifact{org.apache.maven.plugins:maven-javadoc-plugin:maven-plugin:3.1.0-SNAPSHOT(version: 3.1.0-SNAPSHOT, snapshot:false) } generated by PluginInvocation{org.apache.maven.plugins:maven-invoker-plugin:3.1.0@integration-test integration-test}: windows-jdk12-m3.5.x_build\target\invoker-reports\*.xml
[withMaven] Publishers: Generated Artifacts Publisher: 224 ms, Junit Publisher: 582 ms, Open Task Scanner Publisher: 308 ms, Invoker Publisher: 44558 ms, Pipeline Graph Publisher: 1 ms
[Pipeline] // withMaven
[Pipeline] cleanWs
[WS-CLEANUP] Deleting project workspace...
[WS-CLEANUP] Deferred wipeout is used...
[WS-CLEANUP] done
[Pipeline] }
[Pipeline] // stage
[Pipeline] }
[Pipeline] // ws
[Pipeline] }
[Pipeline] // node
[Pipeline] }
[Pipeline] // parallel
[Pipeline] stage
[Pipeline] { (Notifications)
[Pipeline] echo
Build result: UNSTABLE
[Pipeline] jiraIssueSelector
[Pipeline] emailext