You are viewing a plain text version of this content. The canonical link for it is here.
Posted to dev@zookeeper.apache.org by Apache Jenkins Server <je...@builds.apache.org> on 2016/05/02 22:50:54 UTC
ZooKeeper-trunk-solaris - Build # 1143 - Still Failing
See https://builds.apache.org/job/ZooKeeper-trunk-solaris/1143/
###################################################################################
########################## LAST 60 LINES OF THE CONSOLE ###########################
[...truncated 349764 lines...]
[junit] 2016-05-02 20:42:43,134 [myid:] - INFO [NIOWorkerThread-2:ZooKeeperServer@964] - Client attempting to establish new session at /127.0.0.1:45632
[junit] 2016-05-02 20:42:43,137 [myid:] - INFO [SyncThread:0:FileTxnLog@204] - Creating new log file: log.1
[junit] 2016-05-02 20:42:43,148 [myid:] - INFO [SyncThread:0:ZooKeeperServer@678] - Established session 0x120f032fcae0000 with negotiated timeout 30000 for client /127.0.0.1:45632
[junit] 2016-05-02 20:42:43,149 [myid:127.0.0.1:11222] - INFO [main-SendThread(127.0.0.1:11222):ClientCnxn$SendThread@1381] - Session establishment complete on server null, sessionid = 0x120f032fcae0000, negotiated timeout = 30000
[junit] 2016-05-02 20:42:43,154 [myid:] - INFO [main:JMXEnv@117] - expect:0x120f032fcae0000
[junit] 2016-05-02 20:42:43,154 [myid:] - INFO [main:JMXEnv@120] - found:0x120f032fcae0000 org.apache.ZooKeeperService:name0=StandaloneServer_port11222,name1=Connections,name2=127.0.0.1,name3=0x120f032fcae0000
[junit] 2016-05-02 20:42:43,333 [myid:] - INFO [main:ClientBase@507] - STOPPING server
[junit] 2016-05-02 20:42:43,334 [myid:] - INFO [ConnnectionExpirer:NIOServerCnxnFactory$ConnectionExpirerThread@583] - ConnnectionExpirerThread interrupted
[junit] 2016-05-02 20:42:43,334 [myid:] - INFO [NIOServerCxnFactory.SelectorThread-0:MBeanRegistry@128] - Unregister MBean [org.apache.ZooKeeperService:name0=StandaloneServer_port11222,name1=Connections,name2=127.0.0.1,name3=0x120f032fcae0000]
[junit] 2016-05-02 20:42:43,335 [myid:] - INFO [NIOServerCxnFactory.SelectorThread-0:NIOServerCnxn@607] - Closed socket connection for client /127.0.0.1:45632 which had sessionid 0x120f032fcae0000
[junit] 2016-05-02 20:42:43,335 [myid:] - INFO [NIOServerCxnFactory.SelectorThread-1:NIOServerCnxnFactory$SelectorThread@420] - selector thread exitted run method
[junit] 2016-05-02 20:42:43,335 [myid:] - INFO [NIOServerCxnFactory.AcceptThread:0.0.0.0/0.0.0.0:11222:NIOServerCnxnFactory$AcceptThread@219] - accept thread exitted run method
[junit] 2016-05-02 20:42:43,335 [myid:127.0.0.1:11222] - INFO [main-SendThread(127.0.0.1:11222):ClientCnxn$SendThread@1231] - Unable to read additional data from server sessionid 0x120f032fcae0000, likely server has closed socket, closing socket connection and attempting reconnect
[junit] 2016-05-02 20:42:43,336 [myid:] - INFO [NIOServerCxnFactory.SelectorThread-0:NIOServerCnxnFactory$SelectorThread@420] - selector thread exitted run method
[junit] 2016-05-02 20:42:43,336 [myid:] - INFO [main:ZooKeeperServer@498] - shutting down
[junit] 2016-05-02 20:42:43,336 [myid:] - INFO [main:SessionTrackerImpl@232] - Shutting down
[junit] 2016-05-02 20:42:43,336 [myid:] - INFO [main:PrepRequestProcessor@965] - Shutting down
[junit] 2016-05-02 20:42:43,336 [myid:] - INFO [main:SyncRequestProcessor@191] - Shutting down
[junit] 2016-05-02 20:42:43,336 [myid:] - INFO [ProcessThread(sid:0 cport:11222)::PrepRequestProcessor@154] - PrepRequestProcessor exited loop!
[junit] 2016-05-02 20:42:43,337 [myid:] - INFO [SyncThread:0:SyncRequestProcessor@169] - SyncRequestProcessor exited!
[junit] 2016-05-02 20:42:43,337 [myid:] - INFO [main:FinalRequestProcessor@479] - shutdown of request processor complete
[junit] 2016-05-02 20:42:43,337 [myid:] - INFO [main:MBeanRegistry@128] - Unregister MBean [org.apache.ZooKeeperService:name0=StandaloneServer_port11222,name1=InMemoryDataTree]
[junit] 2016-05-02 20:42:43,337 [myid:] - INFO [main:MBeanRegistry@128] - Unregister MBean [org.apache.ZooKeeperService:name0=StandaloneServer_port11222]
[junit] 2016-05-02 20:42:43,338 [myid:] - INFO [main:FourLetterWordMain@85] - connecting to 127.0.0.1 11222
[junit] 2016-05-02 20:42:43,338 [myid:] - INFO [main:JMXEnv@146] - ensureOnly:[]
[junit] 2016-05-02 20:42:43,339 [myid:] - INFO [main:ClientBase@460] - STARTING server
[junit] 2016-05-02 20:42:43,339 [myid:] - INFO [main:ClientBase@380] - CREATING server instance 127.0.0.1:11222
[junit] 2016-05-02 20:42:43,340 [myid:] - INFO [main:NIOServerCnxnFactory@673] - Configuring NIO connection handler with 10s sessionless connection timeout, 2 selector thread(s), 16 worker threads, and 64 kB direct buffers.
[junit] 2016-05-02 20:42:43,340 [myid:] - INFO [main:NIOServerCnxnFactory@686] - binding to port 0.0.0.0/0.0.0.0:11222
[junit] 2016-05-02 20:42:43,340 [myid:] - INFO [main:ClientBase@355] - STARTING server instance 127.0.0.1:11222
[junit] 2016-05-02 20:42:43,341 [myid:] - INFO [main:ZooKeeperServer@858] - minSessionTimeout set to 6000
[junit] 2016-05-02 20:42:43,341 [myid:] - INFO [main:ZooKeeperServer@867] - maxSessionTimeout set to 60000
[junit] 2016-05-02 20:42:43,341 [myid:] - INFO [main:ZooKeeperServer@156] - Created server with tickTime 3000 minSessionTimeout 6000 maxSessionTimeout 60000 datadir /zonestorage/hudson_solaris/home/hudson/hudson-slave/workspace/ZooKeeper-trunk-solaris/trunk/build/test/tmp/test8796105425231796840.junit.dir/version-2 snapdir /zonestorage/hudson_solaris/home/hudson/hudson-slave/workspace/ZooKeeper-trunk-solaris/trunk/build/test/tmp/test8796105425231796840.junit.dir/version-2
[junit] 2016-05-02 20:42:43,342 [myid:] - INFO [main:FileSnap@83] - Reading snapshot /zonestorage/hudson_solaris/home/hudson/hudson-slave/workspace/ZooKeeper-trunk-solaris/trunk/build/test/tmp/test8796105425231796840.junit.dir/version-2/snapshot.0
[junit] 2016-05-02 20:42:43,345 [myid:] - INFO [main:FileTxnSnapLog@298] - Snapshotting: 0xb to /zonestorage/hudson_solaris/home/hudson/hudson-slave/workspace/ZooKeeper-trunk-solaris/trunk/build/test/tmp/test8796105425231796840.junit.dir/version-2/snapshot.b
[junit] 2016-05-02 20:42:43,346 [myid:] - INFO [main:FourLetterWordMain@85] - connecting to 127.0.0.1 11222
[junit] 2016-05-02 20:42:43,346 [myid:] - INFO [NIOServerCxnFactory.AcceptThread:0.0.0.0/0.0.0.0:11222:NIOServerCnxnFactory$AcceptThread@296] - Accepted socket connection from /127.0.0.1:45634
[junit] 2016-05-02 20:42:43,347 [myid:] - INFO [NIOWorkerThread-1:NIOServerCnxn@485] - Processing stat command from /127.0.0.1:45634
[junit] 2016-05-02 20:42:43,347 [myid:] - INFO [NIOWorkerThread-1:StatCommand@49] - Stat command output
[junit] 2016-05-02 20:42:43,348 [myid:] - INFO [NIOWorkerThread-1:NIOServerCnxn@607] - Closed socket connection for client /127.0.0.1:45634 (no session established for client)
[junit] 2016-05-02 20:42:43,348 [myid:] - INFO [main:JMXEnv@228] - ensureParent:[InMemoryDataTree, StandaloneServer_port]
[junit] 2016-05-02 20:42:43,349 [myid:] - INFO [main:JMXEnv@245] - expect:InMemoryDataTree
[junit] 2016-05-02 20:42:43,349 [myid:] - INFO [main:JMXEnv@249] - found:InMemoryDataTree org.apache.ZooKeeperService:name0=StandaloneServer_port11222,name1=InMemoryDataTree
[junit] 2016-05-02 20:42:43,349 [myid:] - INFO [main:JMXEnv@245] - expect:StandaloneServer_port
[junit] 2016-05-02 20:42:43,349 [myid:] - INFO [main:JMXEnv@249] - found:StandaloneServer_port org.apache.ZooKeeperService:name0=StandaloneServer_port11222
[junit] 2016-05-02 20:42:43,350 [myid:] - INFO [main:ClientBase@507] - STOPPING server
[junit] 2016-05-02 20:42:43,350 [myid:] - INFO [ConnnectionExpirer:NIOServerCnxnFactory$ConnectionExpirerThread@583] - ConnnectionExpirerThread interrupted
[junit] 2016-05-02 20:42:43,350 [myid:] - INFO [NIOServerCxnFactory.SelectorThread-1:NIOServerCnxnFactory
BUILD FAILED
/zonestorage/hudson_solaris/home/hudson/hudson-slave/workspace/ZooKeeper-trunk-solaris/trunk/build.xml:1233: Tests failed!
Total time: 103 minutes 25 seconds
Build step 'Invoke Ant' marked build as failure
[locks-and-latches] Releasing all the locks
[locks-and-latches] All the locks released
Recording test results
Email was triggered for: Failure - Any
Sending email for trigger: Failure - Any
###################################################################################
############################## FAILED TESTS (if any) ##############################
12 tests failed.
FAILED: org.apache.zookeeper.test.FLEZeroWeightTest.testZeroWeightQuorum
Error Message:
Threads didn't join
Stack Trace:
junit.framework.AssertionFailedError: Threads didn't join
at org.apache.zookeeper.test.FLEZeroWeightTest.testZeroWeightQuorum(FLEZeroWeightTest.java:167)
at org.apache.zookeeper.JUnit4ZKTestRunner$LoggedInvokeMethod.evaluate(JUnit4ZKTestRunner.java:79)
FAILED: org.apache.zookeeper.test.ChrootClientTest.testClientCleanup
Error Message:
null
Stack Trace:
junit.framework.AssertionFailedError
at org.apache.zookeeper.test.ClientTest.testClientCleanup(ClientTest.java:808)
at org.apache.zookeeper.JUnit4ZKTestRunner$LoggedInvokeMethod.evaluate(JUnit4ZKTestRunner.java:79)
FAILED: org.apache.zookeeper.test.WatcherTest.testWatcherAutoResetDisabledWithGlobal
Error Message:
Did not connect
Stack Trace:
java.util.concurrent.TimeoutException: Did not connect
at org.apache.zookeeper.test.ClientBase$CountdownWatcher.waitForConnected(ClientBase.java:132)
at org.apache.zookeeper.test.WatcherTest.testWatcherAutoReset(WatcherTest.java:283)
at org.apache.zookeeper.test.WatcherTest.testWatcherAutoResetWithGlobal(WatcherTest.java:231)
at org.apache.zookeeper.test.WatcherTest.testWatcherAutoResetDisabledWithGlobal(WatcherTest.java:250)
at org.apache.zookeeper.JUnit4ZKTestRunner$LoggedInvokeMethod.evaluate(JUnit4ZKTestRunner.java:79)
FAILED: org.apache.zookeeper.test.WatcherTest.testWatcherAutoResetWithLocal
Error Message:
Unable to connect to server
Stack Trace:
junit.framework.AssertionFailedError: Unable to connect to server
at org.apache.zookeeper.test.ClientBase.createClient(ClientBase.java:188)
at org.apache.zookeeper.test.WatcherTest.testWatcherAutoResetWithLocal(WatcherTest.java:239)
at org.apache.zookeeper.JUnit4ZKTestRunner$LoggedInvokeMethod.evaluate(JUnit4ZKTestRunner.java:79)
FAILED: org.apache.zookeeper.test.QuorumQuotaTest.testQuotaWithQuorum
Error Message:
waiting for server up
Stack Trace:
junit.framework.AssertionFailedError: waiting for server up
at org.apache.zookeeper.test.QuorumBase.startServers(QuorumBase.java:223)
at org.apache.zookeeper.test.QuorumBase.setUp(QuorumBase.java:120)
at org.apache.zookeeper.test.QuorumBase.setUp(QuorumBase.java:78)
FAILED: org.apache.zookeeper.test.QuorumQuotaTest.testNull
Error Message:
waiting for server up
Stack Trace:
junit.framework.AssertionFailedError: waiting for server up
at org.apache.zookeeper.test.QuorumBase.startServers(QuorumBase.java:223)
at org.apache.zookeeper.test.QuorumBase.setUp(QuorumBase.java:120)
at org.apache.zookeeper.test.QuorumBase.setUp(QuorumBase.java:78)
FAILED: org.apache.zookeeper.test.QuorumTest.testSequentialNodeNames
Error Message:
waiting for server up
Stack Trace:
junit.framework.AssertionFailedError: waiting for server up
at org.apache.zookeeper.test.QuorumBase.startServers(QuorumBase.java:223)
at org.apache.zookeeper.test.QuorumBase.setUp(QuorumBase.java:120)
at org.apache.zookeeper.test.QuorumBase.setUp(QuorumBase.java:78)
at org.apache.zookeeper.test.QuorumTest.setUp(QuorumTest.java:60)
FAILED: org.apache.zookeeper.test.QuorumZxidSyncTest.testLateLogs
Error Message:
waiting for server up
Stack Trace:
junit.framework.AssertionFailedError: waiting for server up
at org.apache.zookeeper.test.QuorumBase.startServers(QuorumBase.java:223)
at org.apache.zookeeper.test.QuorumBase.startServers(QuorumBase.java:132)
at org.apache.zookeeper.test.QuorumZxidSyncTest.testLateLogs(QuorumZxidSyncTest.java:119)
at org.apache.zookeeper.JUnit4ZKTestRunner$LoggedInvokeMethod.evaluate(JUnit4ZKTestRunner.java:79)
FAILED: org.apache.zookeeper.test.ReconfigTest.testRemoveAddTwo
Error Message:
waiting for server up
Stack Trace:
junit.framework.AssertionFailedError: waiting for server up
at org.apache.zookeeper.test.QuorumUtil.startAll(QuorumUtil.java:151)
at org.apache.zookeeper.test.ReconfigTest.testRemoveAddTwo(ReconfigTest.java:277)
at org.apache.zookeeper.JUnit4ZKTestRunner$LoggedInvokeMethod.evaluate(JUnit4ZKTestRunner.java:79)
FAILED: org.apache.zookeeper.test.SessionUpgradeTest.testUpgradeWithEphemeralOnLeader
Error Message:
Timeout occurred. Please note the time in the report does not reflect the time until the timeout.
Stack Trace:
junit.framework.AssertionFailedError: Timeout occurred. Please note the time in the report does not reflect the time until the timeout.
FAILED: org.apache.zookeeper.test.LETest.testLE
Error Message:
Threads didn't join
Stack Trace:
junit.framework.AssertionFailedError: Threads didn't join
at org.apache.zookeeper.test.LETest.testLE(LETest.java:123)
at org.apache.zookeeper.JUnit4ZKTestRunner$LoggedInvokeMethod.evaluate(JUnit4ZKTestRunner.java:79)
FAILED: org.apache.zookeeper.test.QuorumZxidSyncTest.testBehindLeader
Error Message:
waiting for server up
Stack Trace:
junit.framework.AssertionFailedError: waiting for server up
at org.apache.zookeeper.test.QuorumBase.startServers(QuorumBase.java:223)
at org.apache.zookeeper.test.QuorumBase.startServers(QuorumBase.java:132)
at org.apache.zookeeper.test.QuorumZxidSyncTest.testBehindLeader(QuorumZxidSyncTest.java:56)
at org.apache.zookeeper.JUnit4ZKTestRunner$LoggedInvokeMethod.evaluate(JUnit4ZKTestRunner.java:79)