You are viewing a plain text version of this content. The canonical link for it is here.
Posted to dev@brooklyn.apache.org by Apache Jenkins Server <je...@builds.apache.org> on 2025/01/21 14:49:28 UTC

Build failed in Jenkins: Brooklyn » Brooklyn » master #971

See <https://ci-builds.apache.org/job/Brooklyn/job/brooklyn/job/master/971/display/redirect>

Changes:


------------------------------------------
Started by upstream project "Brooklyn/brooklyn-ui/master" build number 302
originally caused by:
 Push event to branch master
Connecting to https://api.github.com using This is to connect to Brooklyn repos on GitHub
Obtained Jenkinsfile from 4f253ccf3ab63870c04c6a0386122de77c904908
[Pipeline] Start of Pipeline
[Pipeline] node
Still waiting to schedule task
Waiting for next available executor on ‘ubuntu’
Running on builds42 in /home/jenkins/workspace/Brooklyn_brooklyn_master
[Pipeline] {
[Pipeline] properties
[Pipeline] catchError
[Pipeline] {
[Pipeline] withEnv
[Pipeline] {
[Pipeline] stage
[Pipeline] { (Clone repository)
[Pipeline] checkout
The recommended git tool is: NONE
using credential Read only (Brooklyn repos)
Cloning the remote Git repository
Cloning with configured refspecs honoured and without tags
Cloning repository https://github.com/apache/brooklyn.git
 > git init /home/jenkins/workspace/Brooklyn_brooklyn_master # timeout=10
Avoid second fetch
Checking out Revision 4f253ccf3ab63870c04c6a0386122de77c904908 (master)
Fetching upstream changes from https://github.com/apache/brooklyn.git
 > git --version # timeout=10
 > git --version # 'git version 2.34.1'
using GIT_ASKPASS to set credentials This is to connect to Brooklyn repos on GitHub
 > git fetch --no-tags --force --progress -- https://github.com/apache/brooklyn.git +refs/heads/master:refs/remotes/origin/master # timeout=10
 > git config remote.origin.url https://github.com/apache/brooklyn.git # timeout=10
 > git config --add remote.origin.fetch +refs/heads/master:refs/remotes/origin/master # timeout=10
Commit message: "Merge pull request #59 from iuliana/upgrade-go"
 > git config core.sparsecheckout # timeout=10
 > git checkout -f 4f253ccf3ab63870c04c6a0386122de77c904908 # timeout=10
 > git rev-list --no-walk 4f253ccf3ab63870c04c6a0386122de77c904908 # timeout=10
[Pipeline] }
[Pipeline] // stage
[Pipeline] stage
[Pipeline] { (Prepare environment)
[Pipeline] echo
Creating maven cache ...
[Pipeline] sh
+ mkdir -p /home/jenkins/workspace/Brooklyn_brooklyn_master/.m2
[Pipeline] sh
+ git submodule init
Submodule 'brooklyn-client' (https://github.com/apache/brooklyn-client.git) registered for path 'brooklyn-client'
Submodule 'brooklyn-dist' (https://github.com/apache/brooklyn-dist.git) registered for path 'brooklyn-dist'
Submodule 'brooklyn-docs' (https://github.com/apache/brooklyn-docs.git) registered for path 'brooklyn-docs'
Submodule 'brooklyn-library' (https://github.com/apache/brooklyn-library.git) registered for path 'brooklyn-library'
Submodule 'brooklyn-server' (https://github.com/apache/brooklyn-server.git) registered for path 'brooklyn-server'
Submodule 'brooklyn-ui' (https://github.com/apache/brooklyn-ui.git) registered for path 'brooklyn-ui'
[Pipeline] sh
+ git submodule update --remote --merge --recursive
Cloning into '/home/jenkins/workspace/Brooklyn_brooklyn_master/brooklyn-client'...
Cloning into '/home/jenkins/workspace/Brooklyn_brooklyn_master/brooklyn-dist'...
Cloning into '/home/jenkins/workspace/Brooklyn_brooklyn_master/brooklyn-docs'...
Cloning into '/home/jenkins/workspace/Brooklyn_brooklyn_master/brooklyn-library'...
Cloning into '/home/jenkins/workspace/Brooklyn_brooklyn_master/brooklyn-server'...
Cloning into '/home/jenkins/workspace/Brooklyn_brooklyn_master/brooklyn-ui'...
Submodule path 'brooklyn-client': checked out 'caa1d227667cb660c2d811c27992a3bef8a42487'
Submodule path 'brooklyn-dist': checked out 'ab633298a19e656da84eab461ff5fd96de7aaae0'
Submodule path 'brooklyn-docs': checked out '8c68c94d3a5deb4dcbce029b18eadc27db38f1f3'
Submodule path 'brooklyn-library': checked out '61381901be0334dcea6e1fe1367bd0941a3f775b'
Submodule path 'brooklyn-server': checked out 'ce769fafb4491e9d414a86d99ecaf44f7b24e8a7'
Submodule path 'brooklyn-ui': checked out '8619c01143a6485727df05e02116b0818ed9da12'
[Pipeline] sh
+ docker logout
Removing login credentials for https://index.docker.io/v1/
[Pipeline] echo
Building docker image for test environment ...
[Pipeline] echo
Using docker tag DOCKER_TAG=jenkins-Brooklyn-brooklyn-master-971
[Pipeline] isUnix
[Pipeline] withEnv
[Pipeline] {
[Pipeline] sh
+ docker build -t brooklyn:jenkins-Brooklyn-brooklyn-master-971 .
#0 building with "default" instance using docker driver

#1 [internal] load build definition from Dockerfile
#1 transferring dockerfile:
#1 transferring dockerfile: 2.68kB done
#1 DONE 0.5s

#2 [internal] load metadata for docker.io/library/maven:3.9.4-amazoncorretto-8-debian
#2 DONE 2.8s

#3 [internal] load .dockerignore
#3 transferring context:
#3 transferring context: 2B done
#3 DONE 0.5s

#4 [1/9] FROM docker.io/library/maven:3.9.4-amazoncorretto-8-debian@sha256:cc7338960617eb0612de6bababdcda1d407e8240078fae56814811a7d886d64f
#4 resolve docker.io/library/maven:3.9.4-amazoncorretto-8-debian@sha256:cc7338960617eb0612de6bababdcda1d407e8240078fae56814811a7d886d64f
#4 resolve docker.io/library/maven:3.9.4-amazoncorretto-8-debian@sha256:cc7338960617eb0612de6bababdcda1d407e8240078fae56814811a7d886d64f 0.5s done
#4 sha256:cc7338960617eb0612de6bababdcda1d407e8240078fae56814811a7d886d64f 549B / 549B done
#4 sha256:c676ff1421307fc84232099d8d7fc913be7509ca565602114c23729042559355 1.57kB / 1.57kB done
#4 sha256:830828800aef05389f229b19e4d7be48b835dd7e7701fa4489502082639ca276 3.36kB / 3.36kB done
#4 sha256:a378f10b321842c3042cdeff4f6997f34f4cb21f2eff27704b7f6193ab7b5fea 0B / 29.15MB 0.3s
#4 sha256:a378f10b321842c3042cdeff4f6997f34f4cb21f2eff27704b7f6193ab7b5fea 3.15MB / 29.15MB 0.4s
#4 sha256:30678e68f52f98e4e1d273c546c73f46bb191004a8a75f5290de822b5de7cef2 0B / 121.93MB 0.4s
#4 sha256:a378f10b321842c3042cdeff4f6997f34f4cb21f2eff27704b7f6193ab7b5fea 17.83MB / 29.15MB 0.6s
#4 sha256:8986d925bf9361d36eaefc79931a0971d25a144d0548fb9ce1444b82736e4dd3 0B / 9.41MB 0.6s
#4 sha256:a378f10b321842c3042cdeff4f6997f34f4cb21f2eff27704b7f6193ab7b5fea 26.21MB / 29.15MB 0.7s
#4 sha256:30678e68f52f98e4e1d273c546c73f46bb191004a8a75f5290de822b5de7cef2 6.29MB / 121.93MB 0.7s
#4 sha256:a378f10b321842c3042cdeff4f6997f34f4cb21f2eff27704b7f6193ab7b5fea 29.15MB / 29.15MB 0.8s
#4 sha256:30678e68f52f98e4e1d273c546c73f46bb191004a8a75f5290de822b5de7cef2 12.58MB / 121.93MB 0.8s
#4 sha256:30678e68f52f98e4e1d273c546c73f46bb191004a8a75f5290de822b5de7cef2 26.21MB / 121.93MB 1.0s
#4 sha256:8986d925bf9361d36eaefc79931a0971d25a144d0548fb9ce1444b82736e4dd3 5.24MB / 9.41MB 1.0s
#4 sha256:a378f10b321842c3042cdeff4f6997f34f4cb21f2eff27704b7f6193ab7b5fea 29.15MB / 29.15MB 1.0s done
#4 sha256:30678e68f52f98e4e1d273c546c73f46bb191004a8a75f5290de822b5de7cef2 38.80MB / 121.93MB 1.2s
#4 sha256:8986d925bf9361d36eaefc79931a0971d25a144d0548fb9ce1444b82736e4dd3 9.41MB / 9.41MB 1.2s
#4 sha256:139316f57851914b47e5b0dcec8e5c633b6fff1e44540044429baf3d76920c50 0B / 854B 1.2s
#4 sha256:30678e68f52f98e4e1d273c546c73f46bb191004a8a75f5290de822b5de7cef2 46.14MB / 121.93MB 1.3s
#4 extracting sha256:a378f10b321842c3042cdeff4f6997f34f4cb21f2eff27704b7f6193ab7b5fea 0.1s
#4 sha256:30678e68f52f98e4e1d273c546c73f46bb191004a8a75f5290de822b5de7cef2 52.43MB / 121.93MB 1.4s
#4 sha256:8986d925bf9361d36eaefc79931a0971d25a144d0548fb9ce1444b82736e4dd3 9.41MB / 9.41MB 1.3s done
#4 sha256:30678e68f52f98e4e1d273c546c73f46bb191004a8a75f5290de822b5de7cef2 59.77MB / 121.93MB 1.5s
#4 sha256:139316f57851914b47e5b0dcec8e5c633b6fff1e44540044429baf3d76920c50 854B / 854B 1.4s done
#4 sha256:30678e68f52f98e4e1d273c546c73f46bb191004a8a75f5290de822b5de7cef2 67.11MB / 121.93MB 1.6s
#4 sha256:658b90e7b244b2ee265c559c40ccae269c9639d984e94436c4bf90dbb08ab7f5 0B / 361B 1.6s
#4 sha256:30678e68f52f98e4e1d273c546c73f46bb191004a8a75f5290de822b5de7cef2 81.79MB / 121.93MB 1.8s
#4 sha256:658b90e7b244b2ee265c559c40ccae269c9639d984e94436c4bf90dbb08ab7f5 361B / 361B 1.7s done
#4 sha256:6dc2f7934afaba6705557c44c45318e6a557c4fc17e7f543a887716df6c8f0f8 167B / 167B 1.8s
#4 sha256:30678e68f52f98e4e1d273c546c73f46bb191004a8a75f5290de822b5de7cef2 89.13MB / 121.93MB 1.9s
#4 sha256:6dc2f7934afaba6705557c44c45318e6a557c4fc17e7f543a887716df6c8f0f8 167B / 167B 1.8s done
#4 sha256:30678e68f52f98e4e1d273c546c73f46bb191004a8a75f5290de822b5de7cef2 96.47MB / 121.93MB 2.0s
#4 sha256:30678e68f52f98e4e1d273c546c73f46bb191004a8a75f5290de822b5de7cef2 104.86MB / 121.93MB 2.2s
#4 sha256:30678e68f52f98e4e1d273c546c73f46bb191004a8a75f5290de822b5de7cef2 114.29MB / 121.93MB 2.4s
#4 sha256:30678e68f52f98e4e1d273c546c73f46bb191004a8a75f5290de822b5de7cef2 121.93MB / 121.93MB 2.6s
#4 sha256:30678e68f52f98e4e1d273c546c73f46bb191004a8a75f5290de822b5de7cef2 121.93MB / 121.93MB 3.5s done
#4 extracting sha256:a378f10b321842c3042cdeff4f6997f34f4cb21f2eff27704b7f6193ab7b5fea 2.5s done
#4 extracting sha256:30678e68f52f98e4e1d273c546c73f46bb191004a8a75f5290de822b5de7cef2
#4 extracting sha256:30678e68f52f98e4e1d273c546c73f46bb191004a8a75f5290de822b5de7cef2 3.9s done
#4 extracting sha256:8986d925bf9361d36eaefc79931a0971d25a144d0548fb9ce1444b82736e4dd3
#4 extracting sha256:8986d925bf9361d36eaefc79931a0971d25a144d0548fb9ce1444b82736e4dd3 0.3s done
#4 extracting sha256:139316f57851914b47e5b0dcec8e5c633b6fff1e44540044429baf3d76920c50
#4 extracting sha256:139316f57851914b47e5b0dcec8e5c633b6fff1e44540044429baf3d76920c50 done
#4 extracting sha256:658b90e7b244b2ee265c559c40ccae269c9639d984e94436c4bf90dbb08ab7f5
#4 extracting sha256:658b90e7b244b2ee265c559c40ccae269c9639d984e94436c4bf90dbb08ab7f5 done
#4 extracting sha256:6dc2f7934afaba6705557c44c45318e6a557c4fc17e7f543a887716df6c8f0f8
#4 extracting sha256:6dc2f7934afaba6705557c44c45318e6a557c4fc17e7f543a887716df6c8f0f8 done
#4 DONE 14.6s

#5 [2/9] RUN apt-get update
#5 1.210 Get:1 http://deb.debian.org/debian bookworm InRelease [151 kB]
#5 1.237 Get:2 https://apt.corretto.aws stable InRelease [10.7 kB]
#5 1.291 Get:3 http://deb.debian.org/debian bookworm-updates InRelease [55.4 kB]
#5 1.319 Get:4 http://deb.debian.org/debian-security bookworm-security InRelease [48.0 kB]
#5 1.338 Err:2 https://apt.corretto.aws stable InRelease
#5 1.338   The following signatures were invalid: EXPKEYSIG A122542AB04F24E3 Amazon Services LLC (Amazon Corretto release) <co...@amazon.com>
#5 1.501 Get:5 http://deb.debian.org/debian bookworm/main amd64 Packages [8792 kB]
#5 1.760 Get:6 http://deb.debian.org/debian bookworm-updates/main amd64 Packages [13.5 kB]
#5 1.761 Get:7 http://deb.debian.org/debian-security bookworm-security/main amd64 Packages [241 kB]
#5 3.545 Reading package lists...
#5 4.571 W: GPG error: https://apt.corretto.aws stable InRelease: The following signatures were invalid: EXPKEYSIG A122542AB04F24E3 Amazon Services LLC (Amazon Corretto release) <co...@amazon.com>
#5 4.571 E: The repository 'https://apt.corretto.aws stable InRelease' is not signed.
#5 ERROR: process "/bin/sh -c apt-get update" did not complete successfully: exit code: 100
------
 > [2/9] RUN apt-get update:
1.291 Get:3 http://deb.debian.org/debian bookworm-updates InRelease [55.4 kB]
1.319 Get:4 http://deb.debian.org/debian-security bookworm-security InRelease [48.0 kB]
1.338 Err:2 https://apt.corretto.aws stable InRelease
1.338   The following signatures were invalid: EXPKEYSIG A122542AB04F24E3 Amazon Services LLC (Amazon Corretto release) <co...@amazon.com>
1.501 Get:5 http://deb.debian.org/debian bookworm/main amd64 Packages [8792 kB]
1.760 Get:6 http://deb.debian.org/debian bookworm-updates/main amd64 Packages [13.5 kB]
1.761 Get:7 http://deb.debian.org/debian-security bookworm-security/main amd64 Packages [241 kB]

4.571 W: GPG error: https://apt.corretto.aws stable InRelease: The following signatures were invalid: EXPKEYSIG A122542AB04F24E3 Amazon Services LLC (Amazon Corretto release) <co...@amazon.com>
4.571 E: The repository 'https://apt.corretto.aws stable InRelease' is not signed.
------
Dockerfile:25
--------------------
  23 |     
  24 |     # Install necessary binaries to build brooklyn
  25 | >>> RUN apt-get update
  26 |     
  27 |     RUN apt-get install -y \
--------------------
ERROR: failed to solve: process "/bin/sh -c apt-get update" did not complete successfully: exit code: 100
[Pipeline] }
[Pipeline] // withEnv
[Pipeline] }
[Pipeline] // stage
[Pipeline] }
[Pipeline] // withEnv
[Pipeline] }
ERROR: script returned exit code 1
Setting overall build result to FAILURE
[Pipeline] // catchError
[Pipeline] stage
[Pipeline] { (Publish test results)
[Pipeline] junit
Recording test results
[Checks API] No suitable checks publisher found.
[Pipeline] testNG
TestNG Reports Processing: START
Looking for TestNG results report in workspace using pattern: **/testng-results.xml
No test report files were found. Configuration error?
Did not find any matching files.
[Pipeline] }
[Pipeline] // stage
[Pipeline] stage
[Pipeline] { (Send notifications)
[Pipeline] step

Build failed in Jenkins: Brooklyn » Brooklyn » master #974

Posted by Apache Jenkins Server <je...@builds.apache.org>.
See <https://ci-builds.apache.org/job/Brooklyn/job/brooklyn/job/master/974/display/redirect>

Changes:


------------------------------------------
Started by upstream project "Brooklyn/brooklyn-ui/master" build number 304
originally caused by:
 Push event to branch master
Connecting to https://api.github.com using This is to connect to Brooklyn repos on GitHub
Obtained Jenkinsfile from 4f253ccf3ab63870c04c6a0386122de77c904908
[Pipeline] Start of Pipeline
[Pipeline] node
Running on builds30 in /home/jenkins/jenkins-agent/workspace/Brooklyn_brooklyn_master
[Pipeline] {
[Pipeline] properties
[Pipeline] catchError
[Pipeline] {
[Pipeline] withEnv
[Pipeline] {
[Pipeline] stage
[Pipeline] { (Clone repository)
[Pipeline] checkout
The recommended git tool is: NONE
using credential Read only (Brooklyn repos)
Fetching changes from the remote Git repository
 > git rev-parse --resolve-git-dir /home/jenkins/jenkins-agent/workspace/Brooklyn_brooklyn_master/.git # timeout=10
Fetching without tags
 > git config remote.origin.url https://github.com/apache/brooklyn.git # timeout=10
Fetching upstream changes from https://github.com/apache/brooklyn.git
 > git --version # timeout=10
 > git --version # 'git version 2.34.1'
using GIT_ASKPASS to set credentials This is to connect to Brooklyn repos on GitHub
 > git fetch --no-tags --force --progress -- https://github.com/apache/brooklyn.git +refs/heads/master:refs/remotes/origin/master # timeout=10
Checking out Revision 4f253ccf3ab63870c04c6a0386122de77c904908 (master)
Commit message: "Merge pull request #59 from iuliana/upgrade-go"
 > git config core.sparsecheckout # timeout=10
 > git checkout -f 4f253ccf3ab63870c04c6a0386122de77c904908 # timeout=10
 > git rev-list --no-walk 4f253ccf3ab63870c04c6a0386122de77c904908 # timeout=10
[Pipeline] }
[Pipeline] // stage
[Pipeline] stage
[Pipeline] { (Prepare environment)
[Pipeline] echo
Creating maven cache ...
[Pipeline] sh
+ mkdir -p /home/jenkins/jenkins-agent/workspace/Brooklyn_brooklyn_master/.m2
[Pipeline] sh
+ git submodule init
[Pipeline] sh
+ git submodule update --remote --merge --recursive
From https://github.com/apache/brooklyn-server
   ce769fafb4..665dc5331a  master     -> origin/master
Updating ce769fafb4..665dc5331a
Fast-forward
 .../brooklyn/camp/brooklyn/ConfigYamlTest.java     |   3 +-
 .../brooklyn/core/entity/lifecycle/Lifecycle.java  |   3 +-
 .../core/entity/lifecycle/ServiceStateLogic.java   | 225 ++++++++++++---------
 .../mgmt/internal/LocalSubscriptionManager.java    |  50 +++--
 .../util/core/task/BasicExecutionContext.java      |  26 ++-
 .../util/core/task/BasicExecutionManager.java      |  49 ++++-
 .../org/apache/brooklyn/util/core/task/Tasks.java  |  16 +-
 .../util/core/task/AutoFlagsCallbackTest.java      |  63 ++++++
 .../blueprints/ChildrenQuorateRaceTest.java        | 205 +++++++++++++++++++
 9 files changed, 507 insertions(+), 133 deletions(-)
 create mode 100644 core/src/test/java/org/apache/brooklyn/util/core/task/AutoFlagsCallbackTest.java
 create mode 100644 launcher/src/test/java/org/apache/brooklyn/launcher/blueprints/ChildrenQuorateRaceTest.java
Submodule path 'brooklyn-server': merged in '665dc5331a7ce9b9e92087dd3ee2b9e75e5acddc'
From https://github.com/apache/brooklyn-ui
   b1e557ec..8b6fc802  master     -> origin/master
Updating b1e557ec..8b6fc802
Fast-forward
 ui-modules/utils/quick-launch/quick-launch.html |  2 +-
 ui-modules/utils/quick-launch/quick-launch.js   | 83 ++++++++++++++++---------
 2 files changed, 55 insertions(+), 30 deletions(-)
Submodule path 'brooklyn-ui': merged in '8b6fc802a95f5bf472d11f00a4c04dc4b371d4e6'
[Pipeline] sh
+ docker logout
Removing login credentials for https://index.docker.io/v1/
[Pipeline] echo
Building docker image for test environment ...
[Pipeline] echo
Using docker tag DOCKER_TAG=jenkins-Brooklyn-brooklyn-master-974
[Pipeline] isUnix
[Pipeline] withEnv
[Pipeline] {
[Pipeline] sh
+ docker build -t brooklyn:jenkins-Brooklyn-brooklyn-master-974 .
#0 building with "default" instance using docker driver

#1 [internal] load build definition from Dockerfile
#1 transferring dockerfile:
#1 transferring dockerfile: 2.68kB 0.0s done
#1 DONE 0.5s

#2 [internal] load metadata for docker.io/library/maven:3.9.4-amazoncorretto-8-debian
#2 DONE 2.4s

#3 [internal] load .dockerignore
#3 transferring context:
#3 transferring context: 2B done
#3 DONE 0.4s

#4 [1/9] FROM docker.io/library/maven:3.9.4-amazoncorretto-8-debian@sha256:cc7338960617eb0612de6bababdcda1d407e8240078fae56814811a7d886d64f
#4 resolve docker.io/library/maven:3.9.4-amazoncorretto-8-debian@sha256:cc7338960617eb0612de6bababdcda1d407e8240078fae56814811a7d886d64f
#4 resolve docker.io/library/maven:3.9.4-amazoncorretto-8-debian@sha256:cc7338960617eb0612de6bababdcda1d407e8240078fae56814811a7d886d64f 0.4s done
#4 sha256:cc7338960617eb0612de6bababdcda1d407e8240078fae56814811a7d886d64f 549B / 549B done
#4 sha256:c676ff1421307fc84232099d8d7fc913be7509ca565602114c23729042559355 1.57kB / 1.57kB done
#4 sha256:830828800aef05389f229b19e4d7be48b835dd7e7701fa4489502082639ca276 3.36kB / 3.36kB done
#4 sha256:8986d925bf9361d36eaefc79931a0971d25a144d0548fb9ce1444b82736e4dd3 0B / 9.41MB 0.2s
#4 sha256:a378f10b321842c3042cdeff4f6997f34f4cb21f2eff27704b7f6193ab7b5fea 0B / 29.15MB 0.4s
#4 sha256:30678e68f52f98e4e1d273c546c73f46bb191004a8a75f5290de822b5de7cef2 0B / 121.93MB 0.4s
#4 sha256:a378f10b321842c3042cdeff4f6997f34f4cb21f2eff27704b7f6193ab7b5fea 2.10MB / 29.15MB 0.5s
#4 sha256:a378f10b321842c3042cdeff4f6997f34f4cb21f2eff27704b7f6193ab7b5fea 11.53MB / 29.15MB 0.7s
#4 sha256:a378f10b321842c3042cdeff4f6997f34f4cb21f2eff27704b7f6193ab7b5fea 15.73MB / 29.15MB 0.8s
#4 sha256:a378f10b321842c3042cdeff4f6997f34f4cb21f2eff27704b7f6193ab7b5fea 20.97MB / 29.15MB 0.9s
#4 sha256:30678e68f52f98e4e1d273c546c73f46bb191004a8a75f5290de822b5de7cef2 7.34MB / 121.93MB 1.0s
#4 sha256:a378f10b321842c3042cdeff4f6997f34f4cb21f2eff27704b7f6193ab7b5fea 29.15MB / 29.15MB 1.1s
#4 sha256:30678e68f52f98e4e1d273c546c73f46bb191004a8a75f5290de822b5de7cef2 16.78MB / 121.93MB 1.2s
#4 sha256:a378f10b321842c3042cdeff4f6997f34f4cb21f2eff27704b7f6193ab7b5fea 29.15MB / 29.15MB 1.3s done
#4 sha256:30678e68f52f98e4e1d273c546c73f46bb191004a8a75f5290de822b5de7cef2 25.17MB / 121.93MB 1.4s
#4 sha256:30678e68f52f98e4e1d273c546c73f46bb191004a8a75f5290de822b5de7cef2 32.32MB / 121.93MB 1.5s
#4 sha256:139316f57851914b47e5b0dcec8e5c633b6fff1e44540044429baf3d76920c50 0B / 854B 1.5s
#4 extracting sha256:a378f10b321842c3042cdeff4f6997f34f4cb21f2eff27704b7f6193ab7b5fea
#4 sha256:30678e68f52f98e4e1d273c546c73f46bb191004a8a75f5290de822b5de7cef2 40.89MB / 121.93MB 1.7s
#4 sha256:30678e68f52f98e4e1d273c546c73f46bb191004a8a75f5290de822b5de7cef2 50.33MB / 121.93MB 1.9s
#4 sha256:139316f57851914b47e5b0dcec8e5c633b6fff1e44540044429baf3d76920c50 854B / 854B 1.9s
#4 sha256:139316f57851914b47e5b0dcec8e5c633b6fff1e44540044429baf3d76920c50 854B / 854B 1.9s done
#4 sha256:30678e68f52f98e4e1d273c546c73f46bb191004a8a75f5290de822b5de7cef2 59.77MB / 121.93MB 2.1s
#4 sha256:658b90e7b244b2ee265c559c40ccae269c9639d984e94436c4bf90dbb08ab7f5 0B / 361B 2.1s
#4 sha256:30678e68f52f98e4e1d273c546c73f46bb191004a8a75f5290de822b5de7cef2 66.06MB / 121.93MB 2.2s
#4 sha256:658b90e7b244b2ee265c559c40ccae269c9639d984e94436c4bf90dbb08ab7f5 361B / 361B 2.4s
#4 sha256:30678e68f52f98e4e1d273c546c73f46bb191004a8a75f5290de822b5de7cef2 76.55MB / 121.93MB 2.6s
#4 sha256:658b90e7b244b2ee265c559c40ccae269c9639d984e94436c4bf90dbb08ab7f5 361B / 361B 2.4s done
#4 sha256:30678e68f52f98e4e1d273c546c73f46bb191004a8a75f5290de822b5de7cef2 86.54MB / 121.93MB 2.8s
#4 sha256:6dc2f7934afaba6705557c44c45318e6a557c4fc17e7f543a887716df6c8f0f8 0B / 167B 2.8s
#4 sha256:30678e68f52f98e4e1d273c546c73f46bb191004a8a75f5290de822b5de7cef2 104.86MB / 121.93MB 3.1s
#4 sha256:6dc2f7934afaba6705557c44c45318e6a557c4fc17e7f543a887716df6c8f0f8 167B / 167B 3.1s
#4 sha256:6dc2f7934afaba6705557c44c45318e6a557c4fc17e7f543a887716df6c8f0f8 167B / 167B 3.1s done
#4 sha256:30678e68f52f98e4e1d273c546c73f46bb191004a8a75f5290de822b5de7cef2 115.34MB / 121.93MB 3.3s
#4 sha256:30678e68f52f98e4e1d273c546c73f46bb191004a8a75f5290de822b5de7cef2 121.93MB / 121.93MB 3.5s
#4 extracting sha256:a378f10b321842c3042cdeff4f6997f34f4cb21f2eff27704b7f6193ab7b5fea 2.9s done
#4 sha256:30678e68f52f98e4e1d273c546c73f46bb191004a8a75f5290de822b5de7cef2 121.93MB / 121.93MB 4.7s done
#4 extracting sha256:30678e68f52f98e4e1d273c546c73f46bb191004a8a75f5290de822b5de7cef2
#4 sha256:8986d925bf9361d36eaefc79931a0971d25a144d0548fb9ce1444b82736e4dd3 0B / 9.41MB 5.3s
#4 sha256:8986d925bf9361d36eaefc79931a0971d25a144d0548fb9ce1444b82736e4dd3 4.19MB / 9.41MB 5.8s
#4 sha256:8986d925bf9361d36eaefc79931a0971d25a144d0548fb9ce1444b82736e4dd3 8.39MB / 9.41MB 5.9s
#4 sha256:8986d925bf9361d36eaefc79931a0971d25a144d0548fb9ce1444b82736e4dd3 9.41MB / 9.41MB 6.0s
#4 sha256:8986d925bf9361d36eaefc79931a0971d25a144d0548fb9ce1444b82736e4dd3 9.41MB / 9.41MB 6.0s done
#4 extracting sha256:30678e68f52f98e4e1d273c546c73f46bb191004a8a75f5290de822b5de7cef2 4.8s done
#4 extracting sha256:8986d925bf9361d36eaefc79931a0971d25a144d0548fb9ce1444b82736e4dd3
#4 extracting sha256:8986d925bf9361d36eaefc79931a0971d25a144d0548fb9ce1444b82736e4dd3 0.4s done
#4 extracting sha256:139316f57851914b47e5b0dcec8e5c633b6fff1e44540044429baf3d76920c50
#4 extracting sha256:139316f57851914b47e5b0dcec8e5c633b6fff1e44540044429baf3d76920c50 done
#4 extracting sha256:658b90e7b244b2ee265c559c40ccae269c9639d984e94436c4bf90dbb08ab7f5
#4 extracting sha256:658b90e7b244b2ee265c559c40ccae269c9639d984e94436c4bf90dbb08ab7f5 done
#4 extracting sha256:6dc2f7934afaba6705557c44c45318e6a557c4fc17e7f543a887716df6c8f0f8
#4 extracting sha256:6dc2f7934afaba6705557c44c45318e6a557c4fc17e7f543a887716df6c8f0f8 done
#4 DONE 13.8s

#5 [2/9] RUN apt-get update
#5 1.392 Get:1 http://deb.debian.org/debian bookworm InRelease [151 kB]
#5 1.445 Get:2 https://apt.corretto.aws stable InRelease [10.7 kB]
#5 1.476 Get:3 http://deb.debian.org/debian bookworm-updates InRelease [55.4 kB]
#5 1.507 Get:4 http://deb.debian.org/debian-security bookworm-security InRelease [48.0 kB]
#5 1.549 Err:2 https://apt.corretto.aws stable InRelease
#5 1.549   The following signatures were invalid: EXPKEYSIG A122542AB04F24E3 Amazon Services LLC (Amazon Corretto release) <co...@amazon.com>
#5 1.736 Get:5 http://deb.debian.org/debian bookworm/main amd64 Packages [8792 kB]
#5 2.035 Get:6 http://deb.debian.org/debian bookworm-updates/main amd64 Packages [13.5 kB]
#5 2.036 Get:7 http://deb.debian.org/debian-security bookworm-security/main amd64 Packages [243 kB]
#5 4.447 Reading package lists...
#5 5.885 W: GPG error: https://apt.corretto.aws stable InRelease: The following signatures were invalid: EXPKEYSIG A122542AB04F24E3 Amazon Services LLC (Amazon Corretto release) <co...@amazon.com>
#5 5.885 E: The repository 'https://apt.corretto.aws stable InRelease' is not signed.
#5 ERROR: process "/bin/sh -c apt-get update" did not complete successfully: exit code: 100
------
 > [2/9] RUN apt-get update:
1.476 Get:3 http://deb.debian.org/debian bookworm-updates InRelease [55.4 kB]
1.507 Get:4 http://deb.debian.org/debian-security bookworm-security InRelease [48.0 kB]
1.549 Err:2 https://apt.corretto.aws stable InRelease
1.549   The following signatures were invalid: EXPKEYSIG A122542AB04F24E3 Amazon Services LLC (Amazon Corretto release) <co...@amazon.com>
1.736 Get:5 http://deb.debian.org/debian bookworm/main amd64 Packages [8792 kB]
2.035 Get:6 http://deb.debian.org/debian bookworm-updates/main amd64 Packages [13.5 kB]
2.036 Get:7 http://deb.debian.org/debian-security bookworm-security/main amd64 Packages [243 kB]

5.885 W: GPG error: https://apt.corretto.aws stable InRelease: The following signatures were invalid: EXPKEYSIG A122542AB04F24E3 Amazon Services LLC (Amazon Corretto release) <co...@amazon.com>
5.885 E: The repository 'https://apt.corretto.aws stable InRelease' is not signed.
------
Dockerfile:25
--------------------
  23 |     
  24 |     # Install necessary binaries to build brooklyn
  25 | >>> RUN apt-get update
  26 |     
  27 |     RUN apt-get install -y \
--------------------
ERROR: failed to solve: process "/bin/sh -c apt-get update" did not complete successfully: exit code: 100
[Pipeline] }
[Pipeline] // withEnv
[Pipeline] }
[Pipeline] // stage
[Pipeline] }
[Pipeline] // withEnv
[Pipeline] }
ERROR: script returned exit code 1
Setting overall build result to FAILURE
[Pipeline] // catchError
[Pipeline] stage
[Pipeline] { (Publish test results)
[Pipeline] junit
Recording test results
[Checks API] No suitable checks publisher found.
[Pipeline] testNG
No test report files were found. Configuration error?
TestNG Reports Processing: START
Looking for TestNG results report in workspace using pattern: **/testng-results.xml
Did not find any matching files.
[Pipeline] }
[Pipeline] // stage
[Pipeline] stage
[Pipeline] { (Send notifications)
[Pipeline] step

Build failed in Jenkins: Brooklyn » Brooklyn » master #973

Posted by Apache Jenkins Server <je...@builds.apache.org>.
See <https://ci-builds.apache.org/job/Brooklyn/job/brooklyn/job/master/973/display/redirect>

Changes:


------------------------------------------
Started by upstream project "Brooklyn/brooklyn-ui/master" build number 303
originally caused by:
 Push event to branch master
Connecting to https://api.github.com using This is to connect to Brooklyn repos on GitHub
Obtained Jenkinsfile from 4f253ccf3ab63870c04c6a0386122de77c904908
[Pipeline] Start of Pipeline
[Pipeline] node
Running on builds30 in /home/jenkins/jenkins-agent/workspace/Brooklyn_brooklyn_master
[Pipeline] {
[Pipeline] properties
[Pipeline] catchError
[Pipeline] {
[Pipeline] withEnv
[Pipeline] {
[Pipeline] stage
[Pipeline] { (Clone repository)
[Pipeline] checkout
The recommended git tool is: NONE
using credential Read only (Brooklyn repos)
Fetching changes from the remote Git repository
 > git rev-parse --resolve-git-dir /home/jenkins/jenkins-agent/workspace/Brooklyn_brooklyn_master/.git # timeout=10
Fetching without tags
 > git config remote.origin.url https://github.com/apache/brooklyn.git # timeout=10
Fetching upstream changes from https://github.com/apache/brooklyn.git
 > git --version # timeout=10
 > git --version # 'git version 2.34.1'
using GIT_ASKPASS to set credentials This is to connect to Brooklyn repos on GitHub
 > git fetch --no-tags --force --progress -- https://github.com/apache/brooklyn.git +refs/heads/master:refs/remotes/origin/master # timeout=10
Checking out Revision 4f253ccf3ab63870c04c6a0386122de77c904908 (master)
Commit message: "Merge pull request #59 from iuliana/upgrade-go"
 > git config core.sparsecheckout # timeout=10
 > git checkout -f 4f253ccf3ab63870c04c6a0386122de77c904908 # timeout=10
 > git rev-list --no-walk 4f253ccf3ab63870c04c6a0386122de77c904908 # timeout=10
[Pipeline] }
[Pipeline] // stage
[Pipeline] stage
[Pipeline] { (Prepare environment)
[Pipeline] echo
Creating maven cache ...
[Pipeline] sh
+ mkdir -p /home/jenkins/jenkins-agent/workspace/Brooklyn_brooklyn_master/.m2
[Pipeline] sh
+ git submodule init
[Pipeline] sh
+ git submodule update --remote --merge --recursive
[Pipeline] sh
+ docker logout
Removing login credentials for https://index.docker.io/v1/
[Pipeline] echo
Building docker image for test environment ...
[Pipeline] echo
Using docker tag DOCKER_TAG=jenkins-Brooklyn-brooklyn-master-973
[Pipeline] isUnix
[Pipeline] withEnv
[Pipeline] {
[Pipeline] sh
+ docker build -t brooklyn:jenkins-Brooklyn-brooklyn-master-973 .
#0 building with "default" instance using docker driver

#1 [internal] load build definition from Dockerfile
#1 transferring dockerfile: 2.68kB done
#1 DONE 0.1s

#2 [internal] load metadata for docker.io/library/maven:3.9.4-amazoncorretto-8-debian
#2 DONE 0.9s

#3 [internal] load .dockerignore
#3 transferring context: 2B done
#3 DONE 0.1s

#4 [1/9] FROM docker.io/library/maven:3.9.4-amazoncorretto-8-debian@sha256:cc7338960617eb0612de6bababdcda1d407e8240078fae56814811a7d886d64f
#4 CACHED

#5 [2/9] RUN apt-get update
#5 1.194 Get:1 http://deb.debian.org/debian bookworm InRelease [151 kB]
#5 1.223 Get:2 https://apt.corretto.aws stable InRelease [10.7 kB]
#5 1.281 Get:3 http://deb.debian.org/debian bookworm-updates InRelease [55.4 kB]
#5 1.311 Get:4 http://deb.debian.org/debian-security bookworm-security InRelease [48.0 kB]
#5 1.326 Err:2 https://apt.corretto.aws stable InRelease
#5 1.326   The following signatures were invalid: EXPKEYSIG A122542AB04F24E3 Amazon Services LLC (Amazon Corretto release) <co...@amazon.com>
#5 1.508 Get:5 http://deb.debian.org/debian bookworm/main amd64 Packages [8792 kB]
#5 1.747 Get:6 http://deb.debian.org/debian bookworm-updates/main amd64 Packages [13.5 kB]
#5 1.749 Get:7 http://deb.debian.org/debian-security bookworm-security/main amd64 Packages [241 kB]
#5 3.960 Reading package lists...
#5 5.361 W: GPG error: https://apt.corretto.aws stable InRelease: The following signatures were invalid: EXPKEYSIG A122542AB04F24E3 Amazon Services LLC (Amazon Corretto release) <co...@amazon.com>
#5 5.361 E: The repository 'https://apt.corretto.aws stable InRelease' is not signed.
#5 ERROR: process "/bin/sh -c apt-get update" did not complete successfully: exit code: 100
------
 > [2/9] RUN apt-get update:
1.281 Get:3 http://deb.debian.org/debian bookworm-updates InRelease [55.4 kB]
1.311 Get:4 http://deb.debian.org/debian-security bookworm-security InRelease [48.0 kB]
1.326 Err:2 https://apt.corretto.aws stable InRelease
1.326   The following signatures were invalid: EXPKEYSIG A122542AB04F24E3 Amazon Services LLC (Amazon Corretto release) <co...@amazon.com>
1.508 Get:5 http://deb.debian.org/debian bookworm/main amd64 Packages [8792 kB]
1.747 Get:6 http://deb.debian.org/debian bookworm-updates/main amd64 Packages [13.5 kB]
1.749 Get:7 http://deb.debian.org/debian-security bookworm-security/main amd64 Packages [241 kB]

5.361 W: GPG error: https://apt.corretto.aws stable InRelease: The following signatures were invalid: EXPKEYSIG A122542AB04F24E3 Amazon Services LLC (Amazon Corretto release) <co...@amazon.com>
5.361 E: The repository 'https://apt.corretto.aws stable InRelease' is not signed.
------
Dockerfile:25
--------------------
  23 |     
  24 |     # Install necessary binaries to build brooklyn
  25 | >>> RUN apt-get update
  26 |     
  27 |     RUN apt-get install -y \
--------------------
ERROR: failed to solve: process "/bin/sh -c apt-get update" did not complete successfully: exit code: 100
[Pipeline] }
[Pipeline] // withEnv
[Pipeline] }
[Pipeline] // stage
[Pipeline] }
[Pipeline] // withEnv
[Pipeline] }
ERROR: script returned exit code 1
Setting overall build result to FAILURE
[Pipeline] // catchError
[Pipeline] stage
[Pipeline] { (Publish test results)
[Pipeline] junit
Recording test results
[Checks API] No suitable checks publisher found.
[Pipeline] testNG
No test report files were found. Configuration error?
TestNG Reports Processing: START
Looking for TestNG results report in workspace using pattern: **/testng-results.xml
Did not find any matching files.
[Pipeline] }
[Pipeline] // stage
[Pipeline] stage
[Pipeline] { (Send notifications)
[Pipeline] step

Build failed in Jenkins: Brooklyn » Brooklyn » master #972

Posted by Apache Jenkins Server <je...@builds.apache.org>.
See <https://ci-builds.apache.org/job/Brooklyn/job/brooklyn/job/master/972/display/redirect>

Changes:


------------------------------------------
Started by upstream project "Brooklyn/brooklyn-dist/master" build number 66
originally caused by:
 Push event to branch master
Connecting to https://api.github.com using This is to connect to Brooklyn repos on GitHub
Obtained Jenkinsfile from 4f253ccf3ab63870c04c6a0386122de77c904908
[Pipeline] Start of Pipeline
[Pipeline] node
Running on builds30 in /home/jenkins/jenkins-agent/workspace/Brooklyn_brooklyn_master
[Pipeline] {
[Pipeline] properties
[Pipeline] catchError
[Pipeline] {
[Pipeline] withEnv
[Pipeline] {
[Pipeline] stage
[Pipeline] { (Clone repository)
[Pipeline] checkout
The recommended git tool is: NONE
using credential Read only (Brooklyn repos)
Cloning the remote Git repository
Cloning with configured refspecs honoured and without tags
Cloning repository https://github.com/apache/brooklyn.git
 > git init /home/jenkins/jenkins-agent/workspace/Brooklyn_brooklyn_master # timeout=10
Fetching upstream changes from https://github.com/apache/brooklyn.git
 > git --version # timeout=10
 > git --version # 'git version 2.34.1'
using GIT_ASKPASS to set credentials This is to connect to Brooklyn repos on GitHub
 > git fetch --no-tags --force --progress -- https://github.com/apache/brooklyn.git +refs/heads/master:refs/remotes/origin/master # timeout=10
Avoid second fetch
Checking out Revision 4f253ccf3ab63870c04c6a0386122de77c904908 (master)
 > git config remote.origin.url https://github.com/apache/brooklyn.git # timeout=10
 > git config --add remote.origin.fetch +refs/heads/master:refs/remotes/origin/master # timeout=10
 > git config core.sparsecheckout # timeout=10
 > git checkout -f 4f253ccf3ab63870c04c6a0386122de77c904908 # timeout=10
Commit message: "Merge pull request #59 from iuliana/upgrade-go"
 > git rev-list --no-walk 4f253ccf3ab63870c04c6a0386122de77c904908 # timeout=10
[Pipeline] }
[Pipeline] // stage
[Pipeline] stage
[Pipeline] { (Prepare environment)
[Pipeline] echo
Creating maven cache ...
[Pipeline] sh
+ mkdir -p /home/jenkins/jenkins-agent/workspace/Brooklyn_brooklyn_master/.m2
[Pipeline] sh
+ git submodule init
Submodule 'brooklyn-client' (https://github.com/apache/brooklyn-client.git) registered for path 'brooklyn-client'
Submodule 'brooklyn-dist' (https://github.com/apache/brooklyn-dist.git) registered for path 'brooklyn-dist'
Submodule 'brooklyn-docs' (https://github.com/apache/brooklyn-docs.git) registered for path 'brooklyn-docs'
Submodule 'brooklyn-library' (https://github.com/apache/brooklyn-library.git) registered for path 'brooklyn-library'
Submodule 'brooklyn-server' (https://github.com/apache/brooklyn-server.git) registered for path 'brooklyn-server'
Submodule 'brooklyn-ui' (https://github.com/apache/brooklyn-ui.git) registered for path 'brooklyn-ui'
[Pipeline] sh
+ git submodule update --remote --merge --recursive
Cloning into '/home/jenkins/jenkins-agent/workspace/Brooklyn_brooklyn_master/brooklyn-client'...
Cloning into '/home/jenkins/jenkins-agent/workspace/Brooklyn_brooklyn_master/brooklyn-dist'...
Cloning into '/home/jenkins/jenkins-agent/workspace/Brooklyn_brooklyn_master/brooklyn-docs'...
Cloning into '/home/jenkins/jenkins-agent/workspace/Brooklyn_brooklyn_master/brooklyn-library'...
Cloning into '/home/jenkins/jenkins-agent/workspace/Brooklyn_brooklyn_master/brooklyn-server'...
Cloning into '/home/jenkins/jenkins-agent/workspace/Brooklyn_brooklyn_master/brooklyn-ui'...
Submodule path 'brooklyn-client': checked out 'caa1d227667cb660c2d811c27992a3bef8a42487'
Submodule path 'brooklyn-dist': checked out 'd052e2b0934a47c6155ff7f668bf2cc5e1a141d1'
Submodule path 'brooklyn-docs': checked out '8c68c94d3a5deb4dcbce029b18eadc27db38f1f3'
Submodule path 'brooklyn-library': checked out '61381901be0334dcea6e1fe1367bd0941a3f775b'
Submodule path 'brooklyn-server': checked out 'ce769fafb4491e9d414a86d99ecaf44f7b24e8a7'
Submodule path 'brooklyn-ui': checked out 'b1e557eca49d997151e3b3dc1f077df76a1cbaf5'
[Pipeline] sh
+ docker logout
Removing login credentials for https://index.docker.io/v1/
[Pipeline] echo
Building docker image for test environment ...
[Pipeline] echo
Using docker tag DOCKER_TAG=jenkins-Brooklyn-brooklyn-master-972
[Pipeline] isUnix
[Pipeline] withEnv
[Pipeline] {
[Pipeline] sh
+ docker build -t brooklyn:jenkins-Brooklyn-brooklyn-master-972 .
#0 building with "default" instance using docker driver

#1 [internal] load build definition from Dockerfile
#1 transferring dockerfile:
#1 transferring dockerfile: 2.68kB done
#1 DONE 0.3s

#2 [internal] load metadata for docker.io/library/maven:3.9.4-amazoncorretto-8-debian
#2 DONE 2.0s

#3 [internal] load .dockerignore
#3 transferring context:
#3 transferring context: 2B done
#3 DONE 0.3s

#4 [1/9] FROM docker.io/library/maven:3.9.4-amazoncorretto-8-debian@sha256:cc7338960617eb0612de6bababdcda1d407e8240078fae56814811a7d886d64f
#4 resolve docker.io/library/maven:3.9.4-amazoncorretto-8-debian@sha256:cc7338960617eb0612de6bababdcda1d407e8240078fae56814811a7d886d64f
#4 resolve docker.io/library/maven:3.9.4-amazoncorretto-8-debian@sha256:cc7338960617eb0612de6bababdcda1d407e8240078fae56814811a7d886d64f 0.3s done
#4 sha256:cc7338960617eb0612de6bababdcda1d407e8240078fae56814811a7d886d64f 549B / 549B done
#4 sha256:c676ff1421307fc84232099d8d7fc913be7509ca565602114c23729042559355 1.57kB / 1.57kB done
#4 sha256:830828800aef05389f229b19e4d7be48b835dd7e7701fa4489502082639ca276 3.36kB / 3.36kB done
#4 sha256:a378f10b321842c3042cdeff4f6997f34f4cb21f2eff27704b7f6193ab7b5fea 0B / 29.15MB 0.1s
#4 sha256:30678e68f52f98e4e1d273c546c73f46bb191004a8a75f5290de822b5de7cef2 0B / 121.93MB 0.2s
#4 sha256:a378f10b321842c3042cdeff4f6997f34f4cb21f2eff27704b7f6193ab7b5fea 13.63MB / 29.15MB 0.4s
#4 sha256:8986d925bf9361d36eaefc79931a0971d25a144d0548fb9ce1444b82736e4dd3 0B / 9.41MB 0.4s
#4 sha256:a378f10b321842c3042cdeff4f6997f34f4cb21f2eff27704b7f6193ab7b5fea 27.34MB / 29.15MB 0.6s
#4 sha256:30678e68f52f98e4e1d273c546c73f46bb191004a8a75f5290de822b5de7cef2 12.58MB / 121.93MB 0.6s
#4 sha256:a378f10b321842c3042cdeff4f6997f34f4cb21f2eff27704b7f6193ab7b5fea 29.15MB / 29.15MB 0.7s
#4 sha256:30678e68f52f98e4e1d273c546c73f46bb191004a8a75f5290de822b5de7cef2 18.87MB / 121.93MB 0.7s
#4 sha256:8986d925bf9361d36eaefc79931a0971d25a144d0548fb9ce1444b82736e4dd3 1.05MB / 9.41MB 0.7s
#4 sha256:30678e68f52f98e4e1d273c546c73f46bb191004a8a75f5290de822b5de7cef2 34.60MB / 121.93MB 0.9s
#4 sha256:8986d925bf9361d36eaefc79931a0971d25a144d0548fb9ce1444b82736e4dd3 5.24MB / 9.41MB 0.9s
#4 sha256:a378f10b321842c3042cdeff4f6997f34f4cb21f2eff27704b7f6193ab7b5fea 29.15MB / 29.15MB 1.0s done
#4 sha256:30678e68f52f98e4e1d273c546c73f46bb191004a8a75f5290de822b5de7cef2 41.94MB / 121.93MB 1.0s
#4 sha256:8986d925bf9361d36eaefc79931a0971d25a144d0548fb9ce1444b82736e4dd3 9.41MB / 9.41MB 1.0s
#4 sha256:30678e68f52f98e4e1d273c546c73f46bb191004a8a75f5290de822b5de7cef2 48.46MB / 121.93MB 1.1s
#4 sha256:139316f57851914b47e5b0dcec8e5c633b6fff1e44540044429baf3d76920c50 0B / 854B 1.1s
#4 extracting sha256:a378f10b321842c3042cdeff4f6997f34f4cb21f2eff27704b7f6193ab7b5fea
#4 sha256:30678e68f52f98e4e1d273c546c73f46bb191004a8a75f5290de822b5de7cef2 58.72MB / 121.93MB 1.3s
#4 sha256:8986d925bf9361d36eaefc79931a0971d25a144d0548fb9ce1444b82736e4dd3 9.41MB / 9.41MB 1.3s done
#4 sha256:139316f57851914b47e5b0dcec8e5c633b6fff1e44540044429baf3d76920c50 854B / 854B 1.3s
#4 sha256:658b90e7b244b2ee265c559c40ccae269c9639d984e94436c4bf90dbb08ab7f5 0B / 361B 1.4s
#4 sha256:30678e68f52f98e4e1d273c546c73f46bb191004a8a75f5290de822b5de7cef2 70.25MB / 121.93MB 1.5s
#4 sha256:139316f57851914b47e5b0dcec8e5c633b6fff1e44540044429baf3d76920c50 854B / 854B 1.4s done
#4 sha256:30678e68f52f98e4e1d273c546c73f46bb191004a8a75f5290de822b5de7cef2 77.59MB / 121.93MB 1.6s
#4 sha256:658b90e7b244b2ee265c559c40ccae269c9639d984e94436c4bf90dbb08ab7f5 361B / 361B 1.6s
#4 sha256:6dc2f7934afaba6705557c44c45318e6a557c4fc17e7f543a887716df6c8f0f8 0B / 167B 1.6s
#4 sha256:30678e68f52f98e4e1d273c546c73f46bb191004a8a75f5290de822b5de7cef2 83.89MB / 121.93MB 1.7s
#4 sha256:658b90e7b244b2ee265c559c40ccae269c9639d984e94436c4bf90dbb08ab7f5 361B / 361B 1.6s done
#4 sha256:30678e68f52f98e4e1d273c546c73f46bb191004a8a75f5290de822b5de7cef2 93.32MB / 121.93MB 1.9s
#4 sha256:6dc2f7934afaba6705557c44c45318e6a557c4fc17e7f543a887716df6c8f0f8 167B / 167B 1.7s done
#4 sha256:30678e68f52f98e4e1d273c546c73f46bb191004a8a75f5290de822b5de7cef2 102.76MB / 121.93MB 2.1s
#4 sha256:30678e68f52f98e4e1d273c546c73f46bb191004a8a75f5290de822b5de7cef2 113.25MB / 121.93MB 2.3s
#4 sha256:30678e68f52f98e4e1d273c546c73f46bb191004a8a75f5290de822b5de7cef2 121.93MB / 121.93MB 2.5s
#4 extracting sha256:a378f10b321842c3042cdeff4f6997f34f4cb21f2eff27704b7f6193ab7b5fea 3.1s done
#4 sha256:30678e68f52f98e4e1d273c546c73f46bb191004a8a75f5290de822b5de7cef2 121.93MB / 121.93MB 4.3s done
#4 extracting sha256:30678e68f52f98e4e1d273c546c73f46bb191004a8a75f5290de822b5de7cef2
#4 extracting sha256:30678e68f52f98e4e1d273c546c73f46bb191004a8a75f5290de822b5de7cef2 5.0s done
#4 extracting sha256:8986d925bf9361d36eaefc79931a0971d25a144d0548fb9ce1444b82736e4dd3
#4 extracting sha256:8986d925bf9361d36eaefc79931a0971d25a144d0548fb9ce1444b82736e4dd3 0.4s done
#4 extracting sha256:139316f57851914b47e5b0dcec8e5c633b6fff1e44540044429baf3d76920c50
#4 extracting sha256:139316f57851914b47e5b0dcec8e5c633b6fff1e44540044429baf3d76920c50 done
#4 extracting sha256:658b90e7b244b2ee265c559c40ccae269c9639d984e94436c4bf90dbb08ab7f5
#4 extracting sha256:658b90e7b244b2ee265c559c40ccae269c9639d984e94436c4bf90dbb08ab7f5 done
#4 extracting sha256:6dc2f7934afaba6705557c44c45318e6a557c4fc17e7f543a887716df6c8f0f8
#4 extracting sha256:6dc2f7934afaba6705557c44c45318e6a557c4fc17e7f543a887716df6c8f0f8 done
#4 DONE 13.7s

#5 [2/9] RUN apt-get update
#5 1.160 Get:1 http://deb.debian.org/debian bookworm InRelease [151 kB]
#5 1.180 Get:2 https://apt.corretto.aws stable InRelease [10.7 kB]
#5 1.242 Get:3 http://deb.debian.org/debian bookworm-updates InRelease [55.4 kB]
#5 1.272 Get:4 http://deb.debian.org/debian-security bookworm-security InRelease [48.0 kB]
#5 1.288 Err:2 https://apt.corretto.aws stable InRelease
#5 1.288   The following signatures were invalid: EXPKEYSIG A122542AB04F24E3 Amazon Services LLC (Amazon Corretto release) <co...@amazon.com>
#5 1.475 Get:5 http://deb.debian.org/debian bookworm/main amd64 Packages [8792 kB]
#5 1.735 Get:6 http://deb.debian.org/debian bookworm-updates/main amd64 Packages [13.5 kB]
#5 1.736 Get:7 http://deb.debian.org/debian-security bookworm-security/main amd64 Packages [241 kB]
#5 4.267 Reading package lists...
#5 5.589 W: GPG error: https://apt.corretto.aws stable InRelease: The following signatures were invalid: EXPKEYSIG A122542AB04F24E3 Amazon Services LLC (Amazon Corretto release) <co...@amazon.com>
#5 5.589 E: The repository 'https://apt.corretto.aws stable InRelease' is not signed.
#5 ERROR: process "/bin/sh -c apt-get update" did not complete successfully: exit code: 100
------
 > [2/9] RUN apt-get update:
1.242 Get:3 http://deb.debian.org/debian bookworm-updates InRelease [55.4 kB]
1.272 Get:4 http://deb.debian.org/debian-security bookworm-security InRelease [48.0 kB]
1.288 Err:2 https://apt.corretto.aws stable InRelease
1.288   The following signatures were invalid: EXPKEYSIG A122542AB04F24E3 Amazon Services LLC (Amazon Corretto release) <co...@amazon.com>
1.475 Get:5 http://deb.debian.org/debian bookworm/main amd64 Packages [8792 kB]
1.735 Get:6 http://deb.debian.org/debian bookworm-updates/main amd64 Packages [13.5 kB]
1.736 Get:7 http://deb.debian.org/debian-security bookworm-security/main amd64 Packages [241 kB]

5.589 W: GPG error: https://apt.corretto.aws stable InRelease: The following signatures were invalid: EXPKEYSIG A122542AB04F24E3 Amazon Services LLC (Amazon Corretto release) <co...@amazon.com>
5.589 E: The repository 'https://apt.corretto.aws stable InRelease' is not signed.
------
Dockerfile:25
--------------------
  23 |     
  24 |     # Install necessary binaries to build brooklyn
  25 | >>> RUN apt-get update
  26 |     
  27 |     RUN apt-get install -y \
--------------------
ERROR: failed to solve: process "/bin/sh -c apt-get update" did not complete successfully: exit code: 100
[Pipeline] }
[Pipeline] // withEnv
[Pipeline] }
[Pipeline] // stage
[Pipeline] }
[Pipeline] // withEnv
[Pipeline] }
ERROR: script returned exit code 1
Setting overall build result to FAILURE
[Pipeline] // catchError
[Pipeline] stage
[Pipeline] { (Publish test results)
[Pipeline] junit
Recording test results
[Checks API] No suitable checks publisher found.
[Pipeline] testNG
No test report files were found. Configuration error?
TestNG Reports Processing: START
Looking for TestNG results report in workspace using pattern: **/testng-results.xml
Did not find any matching files.
[Pipeline] }
[Pipeline] // stage
[Pipeline] stage
[Pipeline] { (Send notifications)
[Pipeline] step