You are viewing a plain text version of this content. The canonical link for it is here.
Posted to commits@sling.apache.org by Apache Jenkins Server <je...@builds.apache.org> on 2018/09/19 16:14:51 UTC

Build failed in Jenkins: sling-org-apache-sling-commons-messaging-mail-1.8 #103

See <https://builds.apache.org/job/sling-org-apache-sling-commons-messaging-mail-1.8/103/display/redirect?page=changes>

Changes:

[radu] SLING-7216 - [nice-to-have] Add a CODE_OF_CONDUCT file to every module

------------------------------------------
[...truncated 83.25 KB...]
org.ops4j.pax.logging.pax-logging-api[org.ops4j.pax.swissbox.extender.BundleWatcher] : Un-registering [ManifestEntry{ key=PaxExam-36b70bdd-dae8-4a16-9b56-9258e6654316, value=org.apache.sling.commons.messaging.mail.internal.SimpleMailBuilderIT;testBuildWithData }, ManifestEntry{ key=PaxExam-Executable, value=PaxExam-2ff3891e-2227-434c-8641-9597bcad0552,PaxExam-36b70bdd-dae8-4a16-9b56-9258e6654316,PaxExam-9d933a20-7e61-4bb1-9211-164de07b8c22,PaxExam-03dad4ba-67d6-47e2-9b20-4b5dfbefb74d,PaxExam-5b1d662a-8a38-478d-9ece-fbde2c117145, }, ManifestEntry{ key=PaxExam-5b1d662a-8a38-478d-9ece-fbde2c117145, value=org.apache.sling.commons.messaging.mail.internal.SimpleMailServiceIT;sendWithoutAuthentication }, ManifestEntry{ key=PaxExam-2ff3891e-2227-434c-8641-9597bcad0552, value=org.apache.sling.commons.messaging.mail.internal.SimpleMailBuilderIT;testBuildWithDefaults }, ManifestEntry{ key=PaxExam-03dad4ba-67d6-47e2-9b20-4b5dfbefb74d, value=org.apache.sling.commons.messaging.mail.internal.SimpleMailServiceIT;send }, ManifestEntry{ key=PaxExam-9d933a20-7e61-4bb1-9211-164de07b8c22, value=org.apache.sling.commons.messaging.mail.internal.SimpleMailServiceIT;sendWithData }]
org.ops4j.pax.logging.pax-logging-api[org.ops4j.pax.exam.raw.extender.intern.TestBundleObserver] : Unregistered testcase [org.ops4j.pax.exam.raw.extender.intern.Probe@1e64303e.]
org.ops4j.pax.logging.pax-logging-api[org.ops4j.pax.swissbox.extender.BundleWatcher] : Releasing bundle [org.ops4j.pax.exam]
org.ops4j.pax.logging.pax-logging-api[org.ops4j.pax.swissbox.extender.BundleWatcher] : Releasing bundle [org.ops4j.pax.exam.extender.service]
org.ops4j.pax.logging.pax-logging-api[org.ops4j.pax.swissbox.extender.BundleWatcher] : Releasing bundle [org.apache.felix.framework]

[main] INFO org.ops4j.exec.DefaultJavaRunner - Platform has been shutdown.
[main] INFO org.ops4j.exec.DefaultJavaRunner - DefaultJavaRunner completed successfully

[org.ops4j.pax.swissbox.extender.BundleWatcher] : Creating bundle watcher with scanner [org.ops4j.pax.swissbox.extender.BundleManifestScanner@5ef99947]...
[org.ops4j.pax.swissbox.extender.BundleWatcher] : Scanning bundle [org.apache.felix.framework]
[org.ops4j.pax.swissbox.extender.BundleWatcher] : Scanning bundle [org.ops4j.pax.exam]
[org.ops4j.pax.swissbox.extender.BundleWatcher] : Scanning bundle [org.ops4j.pax.exam.inject]
[org.ops4j.pax.swissbox.extender.BundleWatcher] : Scanning bundle [org.ops4j.pax.exam.extender.service]
[org.ops4j.pax.swissbox.extender.BundleWatcher] : Scanning bundle [osgi.cmpn]
org.ops4j.pax.logging.pax-logging-api[org.ops4j.pax.logging.internal.Activator] : Enabling SLF4J API support.
org.ops4j.pax.logging.pax-logging-api[org.ops4j.pax.logging.internal.Activator] : Enabling Jakarta Commons Logging API support.
org.ops4j.pax.logging.pax-logging-api[org.ops4j.pax.logging.internal.Activator] : Enabling Log4J API support.
org.ops4j.pax.logging.pax-logging-api[org.ops4j.pax.logging.internal.Activator] : Enabling Avalon Logger API support.
org.ops4j.pax.logging.pax-logging-api[org.ops4j.pax.logging.internal.Activator] : Enabling JULI Logger API support.
org.ops4j.pax.logging.pax-logging-api[org.ops4j.pax.swissbox.extender.BundleWatcher] : Scanning bundle [org.ops4j.pax.logging.pax-logging-api]
org.ops4j.pax.logging.pax-logging-api[org.ops4j.pax.swissbox.extender.BundleWatcher] : Scanning bundle [org.ops4j.base]
org.ops4j.pax.logging.pax-logging-api[org.ops4j.pax.swissbox.extender.BundleWatcher] : Scanning bundle [org.ops4j.pax.swissbox.core]
org.ops4j.pax.logging.pax-logging-api[org.ops4j.pax.swissbox.extender.BundleWatcher] : Scanning bundle [org.ops4j.pax.swissbox.extender]
org.ops4j.pax.logging.pax-logging-api[org.ops4j.pax.swissbox.extender.BundleWatcher] : Scanning bundle [org.ops4j.pax.swissbox.framework]
org.ops4j.pax.logging.pax-logging-api[org.ops4j.pax.swissbox.extender.BundleWatcher] : Scanning bundle [org.ops4j.pax.swissbox.lifecycle]
org.ops4j.pax.logging.pax-logging-api[org.ops4j.pax.swissbox.extender.BundleWatcher] : Scanning bundle [org.ops4j.pax.swissbox.tracker]
org.ops4j.pax.logging.pax-logging-api[org.ops4j.pax.swissbox.extender.BundleWatcher] : Scanning bundle [org.apache.geronimo.specs.geronimo-atinject_1.0_spec]
org.ops4j.pax.logging.pax-logging-api[org.ops4j.pax.swissbox.extender.BundleWatcher] : Scanning bundle [org.ops4j.pax.tipi.junit]
org.ops4j.pax.logging.pax-logging-api[org.ops4j.pax.swissbox.extender.BundleWatcher] : Scanning bundle [org.ops4j.pax.tipi.hamcrest.core]
org.ops4j.pax.logging.pax-logging-api[org.ops4j.pax.swissbox.extender.BundleWatcher] : Scanning bundle [org.ops4j.pax.exam.invoker.junit]
org.ops4j.pax.logging.pax-logging-api[org.ops4j.pax.swissbox.extender.BundleWatcher] : Scanning bundle [wrap_mvn_org.subethamail_subethasmtp_3.1.7]
org.ops4j.pax.logging.pax-logging-api[org.ops4j.pax.swissbox.extender.BundleWatcher] : Scanning bundle [org.apache.felix.configadmin]
org.ops4j.pax.logging.pax-logging-api[org.ops4j.pax.swissbox.extender.BundleWatcher] : Scanning bundle [org.apache.felix.scr]
org.ops4j.pax.logging.pax-logging-api[org.ops4j.pax.swissbox.extender.BundleWatcher] : Scanning bundle [com.sun.mail.javax.mail]
org.ops4j.pax.logging.pax-logging-api[org.ops4j.pax.swissbox.extender.BundleWatcher] : Scanning bundle [javax.mail-api]
org.ops4j.pax.logging.pax-logging-api[org.ops4j.pax.swissbox.extender.BundleWatcher] : Scanning bundle [org.apache.commons.email]
org.ops4j.pax.logging.pax-logging-api[org.ops4j.pax.swissbox.extender.BundleWatcher] : Scanning bundle [org.apache.commons.lang3]
org.ops4j.pax.logging.pax-logging-api[org.ops4j.pax.swissbox.extender.BundleWatcher] : Scanning bundle [org.apache.sling.commons.messaging]
org.apache.sling.commons.threads[org.apache.sling.commons.threads.impl.DefaultThreadPoolManager] : Started Apache Sling Thread Pool Manager
org.ops4j.pax.logging.pax-logging-api[org.ops4j.pax.swissbox.extender.BundleWatcher] : Scanning bundle [org.apache.sling.commons.threads]
org.ops4j.pax.logging.pax-logging-api[org.ops4j.pax.swissbox.extender.BundleWatcher] : Scanning bundle [org.apache.sling.commons.messaging.mail]
org.ops4j.pax.logging.pax-logging-api[org.ops4j.pax.swissbox.extender.BundleWatcher] : Scanning bundle [PAXEXAM-PROBE-bbe9c14e-b5e9-4db4-b5c1-0b0c39f95712]
org.ops4j.pax.logging.pax-logging-api[org.ops4j.pax.swissbox.extender.BundleWatcher] : Found resources [ManifestEntry{ key=PaxExam-36b70bdd-dae8-4a16-9b56-9258e6654316, value=org.apache.sling.commons.messaging.mail.internal.SimpleMailBuilderIT;testBuildWithData }, ManifestEntry{ key=PaxExam-Executable, value=PaxExam-2ff3891e-2227-434c-8641-9597bcad0552,PaxExam-36b70bdd-dae8-4a16-9b56-9258e6654316,PaxExam-9d933a20-7e61-4bb1-9211-164de07b8c22,PaxExam-03dad4ba-67d6-47e2-9b20-4b5dfbefb74d,PaxExam-5b1d662a-8a38-478d-9ece-fbde2c117145, }, ManifestEntry{ key=PaxExam-5b1d662a-8a38-478d-9ece-fbde2c117145, value=org.apache.sling.commons.messaging.mail.internal.SimpleMailServiceIT;sendWithoutAuthentication }, ManifestEntry{ key=PaxExam-2ff3891e-2227-434c-8641-9597bcad0552, value=org.apache.sling.commons.messaging.mail.internal.SimpleMailBuilderIT;testBuildWithDefaults }, ManifestEntry{ key=PaxExam-03dad4ba-67d6-47e2-9b20-4b5dfbefb74d, value=org.apache.sling.commons.messaging.mail.internal.SimpleMailServiceIT;send }, ManifestEntry{ key=PaxExam-9d933a20-7e61-4bb1-9211-164de07b8c22, value=org.apache.sling.commons.messaging.mail.internal.SimpleMailServiceIT;sendWithData }]
org.ops4j.pax.exam.extender.service[org.ops4j.pax.exam.raw.extender.intern.Probe] : Test PaxExam-36b70bdd-dae8-4a16-9b56-9258e6654316 to be in PaxExam-2ff3891e-2227-434c-8641-9597bcad0552,PaxExam-36b70bdd-dae8-4a16-9b56-9258e6654316,PaxExam-9d933a20-7e61-4bb1-9211-164de07b8c22,PaxExam-03dad4ba-67d6-47e2-9b20-4b5dfbefb74d,PaxExam-5b1d662a-8a38-478d-9ece-fbde2c117145,
org.ops4j.pax.exam.extender.service[org.ops4j.pax.exam.raw.extender.intern.Probe] : Registering Service: org.ops4j.pax.exam.ProbeInvoker with Probe-Signature="PaxExam-36b70bdd-dae8-4a16-9b56-9258e6654316" and expression="org.apache.sling.commons.messaging.mail.internal.SimpleMailBuilderIT;testBuildWithData"
org.ops4j.pax.exam.extender.service[org.ops4j.pax.exam.raw.extender.intern.Probe] : Test PaxExam-Executable to be in PaxExam-2ff3891e-2227-434c-8641-9597bcad0552,PaxExam-36b70bdd-dae8-4a16-9b56-9258e6654316,PaxExam-9d933a20-7e61-4bb1-9211-164de07b8c22,PaxExam-03dad4ba-67d6-47e2-9b20-4b5dfbefb74d,PaxExam-5b1d662a-8a38-478d-9ece-fbde2c117145,
org.ops4j.pax.exam.extender.service[org.ops4j.pax.exam.raw.extender.intern.Probe] : Test PaxExam-5b1d662a-8a38-478d-9ece-fbde2c117145 to be in PaxExam-2ff3891e-2227-434c-8641-9597bcad0552,PaxExam-36b70bdd-dae8-4a16-9b56-9258e6654316,PaxExam-9d933a20-7e61-4bb1-9211-164de07b8c22,PaxExam-03dad4ba-67d6-47e2-9b20-4b5dfbefb74d,PaxExam-5b1d662a-8a38-478d-9ece-fbde2c117145,
org.ops4j.pax.exam.extender.service[org.ops4j.pax.exam.raw.extender.intern.Probe] : Registering Service: org.ops4j.pax.exam.ProbeInvoker with Probe-Signature="PaxExam-5b1d662a-8a38-478d-9ece-fbde2c117145" and expression="org.apache.sling.commons.messaging.mail.internal.SimpleMailServiceIT;sendWithoutAuthentication"
org.ops4j.pax.exam.extender.service[org.ops4j.pax.exam.raw.extender.intern.Probe] : Test PaxExam-2ff3891e-2227-434c-8641-9597bcad0552 to be in PaxExam-2ff3891e-2227-434c-8641-9597bcad0552,PaxExam-36b70bdd-dae8-4a16-9b56-9258e6654316,PaxExam-9d933a20-7e61-4bb1-9211-164de07b8c22,PaxExam-03dad4ba-67d6-47e2-9b20-4b5dfbefb74d,PaxExam-5b1d662a-8a38-478d-9ece-fbde2c117145,
org.ops4j.pax.exam.extender.service[org.ops4j.pax.exam.raw.extender.intern.Probe] : Registering Service: org.ops4j.pax.exam.ProbeInvoker with Probe-Signature="PaxExam-2ff3891e-2227-434c-8641-9597bcad0552" and expression="org.apache.sling.commons.messaging.mail.internal.SimpleMailBuilderIT;testBuildWithDefaults"
org.ops4j.pax.exam.extender.service[org.ops4j.pax.exam.raw.extender.intern.Probe] : Test PaxExam-03dad4ba-67d6-47e2-9b20-4b5dfbefb74d to be in PaxExam-2ff3891e-2227-434c-8641-9597bcad0552,PaxExam-36b70bdd-dae8-4a16-9b56-9258e6654316,PaxExam-9d933a20-7e61-4bb1-9211-164de07b8c22,PaxExam-03dad4ba-67d6-47e2-9b20-4b5dfbefb74d,PaxExam-5b1d662a-8a38-478d-9ece-fbde2c117145,
org.ops4j.pax.exam.extender.service[org.ops4j.pax.exam.raw.extender.intern.Probe] : Registering Service: org.ops4j.pax.exam.ProbeInvoker with Probe-Signature="PaxExam-03dad4ba-67d6-47e2-9b20-4b5dfbefb74d" and expression="org.apache.sling.commons.messaging.mail.internal.SimpleMailServiceIT;send"
org.ops4j.pax.exam.extender.service[org.ops4j.pax.exam.raw.extender.intern.Probe] : Test PaxExam-9d933a20-7e61-4bb1-9211-164de07b8c22 to be in PaxExam-2ff3891e-2227-434c-8641-9597bcad0552,PaxExam-36b70bdd-dae8-4a16-9b56-9258e6654316,PaxExam-9d933a20-7e61-4bb1-9211-164de07b8c22,PaxExam-03dad4ba-67d6-47e2-9b20-4b5dfbefb74d,PaxExam-5b1d662a-8a38-478d-9ece-fbde2c117145,
org.ops4j.pax.exam.extender.service[org.ops4j.pax.exam.raw.extender.intern.Probe] : Registering Service: org.ops4j.pax.exam.ProbeInvoker with Probe-Signature="PaxExam-9d933a20-7e61-4bb1-9211-164de07b8c22" and expression="org.apache.sling.commons.messaging.mail.internal.SimpleMailServiceIT;sendWithData"
org.ops4j.pax.exam.invoker.junit[org.ops4j.pax.exam.invoker.junit.internal.ContainerTestRunner] : running sendWithoutAuthentication in reactor
wrap_mvn_org.subethamail_subethasmtp_3.1.7[org.subethamail.smtp.server.CommandHandler] : Added command: AUTH
wrap_mvn_org.subethamail_subethasmtp_3.1.7[org.subethamail.smtp.server.CommandHandler] : Added command: DATA
wrap_mvn_org.subethamail_subethasmtp_3.1.7[org.subethamail.smtp.server.CommandHandler] : Added command: EHLO
wrap_mvn_org.subethamail_subethasmtp_3.1.7[org.subethamail.smtp.server.CommandHandler] : Added command: HELO
wrap_mvn_org.subethamail_subethasmtp_3.1.7[org.subethamail.smtp.server.CommandHandler] : Added command: HELP
wrap_mvn_org.subethamail_subethasmtp_3.1.7[org.subethamail.smtp.server.CommandHandler] : Added command: MAIL
wrap_mvn_org.subethamail_subethasmtp_3.1.7[org.subethamail.smtp.server.CommandHandler] : Added command: NOOP
wrap_mvn_org.subethamail_subethasmtp_3.1.7[org.subethamail.smtp.server.CommandHandler] : Added command: QUIT
wrap_mvn_org.subethamail_subethasmtp_3.1.7[org.subethamail.smtp.server.CommandHandler] : Added command: RCPT
wrap_mvn_org.subethamail_subethasmtp_3.1.7[org.subethamail.smtp.server.CommandHandler] : Added command: RSET
wrap_mvn_org.subethamail_subethasmtp_3.1.7[org.subethamail.smtp.server.CommandHandler] : Added command: STARTTLS
wrap_mvn_org.subethamail_subethasmtp_3.1.7[org.subethamail.smtp.server.CommandHandler] : Added command: VRFY
wrap_mvn_org.subethamail_subethasmtp_3.1.7[org.subethamail.smtp.server.SMTPServer] : SMTP server *:38002 starting
wrap_mvn_org.subethamail_subethasmtp_3.1.7[org.subethamail.smtp.server.ServerThread] : SMTP server *:38002 started
PAXEXAM-PROBE-bbe9c14e-b5e9-4db4-b5c1-0b0c39f95712[org.apache.sling.commons.messaging.mail.internal.SimpleMailServiceIT] : configuration: Configuration PID=org.apache.sling.commons.messaging.mail.internal.SimpleMailBuilder, factoryPID=null, bundleLocation=local
org.apache.sling.commons.messaging.mail[org.apache.sling.commons.messaging.mail.internal.SimpleMailBuilder] : activate
org.apache.sling.commons.messaging.mail[org.apache.sling.commons.messaging.mail.internal.SimpleMailService] : activate
org.apache.sling.commons.threads[org.apache.sling.commons.threads.impl.DefaultThreadPoolManager] : Creating new pool with name default
org.apache.sling.commons.threads[org.apache.sling.commons.threads.impl.DefaultThreadPool] : Initializing thread pool [default]  ...
org.apache.sling.commons.threads[org.apache.sling.commons.threads.impl.DefaultThreadPool] : Thread pool [default] ; No ThreadFactory is configured. Will use JVM default thread factory: org.apache.sling.commons.threads.impl.ExtendedThreadFactory
org.apache.sling.commons.threads[org.apache.sling.commons.threads.impl.DefaultThreadPool] : Thread pool [default] initialized.
org.apache.sling.commons.threads[org.apache.sling.commons.threads.impl.DefaultThreadPool] : Submitting runnable:  java.util.concurrent.CompletableFuture$AsyncSupply@735453d9, pool=default, active=0, corePoolSize=5, maxPoolSize=5, queueSize=0
org.apache.sling.commons.threads[org.apache.sling.commons.threads.impl.ThreadExpiringThreadPool] : Thread[sling-default-1,5,RMI Runtime] used for the first time.
PAXEXAM-PROBE-bbe9c14e-b5e9-4db4-b5c1-0b0c39f95712[org.apache.sling.commons.messaging.mail.internal.SimpleMailServiceIT] : org.apache.commons.mail.EmailException: Sending the email to the following server failed : localhost:25
java.util.concurrent.ExecutionException: org.apache.commons.mail.EmailException: Sending the email to the following server failed : localhost:25
	at java.util.concurrent.CompletableFuture.reportGet(CompletableFuture.java:357)
	at java.util.concurrent.CompletableFuture.get(CompletableFuture.java:1895)
	at org.apache.sling.commons.messaging.mail.internal.SimpleMailServiceIT.sendWithoutAuthentication(SimpleMailServiceIT.java:105)
	at sun.reflect.NativeMethodAccessorImpl.invoke0(Native Method)
	at sun.reflect.NativeMethodAccessorImpl.invoke(NativeMethodAccessorImpl.java:62)
	at sun.reflect.DelegatingMethodAccessorImpl.invoke(DelegatingMethodAccessorImpl.java:43)
	at java.lang.reflect.Method.invoke(Method.java:498)
	at org.junit.runners.model.FrameworkMethod$1.runReflectiveCall(FrameworkMethod.java:50)
	at org.junit.internal.runners.model.ReflectiveCallable.run(ReflectiveCallable.java:12)
	at org.junit.runners.model.FrameworkMethod.invokeExplosively(FrameworkMethod.java:47)
	at org.junit.internal.runners.statements.InvokeMethod.evaluate(InvokeMethod.java:17)
	at org.junit.internal.runners.statements.RunBefores.evaluate(RunBefores.java:26)
	at org.junit.internal.runners.statements.RunAfters.evaluate(RunAfters.java:27)
	at org.junit.runners.ParentRunner.runLeaf(ParentRunner.java:325)
	at org.junit.runners.BlockJUnit4ClassRunner.runChild(BlockJUnit4ClassRunner.java:78)
	at org.ops4j.pax.exam.invoker.junit.internal.ContainerTestRunner.runChild(ContainerTestRunner.java:68)
	at org.ops4j.pax.exam.invoker.junit.internal.ContainerTestRunner.runChild(ContainerTestRunner.java:37)
	at org.junit.runners.ParentRunner$3.run(ParentRunner.java:290)
	at org.junit.runners.ParentRunner$1.schedule(ParentRunner.java:71)
	at org.junit.runners.ParentRunner.runChildren(ParentRunner.java:288)
	at org.junit.runners.ParentRunner.access$000(ParentRunner.java:58)
	at org.junit.runners.ParentRunner$2.evaluate(ParentRunner.java:268)
	at org.junit.runners.ParentRunner.run(ParentRunner.java:363)
	at org.junit.runner.JUnitCore.run(JUnitCore.java:137)
	at org.junit.runner.JUnitCore.run(JUnitCore.java:115)
	at org.ops4j.pax.exam.invoker.junit.internal.JUnitProbeInvoker.invokeViaJUnit(JUnitProbeInvoker.java:124)
	at org.ops4j.pax.exam.invoker.junit.internal.JUnitProbeInvoker.findAndInvoke(JUnitProbeInvoker.java:97)
	at org.ops4j.pax.exam.invoker.junit.internal.JUnitProbeInvoker.call(JUnitProbeInvoker.java:73)
	at sun.reflect.NativeMethodAccessorImpl.invoke0(Native Method)
	at sun.reflect.NativeMethodAccessorImpl.invoke(NativeMethodAccessorImpl.java:62)
	at sun.reflect.DelegatingMethodAccessorImpl.invoke(DelegatingMethodAccessorImpl.java:43)
	at java.lang.reflect.Method.invoke(Method.java:498)
	at org.ops4j.pax.swissbox.framework.RemoteFrameworkImpl.invokeMethodOnService(RemoteFrameworkImpl.java:433)
	at org.ops4j.pax.swissbox.framework.RemoteFrameworkImpl.invokeMethodOnService(RemoteFrameworkImpl.java:406)
	at sun.reflect.NativeMethodAccessorImpl.invoke0(Native Method)
	at sun.reflect.NativeMethodAccessorImpl.invoke(NativeMethodAccessorImpl.java:62)
	at sun.reflect.DelegatingMethodAccessorImpl.invoke(DelegatingMethodAccessorImpl.java:43)
	at java.lang.reflect.Method.invoke(Method.java:498)
	at sun.rmi.server.UnicastServerRef.dispatch(UnicastServerRef.java:357)
	at sun.rmi.transport.Transport$1.run(Transport.java:200)
	at sun.rmi.transport.Transport$1.run(Transport.java:197)
	at java.security.AccessController.doPrivileged(Native Method)
	at sun.rmi.transport.Transport.serviceCall(Transport.java:196)
	at sun.rmi.transport.tcp.TCPTransport.handleMessages(TCPTransport.java:573)
	at sun.rmi.transport.tcp.TCPTransport$ConnectionHandler.run0(TCPTransport.java:835)
	at sun.rmi.transport.tcp.TCPTransport$ConnectionHandler.lambda$run$0(TCPTransport.java:688)
	at java.security.AccessController.doPrivileged(Native Method)
	at sun.rmi.transport.tcp.TCPTransport$ConnectionHandler.run(TCPTransport.java:687)
	at java.util.concurrent.ThreadPoolExecutor.runWorker(ThreadPoolExecutor.java:1149)
	at java.util.concurrent.ThreadPoolExecutor$Worker.run(ThreadPoolExecutor.java:624)
	at java.lang.Thread.run(Thread.java:748)
Caused by: org.apache.commons.mail.EmailException: Sending the email to the following server failed : localhost:25
	at org.apache.commons.mail.Email.sendMimeMessage(Email.java:1421)
	at org.apache.commons.mail.Email.send(Email.java:1448)
	at org.apache.sling.commons.messaging.mail.internal.SimpleMailService.sendMail(SimpleMailService.java:123)
	at org.apache.sling.commons.messaging.mail.internal.SimpleMailService.lambda$send$0(SimpleMailService.java:117)
	at java.util.concurrent.CompletableFuture$AsyncSupply.run(CompletableFuture.java:1590)
	at java.util.concurrent.Executors$RunnableAdapter.call(Executors.java:511)
	at java.util.concurrent.FutureTask.run(FutureTask.java:266)
	... 3 more
Caused by: javax.mail.AuthenticationFailedException: failed to connect, no user name specified?
	at javax.mail.Service.connect(Service.java:397)
	at javax.mail.Service.connect(Service.java:246)
	at javax.mail.Service.connect(Service.java:195)
	at javax.mail.Transport.send0(Transport.java:254)
	at javax.mail.Transport.send(Transport.java:124)
	at org.apache.commons.mail.Email.sendMimeMessage(Email.java:1411)
	... 9 more
wrap_mvn_org.subethamail_subethasmtp_3.1.7[org.subethamail.smtp.server.SMTPServer] : SMTP server *:38002 stopping
wrap_mvn_org.subethamail_subethasmtp_3.1.7[org.subethamail.smtp.server.ServerThread] : SMTP Server socket shut down
wrap_mvn_org.subethamail_subethasmtp_3.1.7[org.subethamail.smtp.server.ServerThread] : SMTP server *:38002 stopped
org.apache.sling.commons.messaging.mail[org.apache.sling.commons.messaging.mail.internal.SimpleMailService] : deactivate
org.apache.sling.commons.threads[org.apache.sling.commons.threads.impl.DefaultThreadPool] : Shutting down thread pool [default] ...
org.apache.sling.commons.threads[org.apache.sling.commons.threads.impl.DefaultThreadPool] : Thread pool [default] is shut down.
org.ops4j.pax.logging.pax-logging-api[org.ops4j.pax.swissbox.extender.BundleWatcher] : Releasing bundle [org.apache.sling.commons.messaging.mail]
org.apache.sling.commons.threads[org.apache.sling.commons.threads.impl.DefaultThreadPoolManager] : Disposing all thread pools
org.apache.sling.commons.threads[org.apache.sling.commons.threads.impl.DefaultThreadPoolManager] : Stopped Apache Sling Thread Pool Manager
org.ops4j.pax.logging.pax-logging-api[org.ops4j.pax.swissbox.extender.BundleWatcher] : Releasing bundle [org.apache.sling.commons.threads]
org.ops4j.pax.logging.pax-logging-api[org.ops4j.pax.swissbox.extender.BundleWatcher] : Releasing bundle [org.apache.sling.commons.messaging]
org.ops4j.pax.logging.pax-logging-api[org.ops4j.pax.swissbox.extender.BundleWatcher] : Releasing bundle [org.apache.commons.lang3]
org.ops4j.pax.logging.pax-logging-api[org.ops4j.pax.swissbox.extender.BundleWatcher] : Releasing bundle [org.apache.commons.email]
org.ops4j.pax.logging.pax-logging-api[org.ops4j.pax.swissbox.extender.BundleWatcher] : Releasing bundle [javax.mail-api]
org.ops4j.pax.logging.pax-logging-api[org.ops4j.pax.swissbox.extender.BundleWatcher] : Releasing bundle [com.sun.mail.javax.mail]
org.ops4j.pax.logging.pax-logging-api[org.ops4j.pax.swissbox.extender.BundleWatcher] : Releasing bundle [org.apache.felix.scr]
org.ops4j.pax.logging.pax-logging-api[org.ops4j.pax.swissbox.extender.BundleWatcher] : Releasing bundle [org.apache.felix.configadmin]
org.ops4j.pax.logging.pax-logging-api[org.ops4j.pax.swissbox.extender.BundleWatcher] : Releasing bundle [wrap_mvn_org.subethamail_subethasmtp_3.1.7]
org.ops4j.pax.logging.pax-logging-api[org.ops4j.pax.swissbox.extender.BundleWatcher] : Releasing bundle [org.ops4j.pax.exam.invoker.junit]
org.ops4j.pax.logging.pax-logging-api[org.ops4j.pax.swissbox.extender.BundleWatcher] : Releasing bundle [org.ops4j.pax.tipi.hamcrest.core]
org.ops4j.pax.logging.pax-logging-api[org.ops4j.pax.swissbox.extender.BundleWatcher] : Releasing bundle [org.ops4j.pax.tipi.junit]
org.ops4j.pax.logging.pax-logging-api[org.ops4j.pax.swissbox.extender.BundleWatcher] : Releasing bundle [org.apache.geronimo.specs.geronimo-atinject_1.0_spec]
org.ops4j.pax.logging.pax-logging-api[org.ops4j.pax.swissbox.extender.BundleWatcher] : Releasing bundle [org.ops4j.pax.swissbox.tracker]
org.ops4j.pax.logging.pax-logging-api[org.ops4j.pax.swissbox.extender.BundleWatcher] : Releasing bundle [org.ops4j.pax.swissbox.lifecycle]
org.ops4j.pax.logging.pax-logging-api[org.ops4j.pax.swissbox.extender.BundleWatcher] : Releasing bundle [org.ops4j.pax.swissbox.framework]
org.ops4j.pax.logging.pax-logging-api[org.ops4j.pax.swissbox.extender.BundleWatcher] : Releasing bundle [org.ops4j.pax.swissbox.extender]
org.ops4j.pax.logging.pax-logging-api[org.ops4j.pax.swissbox.extender.BundleWatcher] : Releasing bundle [org.ops4j.pax.swissbox.core]
org.ops4j.pax.logging.pax-logging-api[org.ops4j.pax.swissbox.extender.BundleWatcher] : Releasing bundle [org.ops4j.base]
org.ops4j.pax.logging.pax-logging-api[org.ops4j.pax.logging.internal.Activator] : Disabling SLF4J API support.
org.ops4j.pax.logging.pax-logging-api[org.ops4j.pax.logging.internal.Activator] : Disabling Jakarta Commons Logging API support.
org.ops4j.pax.logging.pax-logging-api[org.ops4j.pax.logging.internal.Activator] : Disabling Log4J API support.
org.ops4j.pax.logging.pax-logging-api[org.ops4j.pax.logging.internal.Activator] : Disabling Avalon Logger API support.
org.ops4j.pax.logging.pax-logging-api[org.ops4j.pax.logging.internal.Activator] : Disabling JULI Logger API support.
org.ops4j.pax.logging.pax-logging-api[org.ops4j.pax.swissbox.extender.BundleWatcher] : Releasing bundle [org.ops4j.pax.logging.pax-logging-api]
org.ops4j.pax.logging.pax-logging-api[org.ops4j.pax.swissbox.extender.BundleWatcher] : Releasing bundle [osgi.cmpn]
org.ops4j.pax.logging.pax-logging-api[org.ops4j.pax.swissbox.extender.BundleWatcher] : Releasing bundle [org.ops4j.pax.exam]
org.ops4j.pax.logging.pax-logging-api[org.ops4j.pax.swissbox.extender.BundleWatcher] : Releasing bundle [org.ops4j.pax.exam.inject]
org.ops4j.pax.logging.pax-logging-api[org.ops4j.pax.swissbox.extender.BundleWatcher] : Releasing bundle [org.ops4j.pax.exam.extender.service]
org.ops4j.pax.logging.pax-logging-api[org.ops4j.pax.swissbox.extender.BundleWatcher] : Releasing bundle [PAXEXAM-PROBE-bbe9c14e-b5e9-4db4-b5c1-0b0c39f95712]
org.ops4j.pax.logging.pax-logging-api[org.ops4j.pax.swissbox.extender.BundleWatcher] : Un-registering [ManifestEntry{ key=PaxExam-36b70bdd-dae8-4a16-9b56-9258e6654316, value=org.apache.sling.commons.messaging.mail.internal.SimpleMailBuilderIT;testBuildWithData }, ManifestEntry{ key=PaxExam-Executable, value=PaxExam-2ff3891e-2227-434c-8641-9597bcad0552,PaxExam-36b70bdd-dae8-4a16-9b56-9258e6654316,PaxExam-9d933a20-7e61-4bb1-9211-164de07b8c22,PaxExam-03dad4ba-67d6-47e2-9b20-4b5dfbefb74d,PaxExam-5b1d662a-8a38-478d-9ece-fbde2c117145, }, ManifestEntry{ key=PaxExam-5b1d662a-8a38-478d-9ece-fbde2c117145, value=org.apache.sling.commons.messaging.mail.internal.SimpleMailServiceIT;sendWithoutAuthentication }, ManifestEntry{ key=PaxExam-2ff3891e-2227-434c-8641-9597bcad0552, value=org.apache.sling.commons.messaging.mail.internal.SimpleMailBuilderIT;testBuildWithDefaults }, ManifestEntry{ key=PaxExam-03dad4ba-67d6-47e2-9b20-4b5dfbefb74d, value=org.apache.sling.commons.messaging.mail.internal.SimpleMailServiceIT;send }, ManifestEntry{ key=PaxExam-9d933a20-7e61-4bb1-9211-164de07b8c22, value=org.apache.sling.commons.messaging.mail.internal.SimpleMailServiceIT;sendWithData }]
org.ops4j.pax.logging.pax-logging-api[org.ops4j.pax.exam.raw.extender.intern.TestBundleObserver] : Unregistered testcase [org.ops4j.pax.exam.raw.extender.intern.Probe@520fc503.]
org.ops4j.pax.logging.pax-logging-api[org.ops4j.pax.swissbox.extender.BundleWatcher] : Releasing bundle [org.apache.felix.framework]

[main] INFO org.ops4j.exec.DefaultJavaRunner - Platform has been shutdown.
[main] INFO org.ops4j.pax.exam.spi.reactors.ReactorManager - suite finished
[INFO] Tests run: 3, Failures: 0, Errors: 0, Skipped: 0, Time elapsed: 7.75 s - in org.apache.sling.commons.messaging.mail.internal.SimpleMailServiceIT
[INFO] 
[INFO] Results:
[INFO] 
[INFO] Tests run: 5, Failures: 0, Errors: 0, Skipped: 0
[INFO] 
[JENKINS] Recording test results
[WARNING] Attempt to (de-)serialize anonymous class hudson.maven.reporters.SurefireArchiver$2; see: https://jenkins.io/redirect/serialization-of-anonymous-classes/
[INFO] 
[INFO] --- ianal-maven-plugin:1.0-alpha-1:verify-legal-files (verify-legal-files) @ org.apache.sling.commons.messaging.mail ---
[INFO] Checking legal files in: org.apache.sling.commons.messaging.mail-0.0.1-SNAPSHOT.jar
[INFO] Checking legal files in: org.apache.sling.commons.messaging.mail-0.0.1-SNAPSHOT-sources.jar
[INFO] 
[INFO] --- apache-rat-plugin:0.12:check (rat-check) @ org.apache.sling.commons.messaging.mail ---
[INFO] Enabled default license matchers.
[INFO] Will parse SCM ignores for exclusions...
[INFO] Parsing exclusions from <https://builds.apache.org/job/sling-org-apache-sling-commons-messaging-mail-1.8/ws/.gitignore>
[INFO] Finished adding exclusions from SCM ignore files.
[INFO] 73 implicit excludes (use -debug for more details).
[INFO] Exclude: src/main/appended-resources/META-INF/*
[INFO] Exclude: velocity.log
[INFO] Exclude: target/*
[INFO] Exclude: README.md
[INFO] Exclude: maven-eclipse.xml
[INFO] Exclude: .*
[INFO] Exclude: .*/**
[INFO] Exclude: **/*.json
[INFO] Exclude: DEPENDENCIES
[INFO] Exclude: **/*.rej
[INFO] Exclude: hs_err_*.log
[INFO] Exclude: **/repository/index/*/index-details.txt
[INFO] Exclude: bnd.bnd
[INFO] 15 resources included (use -debug for more details)
[INFO] Rat check: Summary over all files. Unapproved: 1, unknown: 1, generated: 0, approved: 13 licenses.
[WARNING] Attempt to (de-)serialize anonymous class hudson.maven.reporters.MavenArtifactArchiver$2; see: https://jenkins.io/redirect/serialization-of-anonymous-classes/
[JENKINS] Archiving disabled
[WARNING] Attempt to (de-)serialize anonymous class hudson.maven.reporters.MavenFingerprinter$1; see: https://jenkins.io/redirect/serialization-of-anonymous-classes/
[JENKINS] Archiving disabled
[INFO] ------------------------------------------------------------------------
[INFO] BUILD FAILURE
[INFO] ------------------------------------------------------------------------
[INFO] Total time: 02:12 min
[INFO] Finished at: 2018-09-19T16:14:49+00:00
[INFO] Final Memory: 82M/3925M
[INFO] ------------------------------------------------------------------------
Waiting for Jenkins to finish collecting data[ERROR] Failed to execute goal org.apache.rat:apache-rat-plugin:0.12:check (rat-check) on project org.apache.sling.commons.messaging.mail: Too many files with unapproved license: 1 See RAT report in: <https://builds.apache.org/job/sling-org-apache-sling-commons-messaging-mail-1.8/ws/target/rat.txt> -> [Help 1]
[ERROR] 
[ERROR] To see the full stack trace of the errors, re-run Maven with the -e switch.
[ERROR] Re-run Maven using the -X switch to enable full debug logging.
[ERROR] 
[ERROR] For more information about the errors and possible solutions, please read the following articles:
[ERROR] [Help 1] http://cwiki.apache.org/confluence/display/MAVEN/MojoFailureException

channel stopped
Recording test results

Jenkins build is back to normal : sling-org-apache-sling-commons-messaging-mail-1.8 #107

Posted by Apache Jenkins Server <je...@builds.apache.org>.
See <https://builds.apache.org/job/sling-org-apache-sling-commons-messaging-mail-1.8/107/display/redirect?page=changes>


Build failed in Jenkins: sling-org-apache-sling-commons-messaging-mail-1.8 #106

Posted by Apache Jenkins Server <je...@builds.apache.org>.
See <https://builds.apache.org/job/sling-org-apache-sling-commons-messaging-mail-1.8/106/display/redirect>

------------------------------------------
Started by upstream project "sling-org-apache-sling-commons-messaging-1.8" build number 57
originally caused by:
 Started by an SCM change
[EnvInject] - Loading node environment variables.
Building remotely on H25 (ubuntu xenial) in workspace <https://builds.apache.org/job/sling-org-apache-sling-commons-messaging-mail-1.8/ws/>
 > git rev-parse --is-inside-work-tree # timeout=10
Fetching changes from the remote Git repository
 > git config remote.origin.url https://github.com/apache/sling-org-apache-sling-commons-messaging-mail.git # timeout=10
ERROR: Error fetching remote repo 'origin'
hudson.plugins.git.GitException: Failed to fetch from https://github.com/apache/sling-org-apache-sling-commons-messaging-mail.git
	at hudson.plugins.git.GitSCM.fetchFrom(GitSCM.java:888)
	at hudson.plugins.git.GitSCM.retrieveChanges(GitSCM.java:1155)
	at hudson.plugins.git.GitSCM.checkout(GitSCM.java:1186)
	at hudson.scm.SCM.checkout(SCM.java:504)
	at hudson.model.AbstractProject.checkout(AbstractProject.java:1208)
	at hudson.model.AbstractBuild$AbstractBuildExecution.defaultCheckout(AbstractBuild.java:574)
	at jenkins.scm.SCMCheckoutStrategy.checkout(SCMCheckoutStrategy.java:86)
	at hudson.model.AbstractBuild$AbstractBuildExecution.run(AbstractBuild.java:499)
	at hudson.model.Run.execute(Run.java:1794)
	at hudson.maven.MavenModuleSetBuild.run(MavenModuleSetBuild.java:543)
	at hudson.model.ResourceController.execute(ResourceController.java:97)
	at hudson.model.Executor.run(Executor.java:429)
Caused by: hudson.plugins.git.GitException: Command "git config remote.origin.url https://github.com/apache/sling-org-apache-sling-commons-messaging-mail.git" returned status code 4:
stdout: 
stderr: error: failed to write new configuration file <https://builds.apache.org/job/sling-org-apache-sling-commons-messaging-mail-1.8/ws/.git/config.lock>

	at org.jenkinsci.plugins.gitclient.CliGitAPIImpl.launchCommandIn(CliGitAPIImpl.java:2002)
	at org.jenkinsci.plugins.gitclient.CliGitAPIImpl.launchCommandIn(CliGitAPIImpl.java:1970)
	at org.jenkinsci.plugins.gitclient.CliGitAPIImpl.launchCommandIn(CliGitAPIImpl.java:1966)
	at org.jenkinsci.plugins.gitclient.CliGitAPIImpl.launchCommand(CliGitAPIImpl.java:1597)
	at org.jenkinsci.plugins.gitclient.CliGitAPIImpl.launchCommand(CliGitAPIImpl.java:1609)
	at org.jenkinsci.plugins.gitclient.CliGitAPIImpl.setRemoteUrl(CliGitAPIImpl.java:1243)
	at hudson.plugins.git.GitAPI.setRemoteUrl(GitAPI.java:160)
	at sun.reflect.GeneratedMethodAccessor536.invoke(Unknown Source)
	at sun.reflect.DelegatingMethodAccessorImpl.invoke(DelegatingMethodAccessorImpl.java:43)
	at java.lang.reflect.Method.invoke(Method.java:498)
	at hudson.remoting.RemoteInvocationHandler$RPCRequest.perform(RemoteInvocationHandler.java:929)
	at hudson.remoting.RemoteInvocationHandler$RPCRequest.call(RemoteInvocationHandler.java:903)
	at hudson.remoting.RemoteInvocationHandler$RPCRequest.call(RemoteInvocationHandler.java:855)
	at hudson.remoting.UserRequest.perform(UserRequest.java:212)
	at hudson.remoting.UserRequest.perform(UserRequest.java:54)
	at hudson.remoting.Request$2.run(Request.java:369)
	at hudson.remoting.InterceptingExecutorService$1.call(InterceptingExecutorService.java:72)
	at java.util.concurrent.FutureTask.run(FutureTask.java:266)
	at java.util.concurrent.ThreadPoolExecutor.runWorker(ThreadPoolExecutor.java:1142)
	at java.util.concurrent.ThreadPoolExecutor$Worker.run(ThreadPoolExecutor.java:617)
	at java.lang.Thread.run(Thread.java:748)
	Suppressed: hudson.remoting.Channel$CallSiteStackTrace: Remote call to H25
		at hudson.remoting.Channel.attachCallSiteStackTrace(Channel.java:1741)
		at hudson.remoting.UserRequest$ExceptionResponse.retrieve(UserRequest.java:357)
		at hudson.remoting.Channel.call(Channel.java:955)
		at hudson.remoting.RemoteInvocationHandler.invoke(RemoteInvocationHandler.java:283)
		at com.sun.proxy.$Proxy118.setRemoteUrl(Unknown Source)
		at org.jenkinsci.plugins.gitclient.RemoteGitImpl.setRemoteUrl(RemoteGitImpl.java:295)
		at hudson.plugins.git.GitSCM.fetchFrom(GitSCM.java:876)
		at hudson.plugins.git.GitSCM.retrieveChanges(GitSCM.java:1155)
		at hudson.plugins.git.GitSCM.checkout(GitSCM.java:1186)
		at hudson.scm.SCM.checkout(SCM.java:504)
		at hudson.model.AbstractProject.checkout(AbstractProject.java:1208)
		at hudson.model.AbstractBuild$AbstractBuildExecution.defaultCheckout(AbstractBuild.java:574)
		at jenkins.scm.SCMCheckoutStrategy.checkout(SCMCheckoutStrategy.java:86)
		at hudson.model.AbstractBuild$AbstractBuildExecution.run(AbstractBuild.java:499)
		at hudson.model.Run.execute(Run.java:1794)
		at hudson.maven.MavenModuleSetBuild.run(MavenModuleSetBuild.java:543)
		at hudson.model.ResourceController.execute(ResourceController.java:97)
		at hudson.model.Executor.run(Executor.java:429)
ERROR: Error fetching remote repo 'origin'
Retrying after 10 seconds
 > git rev-parse --is-inside-work-tree # timeout=10
Fetching changes from the remote Git repository
 > git config remote.origin.url https://github.com/apache/sling-org-apache-sling-commons-messaging-mail.git # timeout=10
ERROR: Error fetching remote repo 'origin'
hudson.plugins.git.GitException: Failed to fetch from https://github.com/apache/sling-org-apache-sling-commons-messaging-mail.git
	at hudson.plugins.git.GitSCM.fetchFrom(GitSCM.java:888)
	at hudson.plugins.git.GitSCM.retrieveChanges(GitSCM.java:1155)
	at hudson.plugins.git.GitSCM.checkout(GitSCM.java:1186)
	at hudson.scm.SCM.checkout(SCM.java:504)
	at hudson.model.AbstractProject.checkout(AbstractProject.java:1208)
	at hudson.model.AbstractBuild$AbstractBuildExecution.defaultCheckout(AbstractBuild.java:574)
	at jenkins.scm.SCMCheckoutStrategy.checkout(SCMCheckoutStrategy.java:86)
	at hudson.model.AbstractBuild$AbstractBuildExecution.run(AbstractBuild.java:499)
	at hudson.model.Run.execute(Run.java:1794)
	at hudson.maven.MavenModuleSetBuild.run(MavenModuleSetBuild.java:543)
	at hudson.model.ResourceController.execute(ResourceController.java:97)
	at hudson.model.Executor.run(Executor.java:429)
Caused by: hudson.plugins.git.GitException: Command "git config remote.origin.url https://github.com/apache/sling-org-apache-sling-commons-messaging-mail.git" returned status code 4:
stdout: 
stderr: error: failed to write new configuration file <https://builds.apache.org/job/sling-org-apache-sling-commons-messaging-mail-1.8/ws/.git/config.lock>

	at org.jenkinsci.plugins.gitclient.CliGitAPIImpl.launchCommandIn(CliGitAPIImpl.java:2002)
	at org.jenkinsci.plugins.gitclient.CliGitAPIImpl.launchCommandIn(CliGitAPIImpl.java:1970)
	at org.jenkinsci.plugins.gitclient.CliGitAPIImpl.launchCommandIn(CliGitAPIImpl.java:1966)
	at org.jenkinsci.plugins.gitclient.CliGitAPIImpl.launchCommand(CliGitAPIImpl.java:1597)
	at org.jenkinsci.plugins.gitclient.CliGitAPIImpl.launchCommand(CliGitAPIImpl.java:1609)
	at org.jenkinsci.plugins.gitclient.CliGitAPIImpl.setRemoteUrl(CliGitAPIImpl.java:1243)
	at hudson.plugins.git.GitAPI.setRemoteUrl(GitAPI.java:160)
	at sun.reflect.GeneratedMethodAccessor536.invoke(Unknown Source)
	at sun.reflect.DelegatingMethodAccessorImpl.invoke(DelegatingMethodAccessorImpl.java:43)
	at java.lang.reflect.Method.invoke(Method.java:498)
	at hudson.remoting.RemoteInvocationHandler$RPCRequest.perform(RemoteInvocationHandler.java:929)
	at hudson.remoting.RemoteInvocationHandler$RPCRequest.call(RemoteInvocationHandler.java:903)
	at hudson.remoting.RemoteInvocationHandler$RPCRequest.call(RemoteInvocationHandler.java:855)
	at hudson.remoting.UserRequest.perform(UserRequest.java:212)
	at hudson.remoting.UserRequest.perform(UserRequest.java:54)
	at hudson.remoting.Request$2.run(Request.java:369)
	at hudson.remoting.InterceptingExecutorService$1.call(InterceptingExecutorService.java:72)
	at java.util.concurrent.FutureTask.run(FutureTask.java:266)
	at java.util.concurrent.ThreadPoolExecutor.runWorker(ThreadPoolExecutor.java:1142)
	at java.util.concurrent.ThreadPoolExecutor$Worker.run(ThreadPoolExecutor.java:617)
	at java.lang.Thread.run(Thread.java:748)
	Suppressed: hudson.remoting.Channel$CallSiteStackTrace: Remote call to H25
		at hudson.remoting.Channel.attachCallSiteStackTrace(Channel.java:1741)
		at hudson.remoting.UserRequest$ExceptionResponse.retrieve(UserRequest.java:357)
		at hudson.remoting.Channel.call(Channel.java:955)
		at hudson.remoting.RemoteInvocationHandler.invoke(RemoteInvocationHandler.java:283)
		at com.sun.proxy.$Proxy118.setRemoteUrl(Unknown Source)
		at org.jenkinsci.plugins.gitclient.RemoteGitImpl.setRemoteUrl(RemoteGitImpl.java:295)
		at hudson.plugins.git.GitSCM.fetchFrom(GitSCM.java:876)
		at hudson.plugins.git.GitSCM.retrieveChanges(GitSCM.java:1155)
		at hudson.plugins.git.GitSCM.checkout(GitSCM.java:1186)
		at hudson.scm.SCM.checkout(SCM.java:504)
		at hudson.model.AbstractProject.checkout(AbstractProject.java:1208)
		at hudson.model.AbstractBuild$AbstractBuildExecution.defaultCheckout(AbstractBuild.java:574)
		at jenkins.scm.SCMCheckoutStrategy.checkout(SCMCheckoutStrategy.java:86)
		at hudson.model.AbstractBuild$AbstractBuildExecution.run(AbstractBuild.java:499)
		at hudson.model.Run.execute(Run.java:1794)
		at hudson.maven.MavenModuleSetBuild.run(MavenModuleSetBuild.java:543)
		at hudson.model.ResourceController.execute(ResourceController.java:97)
		at hudson.model.Executor.run(Executor.java:429)
ERROR: Error fetching remote repo 'origin'
Retrying after 10 seconds
 > git rev-parse --is-inside-work-tree # timeout=10
Fetching changes from the remote Git repository
 > git config remote.origin.url https://github.com/apache/sling-org-apache-sling-commons-messaging-mail.git # timeout=10
ERROR: Error fetching remote repo 'origin'
hudson.plugins.git.GitException: Failed to fetch from https://github.com/apache/sling-org-apache-sling-commons-messaging-mail.git
	at hudson.plugins.git.GitSCM.fetchFrom(GitSCM.java:888)
	at hudson.plugins.git.GitSCM.retrieveChanges(GitSCM.java:1155)
	at hudson.plugins.git.GitSCM.checkout(GitSCM.java:1186)
	at hudson.scm.SCM.checkout(SCM.java:504)
	at hudson.model.AbstractProject.checkout(AbstractProject.java:1208)
	at hudson.model.AbstractBuild$AbstractBuildExecution.defaultCheckout(AbstractBuild.java:574)
	at jenkins.scm.SCMCheckoutStrategy.checkout(SCMCheckoutStrategy.java:86)
	at hudson.model.AbstractBuild$AbstractBuildExecution.run(AbstractBuild.java:499)
	at hudson.model.Run.execute(Run.java:1794)
	at hudson.maven.MavenModuleSetBuild.run(MavenModuleSetBuild.java:543)
	at hudson.model.ResourceController.execute(ResourceController.java:97)
	at hudson.model.Executor.run(Executor.java:429)
Caused by: hudson.plugins.git.GitException: Command "git config remote.origin.url https://github.com/apache/sling-org-apache-sling-commons-messaging-mail.git" returned status code 4:
stdout: 
stderr: error: failed to write new configuration file <https://builds.apache.org/job/sling-org-apache-sling-commons-messaging-mail-1.8/ws/.git/config.lock>

	at org.jenkinsci.plugins.gitclient.CliGitAPIImpl.launchCommandIn(CliGitAPIImpl.java:2002)
	at org.jenkinsci.plugins.gitclient.CliGitAPIImpl.launchCommandIn(CliGitAPIImpl.java:1970)
	at org.jenkinsci.plugins.gitclient.CliGitAPIImpl.launchCommandIn(CliGitAPIImpl.java:1966)
	at org.jenkinsci.plugins.gitclient.CliGitAPIImpl.launchCommand(CliGitAPIImpl.java:1597)
	at org.jenkinsci.plugins.gitclient.CliGitAPIImpl.launchCommand(CliGitAPIImpl.java:1609)
	at org.jenkinsci.plugins.gitclient.CliGitAPIImpl.setRemoteUrl(CliGitAPIImpl.java:1243)
	at hudson.plugins.git.GitAPI.setRemoteUrl(GitAPI.java:160)
	at sun.reflect.GeneratedMethodAccessor536.invoke(Unknown Source)
	at sun.reflect.DelegatingMethodAccessorImpl.invoke(DelegatingMethodAccessorImpl.java:43)
	at java.lang.reflect.Method.invoke(Method.java:498)
	at hudson.remoting.RemoteInvocationHandler$RPCRequest.perform(RemoteInvocationHandler.java:929)
	at hudson.remoting.RemoteInvocationHandler$RPCRequest.call(RemoteInvocationHandler.java:903)
	at hudson.remoting.RemoteInvocationHandler$RPCRequest.call(RemoteInvocationHandler.java:855)
	at hudson.remoting.UserRequest.perform(UserRequest.java:212)
	at hudson.remoting.UserRequest.perform(UserRequest.java:54)
	at hudson.remoting.Request$2.run(Request.java:369)
	at hudson.remoting.InterceptingExecutorService$1.call(InterceptingExecutorService.java:72)
	at java.util.concurrent.FutureTask.run(FutureTask.java:266)
	at java.util.concurrent.ThreadPoolExecutor.runWorker(ThreadPoolExecutor.java:1142)
	at java.util.concurrent.ThreadPoolExecutor$Worker.run(ThreadPoolExecutor.java:617)
	at java.lang.Thread.run(Thread.java:748)
	Suppressed: hudson.remoting.Channel$CallSiteStackTrace: Remote call to H25
		at hudson.remoting.Channel.attachCallSiteStackTrace(Channel.java:1741)
		at hudson.remoting.UserRequest$ExceptionResponse.retrieve(UserRequest.java:357)
		at hudson.remoting.Channel.call(Channel.java:955)
		at hudson.remoting.RemoteInvocationHandler.invoke(RemoteInvocationHandler.java:283)
		at com.sun.proxy.$Proxy118.setRemoteUrl(Unknown Source)
		at org.jenkinsci.plugins.gitclient.RemoteGitImpl.setRemoteUrl(RemoteGitImpl.java:295)
		at hudson.plugins.git.GitSCM.fetchFrom(GitSCM.java:876)
		at hudson.plugins.git.GitSCM.retrieveChanges(GitSCM.java:1155)
		at hudson.plugins.git.GitSCM.checkout(GitSCM.java:1186)
		at hudson.scm.SCM.checkout(SCM.java:504)
		at hudson.model.AbstractProject.checkout(AbstractProject.java:1208)
		at hudson.model.AbstractBuild$AbstractBuildExecution.defaultCheckout(AbstractBuild.java:574)
		at jenkins.scm.SCMCheckoutStrategy.checkout(SCMCheckoutStrategy.java:86)
		at hudson.model.AbstractBuild$AbstractBuildExecution.run(AbstractBuild.java:499)
		at hudson.model.Run.execute(Run.java:1794)
		at hudson.maven.MavenModuleSetBuild.run(MavenModuleSetBuild.java:543)
		at hudson.model.ResourceController.execute(ResourceController.java:97)
		at hudson.model.Executor.run(Executor.java:429)
ERROR: Error fetching remote repo 'origin'
Recording test results
ERROR: Step ?Publish JUnit test result report? failed: Test reports were found but none of them are new. Did leafNodes run? 
For example, <https://builds.apache.org/job/sling-org-apache-sling-commons-messaging-mail-1.8/ws/target/failsafe-reports/TEST-org.apache.sling.commons.messaging.mail.internal.SimpleMailBuilderIT.xml> is 12 days old


Build failed in Jenkins: sling-org-apache-sling-commons-messaging-mail-1.8 #105

Posted by Apache Jenkins Server <je...@builds.apache.org>.
See <https://builds.apache.org/job/sling-org-apache-sling-commons-messaging-mail-1.8/105/display/redirect?page=changes>

Changes:

[radu] SLING-7215 - [nice-to-have] Add a CONTRIBUTING file to every module

------------------------------------------
[...truncated 84.04 KB...]
org.ops4j.pax.logging.pax-logging-api[org.ops4j.pax.swissbox.extender.BundleWatcher] : Releasing bundle [PAXEXAM-PROBE-63e66986-1734-48df-b712-0056de9eb044]
org.ops4j.pax.logging.pax-logging-api[org.ops4j.pax.swissbox.extender.BundleWatcher] : Un-registering [ManifestEntry{ key=PaxExam-Executable, value=PaxExam-34af8067-f4d2-44fb-bfc1-782a945511af,PaxExam-4505ec73-16b8-421d-b07c-144f34b8a471,PaxExam-a59d5b99-30f1-4dae-9d26-fd407eaf4fbb,PaxExam-af69977b-5624-4e5d-9896-2fa7d50927a9,PaxExam-f3bb4785-61b5-4b28-b47a-683f03c2883a, }, ManifestEntry{ key=PaxExam-af69977b-5624-4e5d-9896-2fa7d50927a9, value=org.apache.sling.commons.messaging.mail.internal.SimpleMailServiceIT;send }, ManifestEntry{ key=PaxExam-f3bb4785-61b5-4b28-b47a-683f03c2883a, value=org.apache.sling.commons.messaging.mail.internal.SimpleMailServiceIT;sendWithoutAuthentication }, ManifestEntry{ key=PaxExam-a59d5b99-30f1-4dae-9d26-fd407eaf4fbb, value=org.apache.sling.commons.messaging.mail.internal.SimpleMailServiceIT;sendWithData }, ManifestEntry{ key=PaxExam-34af8067-f4d2-44fb-bfc1-782a945511af, value=org.apache.sling.commons.messaging.mail.internal.SimpleMailBuilderIT;testBuildWithDefaults }, ManifestEntry{ key=PaxExam-4505ec73-16b8-421d-b07c-144f34b8a471, value=org.apache.sling.commons.messaging.mail.internal.SimpleMailBuilderIT;testBuildWithData }]
org.ops4j.pax.logging.pax-logging-api[org.ops4j.pax.exam.raw.extender.intern.TestBundleObserver] : Unregistered testcase [org.ops4j.pax.exam.raw.extender.intern.Probe@4f575443.]
org.ops4j.pax.logging.pax-logging-api[org.ops4j.pax.swissbox.extender.BundleWatcher] : Releasing bundle [org.ops4j.pax.exam.extender.service]
org.ops4j.pax.logging.pax-logging-api[org.ops4j.pax.swissbox.extender.BundleWatcher] : Releasing bundle [org.apache.felix.framework]

[main] INFO org.ops4j.exec.DefaultJavaRunner - Platform has been shutdown.
[main] INFO org.ops4j.exec.DefaultJavaRunner - DefaultJavaRunner completed successfully

[org.ops4j.pax.swissbox.extender.BundleWatcher] : Creating bundle watcher with scanner [org.ops4j.pax.swissbox.extender.BundleManifestScanner@51510093]...
[org.ops4j.pax.swissbox.extender.BundleWatcher] : Scanning bundle [org.apache.felix.framework]
[org.ops4j.pax.swissbox.extender.BundleWatcher] : Scanning bundle [org.ops4j.pax.exam]
[org.ops4j.pax.swissbox.extender.BundleWatcher] : Scanning bundle [org.ops4j.pax.exam.inject]
[org.ops4j.pax.swissbox.extender.BundleWatcher] : Scanning bundle [org.ops4j.pax.exam.extender.service]
[org.ops4j.pax.swissbox.extender.BundleWatcher] : Scanning bundle [osgi.cmpn]
org.ops4j.pax.logging.pax-logging-api[org.ops4j.pax.logging.internal.Activator] : Enabling SLF4J API support.
org.ops4j.pax.logging.pax-logging-api[org.ops4j.pax.logging.internal.Activator] : Enabling Jakarta Commons Logging API support.
org.ops4j.pax.logging.pax-logging-api[org.ops4j.pax.logging.internal.Activator] : Enabling Log4J API support.
org.ops4j.pax.logging.pax-logging-api[org.ops4j.pax.logging.internal.Activator] : Enabling Avalon Logger API support.
org.ops4j.pax.logging.pax-logging-api[org.ops4j.pax.logging.internal.Activator] : Enabling JULI Logger API support.
org.ops4j.pax.logging.pax-logging-api[org.ops4j.pax.swissbox.extender.BundleWatcher] : Scanning bundle [org.ops4j.pax.logging.pax-logging-api]
org.ops4j.pax.logging.pax-logging-api[org.ops4j.pax.swissbox.extender.BundleWatcher] : Scanning bundle [org.ops4j.base]
org.ops4j.pax.logging.pax-logging-api[org.ops4j.pax.swissbox.extender.BundleWatcher] : Scanning bundle [org.ops4j.pax.swissbox.core]
org.ops4j.pax.logging.pax-logging-api[org.ops4j.pax.swissbox.extender.BundleWatcher] : Scanning bundle [org.ops4j.pax.swissbox.extender]
org.ops4j.pax.logging.pax-logging-api[org.ops4j.pax.swissbox.extender.BundleWatcher] : Scanning bundle [org.ops4j.pax.swissbox.framework]
org.ops4j.pax.logging.pax-logging-api[org.ops4j.pax.swissbox.extender.BundleWatcher] : Scanning bundle [org.ops4j.pax.swissbox.lifecycle]
org.ops4j.pax.logging.pax-logging-api[org.ops4j.pax.swissbox.extender.BundleWatcher] : Scanning bundle [org.ops4j.pax.swissbox.tracker]
org.ops4j.pax.logging.pax-logging-api[org.ops4j.pax.swissbox.extender.BundleWatcher] : Scanning bundle [org.apache.geronimo.specs.geronimo-atinject_1.0_spec]
org.ops4j.pax.logging.pax-logging-api[org.ops4j.pax.swissbox.extender.BundleWatcher] : Scanning bundle [org.ops4j.pax.tipi.junit]
org.ops4j.pax.logging.pax-logging-api[org.ops4j.pax.swissbox.extender.BundleWatcher] : Scanning bundle [org.ops4j.pax.tipi.hamcrest.core]
org.ops4j.pax.logging.pax-logging-api[org.ops4j.pax.swissbox.extender.BundleWatcher] : Scanning bundle [org.ops4j.pax.exam.invoker.junit]
org.ops4j.pax.logging.pax-logging-api[org.ops4j.pax.swissbox.extender.BundleWatcher] : Scanning bundle [wrap_mvn_org.subethamail_subethasmtp_3.1.7]
org.ops4j.pax.logging.pax-logging-api[org.ops4j.pax.swissbox.extender.BundleWatcher] : Scanning bundle [org.apache.felix.configadmin]
org.ops4j.pax.logging.pax-logging-api[org.ops4j.pax.swissbox.extender.BundleWatcher] : Scanning bundle [org.apache.felix.scr]
org.ops4j.pax.logging.pax-logging-api[org.ops4j.pax.swissbox.extender.BundleWatcher] : Scanning bundle [com.sun.mail.javax.mail]
org.ops4j.pax.logging.pax-logging-api[org.ops4j.pax.swissbox.extender.BundleWatcher] : Scanning bundle [javax.mail-api]
org.ops4j.pax.logging.pax-logging-api[org.ops4j.pax.swissbox.extender.BundleWatcher] : Scanning bundle [org.apache.commons.email]
org.ops4j.pax.logging.pax-logging-api[org.ops4j.pax.swissbox.extender.BundleWatcher] : Scanning bundle [org.apache.commons.lang3]
org.ops4j.pax.logging.pax-logging-api[org.ops4j.pax.swissbox.extender.BundleWatcher] : Scanning bundle [org.apache.sling.commons.messaging]
org.apache.sling.commons.threads[org.apache.sling.commons.threads.impl.DefaultThreadPoolManager] : Started Apache Sling Thread Pool Manager
org.ops4j.pax.logging.pax-logging-api[org.ops4j.pax.swissbox.extender.BundleWatcher] : Scanning bundle [org.apache.sling.commons.threads]
org.ops4j.pax.logging.pax-logging-api[org.ops4j.pax.swissbox.extender.BundleWatcher] : Scanning bundle [org.apache.sling.commons.messaging.mail]
org.ops4j.pax.logging.pax-logging-api[org.ops4j.pax.swissbox.extender.BundleWatcher] : Scanning bundle [PAXEXAM-PROBE-63e66986-1734-48df-b712-0056de9eb044]
org.ops4j.pax.logging.pax-logging-api[org.ops4j.pax.swissbox.extender.BundleWatcher] : Found resources [ManifestEntry{ key=PaxExam-Executable, value=PaxExam-34af8067-f4d2-44fb-bfc1-782a945511af,PaxExam-4505ec73-16b8-421d-b07c-144f34b8a471,PaxExam-a59d5b99-30f1-4dae-9d26-fd407eaf4fbb,PaxExam-af69977b-5624-4e5d-9896-2fa7d50927a9,PaxExam-f3bb4785-61b5-4b28-b47a-683f03c2883a, }, ManifestEntry{ key=PaxExam-af69977b-5624-4e5d-9896-2fa7d50927a9, value=org.apache.sling.commons.messaging.mail.internal.SimpleMailServiceIT;send }, ManifestEntry{ key=PaxExam-f3bb4785-61b5-4b28-b47a-683f03c2883a, value=org.apache.sling.commons.messaging.mail.internal.SimpleMailServiceIT;sendWithoutAuthentication }, ManifestEntry{ key=PaxExam-a59d5b99-30f1-4dae-9d26-fd407eaf4fbb, value=org.apache.sling.commons.messaging.mail.internal.SimpleMailServiceIT;sendWithData }, ManifestEntry{ key=PaxExam-34af8067-f4d2-44fb-bfc1-782a945511af, value=org.apache.sling.commons.messaging.mail.internal.SimpleMailBuilderIT;testBuildWithDefaults }, ManifestEntry{ key=PaxExam-4505ec73-16b8-421d-b07c-144f34b8a471, value=org.apache.sling.commons.messaging.mail.internal.SimpleMailBuilderIT;testBuildWithData }]
org.ops4j.pax.exam.extender.service[org.ops4j.pax.exam.raw.extender.intern.Probe] : Test PaxExam-Executable to be in PaxExam-34af8067-f4d2-44fb-bfc1-782a945511af,PaxExam-4505ec73-16b8-421d-b07c-144f34b8a471,PaxExam-a59d5b99-30f1-4dae-9d26-fd407eaf4fbb,PaxExam-af69977b-5624-4e5d-9896-2fa7d50927a9,PaxExam-f3bb4785-61b5-4b28-b47a-683f03c2883a,
org.ops4j.pax.exam.extender.service[org.ops4j.pax.exam.raw.extender.intern.Probe] : Test PaxExam-af69977b-5624-4e5d-9896-2fa7d50927a9 to be in PaxExam-34af8067-f4d2-44fb-bfc1-782a945511af,PaxExam-4505ec73-16b8-421d-b07c-144f34b8a471,PaxExam-a59d5b99-30f1-4dae-9d26-fd407eaf4fbb,PaxExam-af69977b-5624-4e5d-9896-2fa7d50927a9,PaxExam-f3bb4785-61b5-4b28-b47a-683f03c2883a,
org.ops4j.pax.exam.extender.service[org.ops4j.pax.exam.raw.extender.intern.Probe] : Registering Service: org.ops4j.pax.exam.ProbeInvoker with Probe-Signature="PaxExam-af69977b-5624-4e5d-9896-2fa7d50927a9" and expression="org.apache.sling.commons.messaging.mail.internal.SimpleMailServiceIT;send"
org.ops4j.pax.exam.extender.service[org.ops4j.pax.exam.raw.extender.intern.Probe] : Test PaxExam-f3bb4785-61b5-4b28-b47a-683f03c2883a to be in PaxExam-34af8067-f4d2-44fb-bfc1-782a945511af,PaxExam-4505ec73-16b8-421d-b07c-144f34b8a471,PaxExam-a59d5b99-30f1-4dae-9d26-fd407eaf4fbb,PaxExam-af69977b-5624-4e5d-9896-2fa7d50927a9,PaxExam-f3bb4785-61b5-4b28-b47a-683f03c2883a,
org.ops4j.pax.exam.extender.service[org.ops4j.pax.exam.raw.extender.intern.Probe] : Registering Service: org.ops4j.pax.exam.ProbeInvoker with Probe-Signature="PaxExam-f3bb4785-61b5-4b28-b47a-683f03c2883a" and expression="org.apache.sling.commons.messaging.mail.internal.SimpleMailServiceIT;sendWithoutAuthentication"
org.ops4j.pax.exam.extender.service[org.ops4j.pax.exam.raw.extender.intern.Probe] : Test PaxExam-a59d5b99-30f1-4dae-9d26-fd407eaf4fbb to be in PaxExam-34af8067-f4d2-44fb-bfc1-782a945511af,PaxExam-4505ec73-16b8-421d-b07c-144f34b8a471,PaxExam-a59d5b99-30f1-4dae-9d26-fd407eaf4fbb,PaxExam-af69977b-5624-4e5d-9896-2fa7d50927a9,PaxExam-f3bb4785-61b5-4b28-b47a-683f03c2883a,
org.ops4j.pax.exam.extender.service[org.ops4j.pax.exam.raw.extender.intern.Probe] : Registering Service: org.ops4j.pax.exam.ProbeInvoker with Probe-Signature="PaxExam-a59d5b99-30f1-4dae-9d26-fd407eaf4fbb" and expression="org.apache.sling.commons.messaging.mail.internal.SimpleMailServiceIT;sendWithData"
org.ops4j.pax.exam.extender.service[org.ops4j.pax.exam.raw.extender.intern.Probe] : Test PaxExam-34af8067-f4d2-44fb-bfc1-782a945511af to be in PaxExam-34af8067-f4d2-44fb-bfc1-782a945511af,PaxExam-4505ec73-16b8-421d-b07c-144f34b8a471,PaxExam-a59d5b99-30f1-4dae-9d26-fd407eaf4fbb,PaxExam-af69977b-5624-4e5d-9896-2fa7d50927a9,PaxExam-f3bb4785-61b5-4b28-b47a-683f03c2883a,
org.ops4j.pax.exam.extender.service[org.ops4j.pax.exam.raw.extender.intern.Probe] : Registering Service: org.ops4j.pax.exam.ProbeInvoker with Probe-Signature="PaxExam-34af8067-f4d2-44fb-bfc1-782a945511af" and expression="org.apache.sling.commons.messaging.mail.internal.SimpleMailBuilderIT;testBuildWithDefaults"
org.ops4j.pax.exam.extender.service[org.ops4j.pax.exam.raw.extender.intern.Probe] : Test PaxExam-4505ec73-16b8-421d-b07c-144f34b8a471 to be in PaxExam-34af8067-f4d2-44fb-bfc1-782a945511af,PaxExam-4505ec73-16b8-421d-b07c-144f34b8a471,PaxExam-a59d5b99-30f1-4dae-9d26-fd407eaf4fbb,PaxExam-af69977b-5624-4e5d-9896-2fa7d50927a9,PaxExam-f3bb4785-61b5-4b28-b47a-683f03c2883a,
org.ops4j.pax.exam.extender.service[org.ops4j.pax.exam.raw.extender.intern.Probe] : Registering Service: org.ops4j.pax.exam.ProbeInvoker with Probe-Signature="PaxExam-4505ec73-16b8-421d-b07c-144f34b8a471" and expression="org.apache.sling.commons.messaging.mail.internal.SimpleMailBuilderIT;testBuildWithData"
org.ops4j.pax.exam.invoker.junit[org.ops4j.pax.exam.invoker.junit.internal.ContainerTestRunner] : running sendWithoutAuthentication in reactor
wrap_mvn_org.subethamail_subethasmtp_3.1.7[org.subethamail.smtp.server.CommandHandler] : Added command: AUTH
wrap_mvn_org.subethamail_subethasmtp_3.1.7[org.subethamail.smtp.server.CommandHandler] : Added command: DATA
wrap_mvn_org.subethamail_subethasmtp_3.1.7[org.subethamail.smtp.server.CommandHandler] : Added command: EHLO
wrap_mvn_org.subethamail_subethasmtp_3.1.7[org.subethamail.smtp.server.CommandHandler] : Added command: HELO
wrap_mvn_org.subethamail_subethasmtp_3.1.7[org.subethamail.smtp.server.CommandHandler] : Added command: HELP
wrap_mvn_org.subethamail_subethasmtp_3.1.7[org.subethamail.smtp.server.CommandHandler] : Added command: MAIL
wrap_mvn_org.subethamail_subethasmtp_3.1.7[org.subethamail.smtp.server.CommandHandler] : Added command: NOOP
wrap_mvn_org.subethamail_subethasmtp_3.1.7[org.subethamail.smtp.server.CommandHandler] : Added command: QUIT
wrap_mvn_org.subethamail_subethasmtp_3.1.7[org.subethamail.smtp.server.CommandHandler] : Added command: RCPT
wrap_mvn_org.subethamail_subethasmtp_3.1.7[org.subethamail.smtp.server.CommandHandler] : Added command: RSET
wrap_mvn_org.subethamail_subethasmtp_3.1.7[org.subethamail.smtp.server.CommandHandler] : Added command: STARTTLS
wrap_mvn_org.subethamail_subethasmtp_3.1.7[org.subethamail.smtp.server.CommandHandler] : Added command: VRFY
wrap_mvn_org.subethamail_subethasmtp_3.1.7[org.subethamail.smtp.server.SMTPServer] : SMTP server *:45667 starting
wrap_mvn_org.subethamail_subethasmtp_3.1.7[org.subethamail.smtp.server.ServerThread] : SMTP server *:45667 started
PAXEXAM-PROBE-63e66986-1734-48df-b712-0056de9eb044[org.apache.sling.commons.messaging.mail.internal.SimpleMailServiceIT] : configuration: Configuration PID=org.apache.sling.commons.messaging.mail.internal.SimpleMailBuilder, factoryPID=null, bundleLocation=local
org.apache.sling.commons.messaging.mail[org.apache.sling.commons.messaging.mail.internal.SimpleMailBuilder] : activate
org.apache.sling.commons.messaging.mail[org.apache.sling.commons.messaging.mail.internal.SimpleMailService] : activate
org.apache.sling.commons.threads[org.apache.sling.commons.threads.impl.DefaultThreadPoolManager] : Creating new pool with name default
org.apache.sling.commons.threads[org.apache.sling.commons.threads.impl.DefaultThreadPool] : Initializing thread pool [default]  ...
org.apache.sling.commons.threads[org.apache.sling.commons.threads.impl.DefaultThreadPool] : Thread pool [default] ; No ThreadFactory is configured. Will use JVM default thread factory: org.apache.sling.commons.threads.impl.ExtendedThreadFactory
org.apache.sling.commons.threads[org.apache.sling.commons.threads.impl.DefaultThreadPool] : Thread pool [default] initialized.
org.apache.sling.commons.threads[org.apache.sling.commons.threads.impl.DefaultThreadPool] : Submitting runnable:  java.util.concurrent.CompletableFuture$AsyncSupply@471cce9e, pool=default, active=0, corePoolSize=5, maxPoolSize=5, queueSize=0
org.apache.sling.commons.threads[org.apache.sling.commons.threads.impl.ThreadExpiringThreadPool] : Thread[sling-default-1,5,RMI Runtime] used for the first time.
PAXEXAM-PROBE-63e66986-1734-48df-b712-0056de9eb044[org.apache.sling.commons.messaging.mail.internal.SimpleMailServiceIT] : org.apache.commons.mail.EmailException: Sending the email to the following server failed : localhost:25
java.util.concurrent.ExecutionException: org.apache.commons.mail.EmailException: Sending the email to the following server failed : localhost:25
	at java.util.concurrent.CompletableFuture.reportGet(CompletableFuture.java:357)
	at java.util.concurrent.CompletableFuture.get(CompletableFuture.java:1895)
	at org.apache.sling.commons.messaging.mail.internal.SimpleMailServiceIT.sendWithoutAuthentication(SimpleMailServiceIT.java:105)
	at sun.reflect.NativeMethodAccessorImpl.invoke0(Native Method)
	at sun.reflect.NativeMethodAccessorImpl.invoke(NativeMethodAccessorImpl.java:62)
	at sun.reflect.DelegatingMethodAccessorImpl.invoke(DelegatingMethodAccessorImpl.java:43)
	at java.lang.reflect.Method.invoke(Method.java:498)
	at org.junit.runners.model.FrameworkMethod$1.runReflectiveCall(FrameworkMethod.java:50)
	at org.junit.internal.runners.model.ReflectiveCallable.run(ReflectiveCallable.java:12)
	at org.junit.runners.model.FrameworkMethod.invokeExplosively(FrameworkMethod.java:47)
	at org.junit.internal.runners.statements.InvokeMethod.evaluate(InvokeMethod.java:17)
	at org.junit.internal.runners.statements.RunBefores.evaluate(RunBefores.java:26)
	at org.junit.internal.runners.statements.RunAfters.evaluate(RunAfters.java:27)
	at org.junit.runners.ParentRunner.runLeaf(ParentRunner.java:325)
	at org.junit.runners.BlockJUnit4ClassRunner.runChild(BlockJUnit4ClassRunner.java:78)
	at org.ops4j.pax.exam.invoker.junit.internal.ContainerTestRunner.runChild(ContainerTestRunner.java:68)
	at org.ops4j.pax.exam.invoker.junit.internal.ContainerTestRunner.runChild(ContainerTestRunner.java:37)
	at org.junit.runners.ParentRunner$3.run(ParentRunner.java:290)
	at org.junit.runners.ParentRunner$1.schedule(ParentRunner.java:71)
	at org.junit.runners.ParentRunner.runChildren(ParentRunner.java:288)
	at org.junit.runners.ParentRunner.access$000(ParentRunner.java:58)
	at org.junit.runners.ParentRunner$2.evaluate(ParentRunner.java:268)
	at org.junit.runners.ParentRunner.run(ParentRunner.java:363)
	at org.junit.runner.JUnitCore.run(JUnitCore.java:137)
	at org.junit.runner.JUnitCore.run(JUnitCore.java:115)
	at org.ops4j.pax.exam.invoker.junit.internal.JUnitProbeInvoker.invokeViaJUnit(JUnitProbeInvoker.java:124)
	at org.ops4j.pax.exam.invoker.junit.internal.JUnitProbeInvoker.findAndInvoke(JUnitProbeInvoker.java:97)
	at org.ops4j.pax.exam.invoker.junit.internal.JUnitProbeInvoker.call(JUnitProbeInvoker.java:73)
	at sun.reflect.NativeMethodAccessorImpl.invoke0(Native Method)
	at sun.reflect.NativeMethodAccessorImpl.invoke(NativeMethodAccessorImpl.java:62)
	at sun.reflect.DelegatingMethodAccessorImpl.invoke(DelegatingMethodAccessorImpl.java:43)
	at java.lang.reflect.Method.invoke(Method.java:498)
	at org.ops4j.pax.swissbox.framework.RemoteFrameworkImpl.invokeMethodOnService(RemoteFrameworkImpl.java:433)
	at org.ops4j.pax.swissbox.framework.RemoteFrameworkImpl.invokeMethodOnService(RemoteFrameworkImpl.java:406)
	at sun.reflect.NativeMethodAccessorImpl.invoke0(Native Method)
	at sun.reflect.NativeMethodAccessorImpl.invoke(NativeMethodAccessorImpl.java:62)
	at sun.reflect.DelegatingMethodAccessorImpl.invoke(DelegatingMethodAccessorImpl.java:43)
	at java.lang.reflect.Method.invoke(Method.java:498)
	at sun.rmi.server.UnicastServerRef.dispatch(UnicastServerRef.java:357)
	at sun.rmi.transport.Transport$1.run(Transport.java:200)
	at sun.rmi.transport.Transport$1.run(Transport.java:197)
	at java.security.AccessController.doPrivileged(Native Method)
	at sun.rmi.transport.Transport.serviceCall(Transport.java:196)
	at sun.rmi.transport.tcp.TCPTransport.handleMessages(TCPTransport.java:573)
	at sun.rmi.transport.tcp.TCPTransport$ConnectionHandler.run0(TCPTransport.java:835)
	at sun.rmi.transport.tcp.TCPTransport$ConnectionHandler.lambda$run$0(TCPTransport.java:688)
	at java.security.AccessController.doPrivileged(Native Method)
	at sun.rmi.transport.tcp.TCPTransport$ConnectionHandler.run(TCPTransport.java:687)
	at java.util.concurrent.ThreadPoolExecutor.runWorker(ThreadPoolExecutor.java:1149)
	at java.util.concurrent.ThreadPoolExecutor$Worker.run(ThreadPoolExecutor.java:624)
	at java.lang.Thread.run(Thread.java:748)
Caused by: org.apache.commons.mail.EmailException: Sending the email to the following server failed : localhost:25
	at org.apache.commons.mail.Email.sendMimeMessage(Email.java:1421)
	at org.apache.commons.mail.Email.send(Email.java:1448)
	at org.apache.sling.commons.messaging.mail.internal.SimpleMailService.sendMail(SimpleMailService.java:123)
	at org.apache.sling.commons.messaging.mail.internal.SimpleMailService.lambda$send$0(SimpleMailService.java:117)
	at java.util.concurrent.CompletableFuture$AsyncSupply.run(CompletableFuture.java:1590)
	at java.util.concurrent.Executors$RunnableAdapter.call(Executors.java:511)
	at java.util.concurrent.FutureTask.run(FutureTask.java:266)
	... 3 more
Caused by: javax.mail.AuthenticationFailedException: failed to connect, no user name specified?
	at javax.mail.Service.connect(Service.java:397)
	at javax.mail.Service.connect(Service.java:246)
	at javax.mail.Service.connect(Service.java:195)
	at javax.mail.Transport.send0(Transport.java:254)
	at javax.mail.Transport.send(Transport.java:124)
	at org.apache.commons.mail.Email.sendMimeMessage(Email.java:1411)
	... 9 more
wrap_mvn_org.subethamail_subethasmtp_3.1.7[org.subethamail.smtp.server.SMTPServer] : SMTP server *:45667 stopping
wrap_mvn_org.subethamail_subethasmtp_3.1.7[org.subethamail.smtp.server.ServerThread] : SMTP Server socket shut down
wrap_mvn_org.subethamail_subethasmtp_3.1.7[org.subethamail.smtp.server.ServerThread] : SMTP server *:45667 stopped
org.apache.sling.commons.messaging.mail[org.apache.sling.commons.messaging.mail.internal.SimpleMailService] : deactivate
org.apache.sling.commons.threads[org.apache.sling.commons.threads.impl.DefaultThreadPool] : Shutting down thread pool [default] ...
org.apache.sling.commons.threads[org.apache.sling.commons.threads.impl.DefaultThreadPool] : Thread pool [default] is shut down.
org.ops4j.pax.logging.pax-logging-api[org.ops4j.pax.swissbox.extender.BundleWatcher] : Releasing bundle [org.apache.sling.commons.messaging.mail]
org.apache.sling.commons.threads[org.apache.sling.commons.threads.impl.DefaultThreadPoolManager] : Disposing all thread pools
org.apache.sling.commons.threads[org.apache.sling.commons.threads.impl.DefaultThreadPoolManager] : Stopped Apache Sling Thread Pool Manager
org.ops4j.pax.logging.pax-logging-api[org.ops4j.pax.swissbox.extender.BundleWatcher] : Releasing bundle [org.apache.sling.commons.threads]
org.ops4j.pax.logging.pax-logging-api[org.ops4j.pax.swissbox.extender.BundleWatcher] : Releasing bundle [org.apache.sling.commons.messaging]
org.ops4j.pax.logging.pax-logging-api[org.ops4j.pax.swissbox.extender.BundleWatcher] : Releasing bundle [org.apache.commons.lang3]
org.ops4j.pax.logging.pax-logging-api[org.ops4j.pax.swissbox.extender.BundleWatcher] : Releasing bundle [org.apache.commons.email]
org.ops4j.pax.logging.pax-logging-api[org.ops4j.pax.swissbox.extender.BundleWatcher] : Releasing bundle [javax.mail-api]
org.ops4j.pax.logging.pax-logging-api[org.ops4j.pax.swissbox.extender.BundleWatcher] : Releasing bundle [com.sun.mail.javax.mail]
org.ops4j.pax.logging.pax-logging-api[org.ops4j.pax.swissbox.extender.BundleWatcher] : Releasing bundle [org.apache.felix.scr]
org.ops4j.pax.logging.pax-logging-api[org.ops4j.pax.swissbox.extender.BundleWatcher] : Releasing bundle [org.apache.felix.configadmin]
org.ops4j.pax.logging.pax-logging-api[org.ops4j.pax.swissbox.extender.BundleWatcher] : Releasing bundle [wrap_mvn_org.subethamail_subethasmtp_3.1.7]
org.ops4j.pax.logging.pax-logging-api[org.ops4j.pax.swissbox.extender.BundleWatcher] : Releasing bundle [org.ops4j.pax.exam.invoker.junit]
org.ops4j.pax.logging.pax-logging-api[org.ops4j.pax.swissbox.extender.BundleWatcher] : Releasing bundle [org.ops4j.pax.tipi.hamcrest.core]
org.ops4j.pax.logging.pax-logging-api[org.ops4j.pax.swissbox.extender.BundleWatcher] : Releasing bundle [org.ops4j.pax.tipi.junit]
org.ops4j.pax.logging.pax-logging-api[org.ops4j.pax.swissbox.extender.BundleWatcher] : Releasing bundle [org.apache.geronimo.specs.geronimo-atinject_1.0_spec]
org.ops4j.pax.logging.pax-logging-api[org.ops4j.pax.swissbox.extender.BundleWatcher] : Releasing bundle [org.ops4j.pax.swissbox.tracker]
org.ops4j.pax.logging.pax-logging-api[org.ops4j.pax.swissbox.extender.BundleWatcher] : Releasing bundle [org.ops4j.pax.swissbox.lifecycle]
org.ops4j.pax.logging.pax-logging-api[org.ops4j.pax.swissbox.extender.BundleWatcher] : Releasing bundle [org.ops4j.pax.swissbox.framework]
org.ops4j.pax.logging.pax-logging-api[org.ops4j.pax.swissbox.extender.BundleWatcher] : Releasing bundle [org.ops4j.pax.swissbox.extender]
org.ops4j.pax.logging.pax-logging-api[org.ops4j.pax.swissbox.extender.BundleWatcher] : Releasing bundle [org.ops4j.pax.swissbox.core]
org.ops4j.pax.logging.pax-logging-api[org.ops4j.pax.swissbox.extender.BundleWatcher] : Releasing bundle [org.ops4j.base]
org.ops4j.pax.logging.pax-logging-api[org.ops4j.pax.logging.internal.Activator] : Disabling SLF4J API support.
org.ops4j.pax.logging.pax-logging-api[org.ops4j.pax.logging.internal.Activator] : Disabling Jakarta Commons Logging API support.
org.ops4j.pax.logging.pax-logging-api[org.ops4j.pax.logging.internal.Activator] : Disabling Log4J API support.
org.ops4j.pax.logging.pax-logging-api[org.ops4j.pax.logging.internal.Activator] : Disabling Avalon Logger API support.
org.ops4j.pax.logging.pax-logging-api[org.ops4j.pax.logging.internal.Activator] : Disabling JULI Logger API support.
org.ops4j.pax.logging.pax-logging-api[org.ops4j.pax.swissbox.extender.BundleWatcher] : Releasing bundle [org.ops4j.pax.logging.pax-logging-api]
org.ops4j.pax.logging.pax-logging-api[org.ops4j.pax.swissbox.extender.BundleWatcher] : Releasing bundle [osgi.cmpn]
org.ops4j.pax.logging.pax-logging-api[org.ops4j.pax.swissbox.extender.BundleWatcher] : Releasing bundle [org.ops4j.pax.exam.inject]
org.ops4j.pax.logging.pax-logging-api[org.ops4j.pax.swissbox.extender.BundleWatcher] : Releasing bundle [PAXEXAM-PROBE-63e66986-1734-48df-b712-0056de9eb044]
org.ops4j.pax.logging.pax-logging-api[org.ops4j.pax.swissbox.extender.BundleWatcher] : Un-registering [ManifestEntry{ key=PaxExam-Executable, value=PaxExam-34af8067-f4d2-44fb-bfc1-782a945511af,PaxExam-4505ec73-16b8-421d-b07c-144f34b8a471,PaxExam-a59d5b99-30f1-4dae-9d26-fd407eaf4fbb,PaxExam-af69977b-5624-4e5d-9896-2fa7d50927a9,PaxExam-f3bb4785-61b5-4b28-b47a-683f03c2883a, }, ManifestEntry{ key=PaxExam-af69977b-5624-4e5d-9896-2fa7d50927a9, value=org.apache.sling.commons.messaging.mail.internal.SimpleMailServiceIT;send }, ManifestEntry{ key=PaxExam-f3bb4785-61b5-4b28-b47a-683f03c2883a, value=org.apache.sling.commons.messaging.mail.internal.SimpleMailServiceIT;sendWithoutAuthentication }, ManifestEntry{ key=PaxExam-a59d5b99-30f1-4dae-9d26-fd407eaf4fbb, value=org.apache.sling.commons.messaging.mail.internal.SimpleMailServiceIT;sendWithData }, ManifestEntry{ key=PaxExam-34af8067-f4d2-44fb-bfc1-782a945511af, value=org.apache.sling.commons.messaging.mail.internal.SimpleMailBuilderIT;testBuildWithDefaults }, ManifestEntry{ key=PaxExam-4505ec73-16b8-421d-b07c-144f34b8a471, value=org.apache.sling.commons.messaging.mail.internal.SimpleMailBuilderIT;testBuildWithData }]
org.ops4j.pax.logging.pax-logging-api[org.ops4j.pax.exam.raw.extender.intern.TestBundleObserver] : Unregistered testcase [org.ops4j.pax.exam.raw.extender.intern.Probe@8ce8c18.]
org.ops4j.pax.logging.pax-logging-api[org.ops4j.pax.swissbox.extender.BundleWatcher] : Releasing bundle [org.ops4j.pax.exam]
org.ops4j.pax.logging.pax-logging-api[org.ops4j.pax.swissbox.extender.BundleWatcher] : Releasing bundle [org.apache.felix.framework]
org.ops4j.pax.logging.pax-logging-api[org.ops4j.pax.swissbox.extender.BundleWatcher] : Releasing bundle [org.ops4j.pax.exam.extender.service]

[main] INFO org.ops4j.exec.DefaultJavaRunner - Platform has been shutdown.
[main] INFO org.ops4j.pax.exam.spi.reactors.ReactorManager - suite finished
[INFO] Tests run: 3, Failures: 0, Errors: 0, Skipped: 0, Time elapsed: 10.74 s - in org.apache.sling.commons.messaging.mail.internal.SimpleMailServiceIT
[INFO] 
[INFO] Results:
[INFO] 
[INFO] Tests run: 5, Failures: 0, Errors: 0, Skipped: 0
[INFO] 
[JENKINS] Recording test results
[WARNING] Attempt to (de-)serialize anonymous class hudson.maven.reporters.SurefireArchiver$2; see: https://jenkins.io/redirect/serialization-of-anonymous-classes/
[INFO] 
[INFO] --- ianal-maven-plugin:1.0-alpha-1:verify-legal-files (verify-legal-files) @ org.apache.sling.commons.messaging.mail ---
[INFO] Checking legal files in: org.apache.sling.commons.messaging.mail-0.0.1-SNAPSHOT.jar
[INFO] Checking legal files in: org.apache.sling.commons.messaging.mail-0.0.1-SNAPSHOT-sources.jar
[INFO] 
[INFO] --- apache-rat-plugin:0.12:check (rat-check) @ org.apache.sling.commons.messaging.mail ---
[INFO] Enabled default license matchers.
[INFO] Will parse SCM ignores for exclusions...
[INFO] Parsing exclusions from <https://builds.apache.org/job/sling-org-apache-sling-commons-messaging-mail-1.8/ws/.gitignore>
[INFO] Finished adding exclusions from SCM ignore files.
[INFO] 73 implicit excludes (use -debug for more details).
[INFO] Exclude: src/main/appended-resources/META-INF/*
[INFO] Exclude: velocity.log
[INFO] Exclude: target/*
[INFO] Exclude: README.md
[INFO] Exclude: maven-eclipse.xml
[INFO] Exclude: .*
[INFO] Exclude: .*/**
[INFO] Exclude: **/*.json
[INFO] Exclude: DEPENDENCIES
[INFO] Exclude: **/*.rej
[INFO] Exclude: hs_err_*.log
[INFO] Exclude: **/repository/index/*/index-details.txt
[INFO] Exclude: bnd.bnd
[INFO] 16 resources included (use -debug for more details)
[INFO] Rat check: Summary over all files. Unapproved: 2, unknown: 2, generated: 0, approved: 13 licenses.
[WARNING] Attempt to (de-)serialize anonymous class hudson.maven.reporters.MavenArtifactArchiver$2; see: https://jenkins.io/redirect/serialization-of-anonymous-classes/
[JENKINS] Archiving disabled
[WARNING] Attempt to (de-)serialize anonymous class hudson.maven.reporters.MavenFingerprinter$1; see: https://jenkins.io/redirect/serialization-of-anonymous-classes/
[INFO] ------------------------------------------------------------------------
[JENKINS] Archiving disabled[INFO] BUILD FAILURE
[INFO] ------------------------------------------------------------------------
[INFO] Total time: 01:31 min
[INFO] Finished at: 2018-09-19T17:49:22+00:00

[INFO] Final Memory: 83M/3925M
[INFO] ------------------------------------------------------------------------
Waiting for Jenkins to finish collecting data
[ERROR] Failed to execute goal org.apache.rat:apache-rat-plugin:0.12:check (rat-check) on project org.apache.sling.commons.messaging.mail: Too many files with unapproved license: 2 See RAT report in: <https://builds.apache.org/job/sling-org-apache-sling-commons-messaging-mail-1.8/ws/target/rat.txt> -> [Help 1]
[ERROR] 
[ERROR] To see the full stack trace of the errors, re-run Maven with the -e switch.
[ERROR] Re-run Maven using the -X switch to enable full debug logging.
[ERROR] 
[ERROR] For more information about the errors and possible solutions, please read the following articles:
[ERROR] [Help 1] http://cwiki.apache.org/confluence/display/MAVEN/MojoFailureException
channel stopped
Recording test results

Build failed in Jenkins: sling-org-apache-sling-commons-messaging-mail-1.8 #104

Posted by Apache Jenkins Server <je...@builds.apache.org>.
See <https://builds.apache.org/job/sling-org-apache-sling-commons-messaging-mail-1.8/104/display/redirect>

------------------------------------------
Started by an SCM change
[EnvInject] - Loading node environment variables.
Building remotely on H33 (ubuntu xenial) in workspace <https://builds.apache.org/job/sling-org-apache-sling-commons-messaging-mail-1.8/ws/>
Also:   hudson.remoting.Channel$CallSiteStackTrace: Remote call to H33
		at hudson.remoting.Channel.attachCallSiteStackTrace(Channel.java:1741)
		at hudson.remoting.UserRequest$ExceptionResponse.retrieve(UserRequest.java:357)
		at hudson.remoting.Channel.call(Channel.java:955)
		at hudson.FilePath.act(FilePath.java:1036)
		at hudson.FilePath.act(FilePath.java:1025)
		at hudson.FilePath.mkdirs(FilePath.java:1213)
		at hudson.model.AbstractProject.checkout(AbstractProject.java:1202)
		at hudson.model.AbstractBuild$AbstractBuildExecution.defaultCheckout(AbstractBuild.java:574)
		at jenkins.scm.SCMCheckoutStrategy.checkout(SCMCheckoutStrategy.java:86)
		at hudson.model.AbstractBuild$AbstractBuildExecution.run(AbstractBuild.java:499)
		at hudson.model.Run.execute(Run.java:1794)
		at hudson.maven.MavenModuleSetBuild.run(MavenModuleSetBuild.java:543)
		at hudson.model.ResourceController.execute(ResourceController.java:97)
		at hudson.model.Executor.run(Executor.java:429)
java.nio.file.FileSystemException: <https://builds.apache.org/job/sling-org-apache-sling-commons-messaging-mail-1.8/ws/>: No space left on device
	at sun.nio.fs.UnixException.translateToIOException(UnixException.java:91)
	at sun.nio.fs.UnixException.rethrowAsIOException(UnixException.java:102)
	at sun.nio.fs.UnixException.rethrowAsIOException(UnixException.java:107)
	at sun.nio.fs.UnixFileSystemProvider.createDirectory(UnixFileSystemProvider.java:384)
	at java.nio.file.Files.createDirectory(Files.java:674)
	at java.nio.file.Files.createAndCheckIsDirectory(Files.java:781)
	at java.nio.file.Files.createDirectories(Files.java:767)
	at hudson.FilePath.mkdirs(FilePath.java:3103)
	at hudson.FilePath.access$900(FilePath.java:209)
	at hudson.FilePath$Mkdirs.invoke(FilePath.java:1221)
	at hudson.FilePath$Mkdirs.invoke(FilePath.java:1217)
	at hudson.FilePath$FileCallableWrapper.call(FilePath.java:2918)
	at hudson.remoting.UserRequest.perform(UserRequest.java:212)
	at hudson.remoting.UserRequest.perform(UserRequest.java:54)
	at hudson.remoting.Request$2.run(Request.java:369)
	at hudson.remoting.InterceptingExecutorService$1.call(InterceptingExecutorService.java:72)
	at java.util.concurrent.FutureTask.run(FutureTask.java:266)
	at java.util.concurrent.ThreadPoolExecutor.runWorker(ThreadPoolExecutor.java:1142)
	at java.util.concurrent.ThreadPoolExecutor$Worker.run(ThreadPoolExecutor.java:617)
	at java.lang.Thread.run(Thread.java:748)
Caused: java.io.IOException: remote file operation failed: <https://builds.apache.org/job/sling-org-apache-sling-commons-messaging-mail-1.8/ws/> at hudson.remoting.Channel@151643a6:H33
	at hudson.FilePath.act(FilePath.java:1043)
	at hudson.FilePath.act(FilePath.java:1025)
	at hudson.FilePath.mkdirs(FilePath.java:1213)
	at hudson.model.AbstractProject.checkout(AbstractProject.java:1202)
	at hudson.model.AbstractBuild$AbstractBuildExecution.defaultCheckout(AbstractBuild.java:574)
	at jenkins.scm.SCMCheckoutStrategy.checkout(SCMCheckoutStrategy.java:86)
	at hudson.model.AbstractBuild$AbstractBuildExecution.run(AbstractBuild.java:499)
	at hudson.model.Run.execute(Run.java:1794)
	at hudson.maven.MavenModuleSetBuild.run(MavenModuleSetBuild.java:543)
	at hudson.model.ResourceController.execute(ResourceController.java:97)
	at hudson.model.Executor.run(Executor.java:429)
Retrying after 10 seconds
Also:   hudson.remoting.Channel$CallSiteStackTrace: Remote call to H33
		at hudson.remoting.Channel.attachCallSiteStackTrace(Channel.java:1741)
		at hudson.remoting.UserRequest$ExceptionResponse.retrieve(UserRequest.java:357)
		at hudson.remoting.Channel.call(Channel.java:955)
		at hudson.FilePath.act(FilePath.java:1036)
		at hudson.FilePath.act(FilePath.java:1025)
		at hudson.FilePath.mkdirs(FilePath.java:1213)
		at hudson.model.AbstractProject.checkout(AbstractProject.java:1202)
		at hudson.model.AbstractBuild$AbstractBuildExecution.defaultCheckout(AbstractBuild.java:574)
		at jenkins.scm.SCMCheckoutStrategy.checkout(SCMCheckoutStrategy.java:86)
		at hudson.model.AbstractBuild$AbstractBuildExecution.run(AbstractBuild.java:499)
		at hudson.model.Run.execute(Run.java:1794)
		at hudson.maven.MavenModuleSetBuild.run(MavenModuleSetBuild.java:543)
		at hudson.model.ResourceController.execute(ResourceController.java:97)
		at hudson.model.Executor.run(Executor.java:429)
java.nio.file.FileSystemException: <https://builds.apache.org/job/sling-org-apache-sling-commons-messaging-mail-1.8/ws/>: No space left on device
	at sun.nio.fs.UnixException.translateToIOException(UnixException.java:91)
	at sun.nio.fs.UnixException.rethrowAsIOException(UnixException.java:102)
	at sun.nio.fs.UnixException.rethrowAsIOException(UnixException.java:107)
	at sun.nio.fs.UnixFileSystemProvider.createDirectory(UnixFileSystemProvider.java:384)
	at java.nio.file.Files.createDirectory(Files.java:674)
	at java.nio.file.Files.createAndCheckIsDirectory(Files.java:781)
	at java.nio.file.Files.createDirectories(Files.java:767)
	at hudson.FilePath.mkdirs(FilePath.java:3103)
	at hudson.FilePath.access$900(FilePath.java:209)
	at hudson.FilePath$Mkdirs.invoke(FilePath.java:1221)
	at hudson.FilePath$Mkdirs.invoke(FilePath.java:1217)
	at hudson.FilePath$FileCallableWrapper.call(FilePath.java:2918)
	at hudson.remoting.UserRequest.perform(UserRequest.java:212)
	at hudson.remoting.UserRequest.perform(UserRequest.java:54)
	at hudson.remoting.Request$2.run(Request.java:369)
	at hudson.remoting.InterceptingExecutorService$1.call(InterceptingExecutorService.java:72)
	at java.util.concurrent.FutureTask.run(FutureTask.java:266)
	at java.util.concurrent.ThreadPoolExecutor.runWorker(ThreadPoolExecutor.java:1142)
	at java.util.concurrent.ThreadPoolExecutor$Worker.run(ThreadPoolExecutor.java:617)
	at java.lang.Thread.run(Thread.java:748)
Caused: java.io.IOException: remote file operation failed: <https://builds.apache.org/job/sling-org-apache-sling-commons-messaging-mail-1.8/ws/> at hudson.remoting.Channel@151643a6:H33
	at hudson.FilePath.act(FilePath.java:1043)
	at hudson.FilePath.act(FilePath.java:1025)
	at hudson.FilePath.mkdirs(FilePath.java:1213)
	at hudson.model.AbstractProject.checkout(AbstractProject.java:1202)
	at hudson.model.AbstractBuild$AbstractBuildExecution.defaultCheckout(AbstractBuild.java:574)
	at jenkins.scm.SCMCheckoutStrategy.checkout(SCMCheckoutStrategy.java:86)
	at hudson.model.AbstractBuild$AbstractBuildExecution.run(AbstractBuild.java:499)
	at hudson.model.Run.execute(Run.java:1794)
	at hudson.maven.MavenModuleSetBuild.run(MavenModuleSetBuild.java:543)
	at hudson.model.ResourceController.execute(ResourceController.java:97)
	at hudson.model.Executor.run(Executor.java:429)
Retrying after 10 seconds
Also:   hudson.remoting.Channel$CallSiteStackTrace: Remote call to H33
		at hudson.remoting.Channel.attachCallSiteStackTrace(Channel.java:1741)
		at hudson.remoting.UserRequest$ExceptionResponse.retrieve(UserRequest.java:357)
		at hudson.remoting.Channel.call(Channel.java:955)
		at hudson.FilePath.act(FilePath.java:1036)
		at hudson.FilePath.act(FilePath.java:1025)
		at hudson.FilePath.mkdirs(FilePath.java:1213)
		at hudson.model.AbstractProject.checkout(AbstractProject.java:1202)
		at hudson.model.AbstractBuild$AbstractBuildExecution.defaultCheckout(AbstractBuild.java:574)
		at jenkins.scm.SCMCheckoutStrategy.checkout(SCMCheckoutStrategy.java:86)
		at hudson.model.AbstractBuild$AbstractBuildExecution.run(AbstractBuild.java:499)
		at hudson.model.Run.execute(Run.java:1794)
		at hudson.maven.MavenModuleSetBuild.run(MavenModuleSetBuild.java:543)
		at hudson.model.ResourceController.execute(ResourceController.java:97)
		at hudson.model.Executor.run(Executor.java:429)
java.nio.file.FileSystemException: <https://builds.apache.org/job/sling-org-apache-sling-commons-messaging-mail-1.8/ws/>: No space left on device
	at sun.nio.fs.UnixException.translateToIOException(UnixException.java:91)
	at sun.nio.fs.UnixException.rethrowAsIOException(UnixException.java:102)
	at sun.nio.fs.UnixException.rethrowAsIOException(UnixException.java:107)
	at sun.nio.fs.UnixFileSystemProvider.createDirectory(UnixFileSystemProvider.java:384)
	at java.nio.file.Files.createDirectory(Files.java:674)
	at java.nio.file.Files.createAndCheckIsDirectory(Files.java:781)
	at java.nio.file.Files.createDirectories(Files.java:767)
	at hudson.FilePath.mkdirs(FilePath.java:3103)
	at hudson.FilePath.access$900(FilePath.java:209)
	at hudson.FilePath$Mkdirs.invoke(FilePath.java:1221)
	at hudson.FilePath$Mkdirs.invoke(FilePath.java:1217)
	at hudson.FilePath$FileCallableWrapper.call(FilePath.java:2918)
	at hudson.remoting.UserRequest.perform(UserRequest.java:212)
	at hudson.remoting.UserRequest.perform(UserRequest.java:54)
	at hudson.remoting.Request$2.run(Request.java:369)
	at hudson.remoting.InterceptingExecutorService$1.call(InterceptingExecutorService.java:72)
	at java.util.concurrent.FutureTask.run(FutureTask.java:266)
	at java.util.concurrent.ThreadPoolExecutor.runWorker(ThreadPoolExecutor.java:1142)
	at java.util.concurrent.ThreadPoolExecutor$Worker.run(ThreadPoolExecutor.java:617)
	at java.lang.Thread.run(Thread.java:748)
Caused: java.io.IOException: remote file operation failed: <https://builds.apache.org/job/sling-org-apache-sling-commons-messaging-mail-1.8/ws/> at hudson.remoting.Channel@151643a6:H33
	at hudson.FilePath.act(FilePath.java:1043)
	at hudson.FilePath.act(FilePath.java:1025)
	at hudson.FilePath.mkdirs(FilePath.java:1213)
	at hudson.model.AbstractProject.checkout(AbstractProject.java:1202)
	at hudson.model.AbstractBuild$AbstractBuildExecution.defaultCheckout(AbstractBuild.java:574)
	at jenkins.scm.SCMCheckoutStrategy.checkout(SCMCheckoutStrategy.java:86)
	at hudson.model.AbstractBuild$AbstractBuildExecution.run(AbstractBuild.java:499)
	at hudson.model.Run.execute(Run.java:1794)
	at hudson.maven.MavenModuleSetBuild.run(MavenModuleSetBuild.java:543)
	at hudson.model.ResourceController.execute(ResourceController.java:97)
	at hudson.model.Executor.run(Executor.java:429)
Recording test results
ERROR: Build step failed with exception
Also:   hudson.remoting.Channel$CallSiteStackTrace: Remote call to H33
		at hudson.remoting.Channel.attachCallSiteStackTrace(Channel.java:1741)
		at hudson.remoting.UserRequest$ExceptionResponse.retrieve(UserRequest.java:357)
		at hudson.remoting.Channel.call(Channel.java:955)
		at hudson.FilePath.act(FilePath.java:1036)
		at hudson.FilePath.act(FilePath.java:1025)
		at hudson.tasks.junit.JUnitParser.parseResult(JUnitParser.java:114)
		at hudson.tasks.junit.JUnitResultArchiver.parse(JUnitResultArchiver.java:136)
		at hudson.tasks.junit.JUnitResultArchiver.parseAndAttach(JUnitResultArchiver.java:166)
		at hudson.tasks.junit.JUnitResultArchiver.perform(JUnitResultArchiver.java:153)
		at hudson.tasks.BuildStepCompatibilityLayer.perform(BuildStepCompatibilityLayer.java:81)
		at hudson.tasks.BuildStepMonitor$1.perform(BuildStepMonitor.java:20)
		at hudson.model.AbstractBuild$AbstractBuildExecution.perform(AbstractBuild.java:744)
		at hudson.model.AbstractBuild$AbstractBuildExecution.performAllBuildSteps(AbstractBuild.java:690)
		at hudson.maven.MavenModuleSetBuild$MavenModuleSetBuildExecution.post2(MavenModuleSetBuild.java:1073)
		at hudson.model.AbstractBuild$AbstractBuildExecution.post(AbstractBuild.java:635)
		at hudson.model.Run.execute(Run.java:1819)
		at hudson.maven.MavenModuleSetBuild.run(MavenModuleSetBuild.java:543)
		at hudson.model.ResourceController.execute(ResourceController.java:97)
		at hudson.model.Executor.run(Executor.java:429)
<https://builds.apache.org/job/sling-org-apache-sling-commons-messaging-mail-1.8/ws/> does not exist.
	at org.apache.tools.ant.types.AbstractFileSet.getDirectoryScanner(AbstractFileSet.java:484)
	at org.apache.tools.ant.types.AbstractFileSet.getDirectoryScanner(AbstractFileSet.java:461)
	at hudson.tasks.junit.JUnitParser$ParseResultCallable.invoke(JUnitParser.java:141)
	at hudson.tasks.junit.JUnitParser$ParseResultCallable.invoke(JUnitParser.java:118)
	at hudson.FilePath$FileCallableWrapper.call(FilePath.java:2918)
	at hudson.remoting.UserRequest.perform(UserRequest.java:212)
	at hudson.remoting.UserRequest.perform(UserRequest.java:54)
	at hudson.remoting.Request$2.run(Request.java:369)
	at hudson.remoting.InterceptingExecutorService$1.call(InterceptingExecutorService.java:72)
	at java.util.concurrent.FutureTask.run(FutureTask.java:266)
	at java.util.concurrent.ThreadPoolExecutor.runWorker(ThreadPoolExecutor.java:1142)
	at java.util.concurrent.ThreadPoolExecutor$Worker.run(ThreadPoolExecutor.java:617)
	at java.lang.Thread.run(Thread.java:748)
Build step 'Publish JUnit test result report' marked build as failure