You are viewing a plain text version of this content. The canonical link for it is here.
Posted to dev@any23.apache.org by "Michele Mostarda (Created) (JIRA)" <ji...@apache.org> on 2012/01/15 10:58:39 UTC
[jira] [Created] (ANY23-34) Plugin Integration Test Fails
Plugin Integration Test Fails
-----------------------------
Key: ANY23-34
URL: https://issues.apache.org/jira/browse/ANY23-34
Project: Apache Any23
Issue Type: Bug
Reporter: Michele Mostarda
Assignee: Michele Mostarda
If performing mvn clean install the Plugin Integration Test module fails with the following message:
{code}
[INFO] --- maven-invoker-plugin:1.5:run (default) @ any23-integration-test ---
[INFO] Building: basic-crawler/pom.xml
[INFO] ..FAILED (36.2 s)
[INFO] The build exited with code 1. See /home/hudson/hudson-slave/workspace/Any23-trunk/plugins/integration-test/target/plugins-build/basic-crawler/build.log for details.
[INFO] Building: office-scraper/pom.xml
[INFO] ..FAILED (8.7 s)
[INFO] The build exited with code 1. See /home/hudson/hudson-slave/workspace/Any23-trunk/plugins/integration-test/target/plugins-build/office-scraper/build.log for details.
[INFO] Building: html-scraper/pom.xml
[INFO] ..FAILED (7.5 s)
[INFO] The build exited with code 1. See /home/hudson/hudson-slave/workspace/Any23-trunk/plugins/integration-test/target/plugins-build/html-scraper/build.log for details.
{code}
The content of /home/hudson/hudson-slave/workspace/Any23-trunk/plugins/integration-test/target/plugins-build/*/build.log files report the following error:
{code}
[INFO] ------------------------------------------------------------------------
[INFO] BUILD FAILURE
[INFO] ------------------------------------------------------------------------
[INFO] Total time: 11.195s
[INFO] Finished at: Sun Jan 15 10:53:22 CET 2012
[INFO] Final Memory: 23M/81M
[INFO] ------------------------------------------------------------------------
[ERROR] Failed to execute goal org.apache.maven.plugins:maven-assembly-plugin:2.2.2:single (assembly) on project any23-office-scraper: Failed to create assembly: Error filtering file '<PATH/TO/TRUNK>/plugins/integration-test/target/plugins-build/office-scraper/./../../LICENSE.txt': <PATH/TO/TRUNK>/plugins/integration-test/target/plugins-build/office-scraper/./../../LICENSE.txt (No such file or directory) -> [Help 1]
{code}
--
This message is automatically generated by JIRA.
If you think it was sent incorrectly, please contact your JIRA administrators: https://issues.apache.org/jira/secure/ContactAdministrators!default.jspa
For more information on JIRA, see: http://www.atlassian.com/software/jira
Re: [jira] [Reopened] (ANY23-34) Plugin Integration Test Fails
Posted by Michele Mostarda <mi...@gmail.com>.
On 22 March 2012 16:22, Simone Tripodi (Reopened) (JIRA) <ji...@apache.org>wrote:
>
> [
> https://issues.apache.org/jira/browse/ANY23-34?page=com.atlassian.jira.plugin.system.issuetabpanels:all-tabpanel]
>
> Simone Tripodi reopened ANY23-34:
> ---------------------------------
>
>
> yup it makes sense having it reopened until addresses.
>
> I'll try to take care of it tonight
>
Hi guys, I closed that issue because it was related to another bug,
but good to see it was reopened and addressed.
Getting in touch Simone to understand better how to address it.
The best.
Mic
>
> > Plugin Integration Test Fails
> > -----------------------------
> >
> > Key: ANY23-34
> > URL: https://issues.apache.org/jira/browse/ANY23-34
> > Project: Apache Any23
> > Issue Type: Bug
> > Affects Versions: 0.7.0
> > Reporter: Michele Mostarda
> > Assignee: Simone Tripodi
> > Fix For: 0.8.0
> >
> >
> > If performing mvn clean install the Plugin Integration Test module fails
> with the following message:
> > {code}
> > [INFO] --- maven-invoker-plugin:1.5:run (default) @
> any23-integration-test ---
> > [INFO] Building: basic-crawler/pom.xml
> > [INFO] ..FAILED (36.2 s)
> > [INFO] The build exited with code 1. See
> /home/hudson/hudson-slave/workspace/Any23-trunk/plugins/integration-test/target/plugins-build/basic-crawler/build.log
> for details.
> > [INFO] Building: office-scraper/pom.xml
> > [INFO] ..FAILED (8.7 s)
> > [INFO] The build exited with code 1. See
> /home/hudson/hudson-slave/workspace/Any23-trunk/plugins/integration-test/target/plugins-build/office-scraper/build.log
> for details.
> > [INFO] Building: html-scraper/pom.xml
> > [INFO] ..FAILED (7.5 s)
> > [INFO] The build exited with code 1. See
> /home/hudson/hudson-slave/workspace/Any23-trunk/plugins/integration-test/target/plugins-build/html-scraper/build.log
> for details.
> > {code}
> > The content of
> /home/hudson/hudson-slave/workspace/Any23-trunk/plugins/integration-test/target/plugins-build/*/build.log
> files report the following error:
> > {code}
> > [INFO]
> ------------------------------------------------------------------------
> > [INFO] BUILD FAILURE
> > [INFO]
> ------------------------------------------------------------------------
> > [INFO] Total time: 11.195s
> > [INFO] Finished at: Sun Jan 15 10:53:22 CET 2012
> > [INFO] Final Memory: 23M/81M
> > [INFO]
> ------------------------------------------------------------------------
> > [ERROR] Failed to execute goal
> org.apache.maven.plugins:maven-assembly-plugin:2.2.2:single (assembly) on
> project any23-office-scraper: Failed to create assembly: Error filtering
> file
> '<PATH/TO/TRUNK>/plugins/integration-test/target/plugins-build/office-scraper/./../../LICENSE.txt':
> <PATH/TO/TRUNK>/plugins/integration-test/target/plugins-build/office-scraper/./../../LICENSE.txt
> (No such file or directory) -> [Help 1]
> > {code}
>
> --
> This message is automatically generated by JIRA.
> If you think it was sent incorrectly, please contact your JIRA
> administrators:
> https://issues.apache.org/jira/secure/ContactAdministrators!default.jspa
> For more information on JIRA, see: http://www.atlassian.com/software/jira
>
>
>
--
Michele Mostarda
Senior Software Engineer
skype: michele.mostarda
twitter: micmos
mail: me@michelemostarda.com
site : http://www.michelemostarda.com
[jira] [Reopened] (ANY23-34) Plugin Integration Test Fails
Posted by "Simone Tripodi (Reopened) (JIRA)" <ji...@apache.org>.
[ https://issues.apache.org/jira/browse/ANY23-34?page=com.atlassian.jira.plugin.system.issuetabpanels:all-tabpanel ]
Simone Tripodi reopened ANY23-34:
---------------------------------
yup it makes sense having it reopened until addresses.
I'll try to take care of it tonight
> Plugin Integration Test Fails
> -----------------------------
>
> Key: ANY23-34
> URL: https://issues.apache.org/jira/browse/ANY23-34
> Project: Apache Any23
> Issue Type: Bug
> Affects Versions: 0.7.0
> Reporter: Michele Mostarda
> Assignee: Simone Tripodi
> Fix For: 0.8.0
>
>
> If performing mvn clean install the Plugin Integration Test module fails with the following message:
> {code}
> [INFO] --- maven-invoker-plugin:1.5:run (default) @ any23-integration-test ---
> [INFO] Building: basic-crawler/pom.xml
> [INFO] ..FAILED (36.2 s)
> [INFO] The build exited with code 1. See /home/hudson/hudson-slave/workspace/Any23-trunk/plugins/integration-test/target/plugins-build/basic-crawler/build.log for details.
> [INFO] Building: office-scraper/pom.xml
> [INFO] ..FAILED (8.7 s)
> [INFO] The build exited with code 1. See /home/hudson/hudson-slave/workspace/Any23-trunk/plugins/integration-test/target/plugins-build/office-scraper/build.log for details.
> [INFO] Building: html-scraper/pom.xml
> [INFO] ..FAILED (7.5 s)
> [INFO] The build exited with code 1. See /home/hudson/hudson-slave/workspace/Any23-trunk/plugins/integration-test/target/plugins-build/html-scraper/build.log for details.
> {code}
> The content of /home/hudson/hudson-slave/workspace/Any23-trunk/plugins/integration-test/target/plugins-build/*/build.log files report the following error:
> {code}
> [INFO] ------------------------------------------------------------------------
> [INFO] BUILD FAILURE
> [INFO] ------------------------------------------------------------------------
> [INFO] Total time: 11.195s
> [INFO] Finished at: Sun Jan 15 10:53:22 CET 2012
> [INFO] Final Memory: 23M/81M
> [INFO] ------------------------------------------------------------------------
> [ERROR] Failed to execute goal org.apache.maven.plugins:maven-assembly-plugin:2.2.2:single (assembly) on project any23-office-scraper: Failed to create assembly: Error filtering file '<PATH/TO/TRUNK>/plugins/integration-test/target/plugins-build/office-scraper/./../../LICENSE.txt': <PATH/TO/TRUNK>/plugins/integration-test/target/plugins-build/office-scraper/./../../LICENSE.txt (No such file or directory) -> [Help 1]
> {code}
--
This message is automatically generated by JIRA.
If you think it was sent incorrectly, please contact your JIRA administrators: https://issues.apache.org/jira/secure/ContactAdministrators!default.jspa
For more information on JIRA, see: http://www.atlassian.com/software/jira
[jira] [Commented] (ANY23-34) Plugin Integration Test Fails
Posted by "Michele Mostarda (Commented) (JIRA)" <ji...@apache.org>.
[ https://issues.apache.org/jira/browse/ANY23-34?page=com.atlassian.jira.plugin.system.issuetabpanels:comment-tabpanel&focusedCommentId=13186466#comment-13186466 ]
Michele Mostarda commented on ANY23-34:
---------------------------------------
The mvn assembly:assembly goal works fine from the current plugin dir:
{code}
trunk/plugins/html-scraper$ mvn clean assembly:assembly
{code}
works fine, but when called by the integration test it fails because the ${basedir} is different, it declares
{code}
<files>
<file>
<source>${basedir}/../../LICENSE.txt</source>
<filtered>true</filtered>
<outputDirectory>/</outputDirectory>
<fileMode>666</fileMode>
</file>
[omitted]
</files>
{code}
But it would be:
{code}
<files>
<file>
<source>${basedir}/../../../../LICENSE.txt</source>
<filtered>true</filtered>
<outputDirectory>/</outputDirectory>
<fileMode>666</fileMode>
</file>
[omitted]
</files>
{code}
> Plugin Integration Test Fails
> -----------------------------
>
> Key: ANY23-34
> URL: https://issues.apache.org/jira/browse/ANY23-34
> Project: Apache Any23
> Issue Type: Bug
> Reporter: Michele Mostarda
> Assignee: Michele Mostarda
>
> If performing mvn clean install the Plugin Integration Test module fails with the following message:
> {code}
> [INFO] --- maven-invoker-plugin:1.5:run (default) @ any23-integration-test ---
> [INFO] Building: basic-crawler/pom.xml
> [INFO] ..FAILED (36.2 s)
> [INFO] The build exited with code 1. See /home/hudson/hudson-slave/workspace/Any23-trunk/plugins/integration-test/target/plugins-build/basic-crawler/build.log for details.
> [INFO] Building: office-scraper/pom.xml
> [INFO] ..FAILED (8.7 s)
> [INFO] The build exited with code 1. See /home/hudson/hudson-slave/workspace/Any23-trunk/plugins/integration-test/target/plugins-build/office-scraper/build.log for details.
> [INFO] Building: html-scraper/pom.xml
> [INFO] ..FAILED (7.5 s)
> [INFO] The build exited with code 1. See /home/hudson/hudson-slave/workspace/Any23-trunk/plugins/integration-test/target/plugins-build/html-scraper/build.log for details.
> {code}
> The content of /home/hudson/hudson-slave/workspace/Any23-trunk/plugins/integration-test/target/plugins-build/*/build.log files report the following error:
> {code}
> [INFO] ------------------------------------------------------------------------
> [INFO] BUILD FAILURE
> [INFO] ------------------------------------------------------------------------
> [INFO] Total time: 11.195s
> [INFO] Finished at: Sun Jan 15 10:53:22 CET 2012
> [INFO] Final Memory: 23M/81M
> [INFO] ------------------------------------------------------------------------
> [ERROR] Failed to execute goal org.apache.maven.plugins:maven-assembly-plugin:2.2.2:single (assembly) on project any23-office-scraper: Failed to create assembly: Error filtering file '<PATH/TO/TRUNK>/plugins/integration-test/target/plugins-build/office-scraper/./../../LICENSE.txt': <PATH/TO/TRUNK>/plugins/integration-test/target/plugins-build/office-scraper/./../../LICENSE.txt (No such file or directory) -> [Help 1]
> {code}
--
This message is automatically generated by JIRA.
If you think it was sent incorrectly, please contact your JIRA administrators: https://issues.apache.org/jira/secure/ContactAdministrators!default.jspa
For more information on JIRA, see: http://www.atlassian.com/software/jira
[jira] [Commented] (ANY23-34) Plugin Integration Test Fails
Posted by "Michele Mostarda (Commented) (JIRA)" <ji...@apache.org>.
[ https://issues.apache.org/jira/browse/ANY23-34?page=com.atlassian.jira.plugin.system.issuetabpanels:comment-tabpanel&focusedCommentId=13238223#comment-13238223 ]
Michele Mostarda commented on ANY23-34:
---------------------------------------
Thank you guys for all the effort!
> Plugin Integration Test Fails
> -----------------------------
>
> Key: ANY23-34
> URL: https://issues.apache.org/jira/browse/ANY23-34
> Project: Apache Any23
> Issue Type: Bug
> Affects Versions: 0.7.0
> Reporter: Michele Mostarda
> Assignee: Simone Tripodi
> Fix For: 0.8.0
>
>
> If performing mvn clean install the Plugin Integration Test module fails with the following message:
> {code}
> [INFO] --- maven-invoker-plugin:1.5:run (default) @ any23-integration-test ---
> [INFO] Building: basic-crawler/pom.xml
> [INFO] ..FAILED (36.2 s)
> [INFO] The build exited with code 1. See /home/hudson/hudson-slave/workspace/Any23-trunk/plugins/integration-test/target/plugins-build/basic-crawler/build.log for details.
> [INFO] Building: office-scraper/pom.xml
> [INFO] ..FAILED (8.7 s)
> [INFO] The build exited with code 1. See /home/hudson/hudson-slave/workspace/Any23-trunk/plugins/integration-test/target/plugins-build/office-scraper/build.log for details.
> [INFO] Building: html-scraper/pom.xml
> [INFO] ..FAILED (7.5 s)
> [INFO] The build exited with code 1. See /home/hudson/hudson-slave/workspace/Any23-trunk/plugins/integration-test/target/plugins-build/html-scraper/build.log for details.
> {code}
> The content of /home/hudson/hudson-slave/workspace/Any23-trunk/plugins/integration-test/target/plugins-build/*/build.log files report the following error:
> {code}
> [INFO] ------------------------------------------------------------------------
> [INFO] BUILD FAILURE
> [INFO] ------------------------------------------------------------------------
> [INFO] Total time: 11.195s
> [INFO] Finished at: Sun Jan 15 10:53:22 CET 2012
> [INFO] Final Memory: 23M/81M
> [INFO] ------------------------------------------------------------------------
> [ERROR] Failed to execute goal org.apache.maven.plugins:maven-assembly-plugin:2.2.2:single (assembly) on project any23-office-scraper: Failed to create assembly: Error filtering file '<PATH/TO/TRUNK>/plugins/integration-test/target/plugins-build/office-scraper/./../../LICENSE.txt': <PATH/TO/TRUNK>/plugins/integration-test/target/plugins-build/office-scraper/./../../LICENSE.txt (No such file or directory) -> [Help 1]
> {code}
--
This message is automatically generated by JIRA.
If you think it was sent incorrectly, please contact your JIRA administrators: https://issues.apache.org/jira/secure/ContactAdministrators!default.jspa
For more information on JIRA, see: http://www.atlassian.com/software/jira
[jira] [Commented] (ANY23-34) Plugin Integration Test Fails
Posted by "Lewis John McGibbney (Commented) (JIRA)" <ji...@apache.org>.
[ https://issues.apache.org/jira/browse/ANY23-34?page=com.atlassian.jira.plugin.system.issuetabpanels:comment-tabpanel&focusedCommentId=13241256#comment-13241256 ]
Lewis John McGibbney commented on ANY23-34:
-------------------------------------------
Out of interest, what in griefs name was wrong? The whole plugin had me kinda puzzled for a while there :)
> Plugin Integration Test Fails
> -----------------------------
>
> Key: ANY23-34
> URL: https://issues.apache.org/jira/browse/ANY23-34
> Project: Apache Any23
> Issue Type: Bug
> Affects Versions: 0.7.0
> Reporter: Michele Mostarda
> Assignee: Simone Tripodi
> Fix For: 0.8.0
>
>
> If performing mvn clean install the Plugin Integration Test module fails with the following message:
> {code}
> [INFO] --- maven-invoker-plugin:1.5:run (default) @ any23-integration-test ---
> [INFO] Building: basic-crawler/pom.xml
> [INFO] ..FAILED (36.2 s)
> [INFO] The build exited with code 1. See /home/hudson/hudson-slave/workspace/Any23-trunk/plugins/integration-test/target/plugins-build/basic-crawler/build.log for details.
> [INFO] Building: office-scraper/pom.xml
> [INFO] ..FAILED (8.7 s)
> [INFO] The build exited with code 1. See /home/hudson/hudson-slave/workspace/Any23-trunk/plugins/integration-test/target/plugins-build/office-scraper/build.log for details.
> [INFO] Building: html-scraper/pom.xml
> [INFO] ..FAILED (7.5 s)
> [INFO] The build exited with code 1. See /home/hudson/hudson-slave/workspace/Any23-trunk/plugins/integration-test/target/plugins-build/html-scraper/build.log for details.
> {code}
> The content of /home/hudson/hudson-slave/workspace/Any23-trunk/plugins/integration-test/target/plugins-build/*/build.log files report the following error:
> {code}
> [INFO] ------------------------------------------------------------------------
> [INFO] BUILD FAILURE
> [INFO] ------------------------------------------------------------------------
> [INFO] Total time: 11.195s
> [INFO] Finished at: Sun Jan 15 10:53:22 CET 2012
> [INFO] Final Memory: 23M/81M
> [INFO] ------------------------------------------------------------------------
> [ERROR] Failed to execute goal org.apache.maven.plugins:maven-assembly-plugin:2.2.2:single (assembly) on project any23-office-scraper: Failed to create assembly: Error filtering file '<PATH/TO/TRUNK>/plugins/integration-test/target/plugins-build/office-scraper/./../../LICENSE.txt': <PATH/TO/TRUNK>/plugins/integration-test/target/plugins-build/office-scraper/./../../LICENSE.txt (No such file or directory) -> [Help 1]
> {code}
--
This message is automatically generated by JIRA.
If you think it was sent incorrectly, please contact your JIRA administrators: https://issues.apache.org/jira/secure/ContactAdministrators!default.jspa
For more information on JIRA, see: http://www.atlassian.com/software/jira
[jira] [Updated] (ANY23-34) Plugin Integration Test Fails
Posted by "Simone Tripodi (JIRA)" <ji...@apache.org>.
[ https://issues.apache.org/jira/browse/ANY23-34?page=com.atlassian.jira.plugin.system.issuetabpanels:all-tabpanel ]
Simone Tripodi updated ANY23-34:
--------------------------------
Fix Version/s: (was: 0.8.0)
0.7.0
> Plugin Integration Test Fails
> -----------------------------
>
> Key: ANY23-34
> URL: https://issues.apache.org/jira/browse/ANY23-34
> Project: Apache Any23
> Issue Type: Bug
> Affects Versions: 0.7.0
> Reporter: Michele Mostarda
> Assignee: Simone Tripodi
> Fix For: 0.7.0
>
>
> If performing mvn clean install the Plugin Integration Test module fails with the following message:
> {code}
> [INFO] --- maven-invoker-plugin:1.5:run (default) @ any23-integration-test ---
> [INFO] Building: basic-crawler/pom.xml
> [INFO] ..FAILED (36.2 s)
> [INFO] The build exited with code 1. See /home/hudson/hudson-slave/workspace/Any23-trunk/plugins/integration-test/target/plugins-build/basic-crawler/build.log for details.
> [INFO] Building: office-scraper/pom.xml
> [INFO] ..FAILED (8.7 s)
> [INFO] The build exited with code 1. See /home/hudson/hudson-slave/workspace/Any23-trunk/plugins/integration-test/target/plugins-build/office-scraper/build.log for details.
> [INFO] Building: html-scraper/pom.xml
> [INFO] ..FAILED (7.5 s)
> [INFO] The build exited with code 1. See /home/hudson/hudson-slave/workspace/Any23-trunk/plugins/integration-test/target/plugins-build/html-scraper/build.log for details.
> {code}
> The content of /home/hudson/hudson-slave/workspace/Any23-trunk/plugins/integration-test/target/plugins-build/*/build.log files report the following error:
> {code}
> [INFO] ------------------------------------------------------------------------
> [INFO] BUILD FAILURE
> [INFO] ------------------------------------------------------------------------
> [INFO] Total time: 11.195s
> [INFO] Finished at: Sun Jan 15 10:53:22 CET 2012
> [INFO] Final Memory: 23M/81M
> [INFO] ------------------------------------------------------------------------
> [ERROR] Failed to execute goal org.apache.maven.plugins:maven-assembly-plugin:2.2.2:single (assembly) on project any23-office-scraper: Failed to create assembly: Error filtering file '<PATH/TO/TRUNK>/plugins/integration-test/target/plugins-build/office-scraper/./../../LICENSE.txt': <PATH/TO/TRUNK>/plugins/integration-test/target/plugins-build/office-scraper/./../../LICENSE.txt (No such file or directory) -> [Help 1]
> {code}
--
This message is automatically generated by JIRA.
If you think it was sent incorrectly, please contact your JIRA administrators: https://issues.apache.org/jira/secure/ContactAdministrators!default.jspa
For more information on JIRA, see: http://www.atlassian.com/software/jira
[jira] [Commented] (ANY23-34) Plugin Integration Test Fails
Posted by "Michele Mostarda (Commented) (JIRA)" <ji...@apache.org>.
[ https://issues.apache.org/jira/browse/ANY23-34?page=com.atlassian.jira.plugin.system.issuetabpanels:comment-tabpanel&focusedCommentId=13237579#comment-13237579 ]
Michele Mostarda commented on ANY23-34:
---------------------------------------
Coordinated with Simone, we've found and fixed the bug. Verifying build on Jenkins.
> Plugin Integration Test Fails
> -----------------------------
>
> Key: ANY23-34
> URL: https://issues.apache.org/jira/browse/ANY23-34
> Project: Apache Any23
> Issue Type: Bug
> Affects Versions: 0.7.0
> Reporter: Michele Mostarda
> Assignee: Simone Tripodi
> Fix For: 0.8.0
>
>
> If performing mvn clean install the Plugin Integration Test module fails with the following message:
> {code}
> [INFO] --- maven-invoker-plugin:1.5:run (default) @ any23-integration-test ---
> [INFO] Building: basic-crawler/pom.xml
> [INFO] ..FAILED (36.2 s)
> [INFO] The build exited with code 1. See /home/hudson/hudson-slave/workspace/Any23-trunk/plugins/integration-test/target/plugins-build/basic-crawler/build.log for details.
> [INFO] Building: office-scraper/pom.xml
> [INFO] ..FAILED (8.7 s)
> [INFO] The build exited with code 1. See /home/hudson/hudson-slave/workspace/Any23-trunk/plugins/integration-test/target/plugins-build/office-scraper/build.log for details.
> [INFO] Building: html-scraper/pom.xml
> [INFO] ..FAILED (7.5 s)
> [INFO] The build exited with code 1. See /home/hudson/hudson-slave/workspace/Any23-trunk/plugins/integration-test/target/plugins-build/html-scraper/build.log for details.
> {code}
> The content of /home/hudson/hudson-slave/workspace/Any23-trunk/plugins/integration-test/target/plugins-build/*/build.log files report the following error:
> {code}
> [INFO] ------------------------------------------------------------------------
> [INFO] BUILD FAILURE
> [INFO] ------------------------------------------------------------------------
> [INFO] Total time: 11.195s
> [INFO] Finished at: Sun Jan 15 10:53:22 CET 2012
> [INFO] Final Memory: 23M/81M
> [INFO] ------------------------------------------------------------------------
> [ERROR] Failed to execute goal org.apache.maven.plugins:maven-assembly-plugin:2.2.2:single (assembly) on project any23-office-scraper: Failed to create assembly: Error filtering file '<PATH/TO/TRUNK>/plugins/integration-test/target/plugins-build/office-scraper/./../../LICENSE.txt': <PATH/TO/TRUNK>/plugins/integration-test/target/plugins-build/office-scraper/./../../LICENSE.txt (No such file or directory) -> [Help 1]
> {code}
--
This message is automatically generated by JIRA.
If you think it was sent incorrectly, please contact your JIRA administrators: https://issues.apache.org/jira/secure/ContactAdministrators!default.jspa
For more information on JIRA, see: http://www.atlassian.com/software/jira
[jira] [Commented] (ANY23-34) Plugin Integration Test Fails
Posted by "Hudson (Commented) (JIRA)" <ji...@apache.org>.
[ https://issues.apache.org/jira/browse/ANY23-34?page=com.atlassian.jira.plugin.system.issuetabpanels:comment-tabpanel&focusedCommentId=13237575#comment-13237575 ]
Hudson commented on ANY23-34:
-----------------------------
Integrated in Any23-trunk #146 (See [https://builds.apache.org/job/Any23-trunk/146/])
Fixed issue in Any23PluginManager preventing Tool plugin detection.
Fixed Integration Test.
This commit is related to issues #ANY23-54 and #ANY23-34. (Revision 1304825)
Result = FAILURE
mostarda :
Files :
* /incubator/any23/trunk/core/src/main/java/org/apache/any23/plugin/Any23PluginManager.java
* /incubator/any23/trunk/plugins/integration-test/src/test/java/org/apache/any23/plugin/PluginIT.java
> Plugin Integration Test Fails
> -----------------------------
>
> Key: ANY23-34
> URL: https://issues.apache.org/jira/browse/ANY23-34
> Project: Apache Any23
> Issue Type: Bug
> Affects Versions: 0.7.0
> Reporter: Michele Mostarda
> Assignee: Simone Tripodi
> Fix For: 0.8.0
>
>
> If performing mvn clean install the Plugin Integration Test module fails with the following message:
> {code}
> [INFO] --- maven-invoker-plugin:1.5:run (default) @ any23-integration-test ---
> [INFO] Building: basic-crawler/pom.xml
> [INFO] ..FAILED (36.2 s)
> [INFO] The build exited with code 1. See /home/hudson/hudson-slave/workspace/Any23-trunk/plugins/integration-test/target/plugins-build/basic-crawler/build.log for details.
> [INFO] Building: office-scraper/pom.xml
> [INFO] ..FAILED (8.7 s)
> [INFO] The build exited with code 1. See /home/hudson/hudson-slave/workspace/Any23-trunk/plugins/integration-test/target/plugins-build/office-scraper/build.log for details.
> [INFO] Building: html-scraper/pom.xml
> [INFO] ..FAILED (7.5 s)
> [INFO] The build exited with code 1. See /home/hudson/hudson-slave/workspace/Any23-trunk/plugins/integration-test/target/plugins-build/html-scraper/build.log for details.
> {code}
> The content of /home/hudson/hudson-slave/workspace/Any23-trunk/plugins/integration-test/target/plugins-build/*/build.log files report the following error:
> {code}
> [INFO] ------------------------------------------------------------------------
> [INFO] BUILD FAILURE
> [INFO] ------------------------------------------------------------------------
> [INFO] Total time: 11.195s
> [INFO] Finished at: Sun Jan 15 10:53:22 CET 2012
> [INFO] Final Memory: 23M/81M
> [INFO] ------------------------------------------------------------------------
> [ERROR] Failed to execute goal org.apache.maven.plugins:maven-assembly-plugin:2.2.2:single (assembly) on project any23-office-scraper: Failed to create assembly: Error filtering file '<PATH/TO/TRUNK>/plugins/integration-test/target/plugins-build/office-scraper/./../../LICENSE.txt': <PATH/TO/TRUNK>/plugins/integration-test/target/plugins-build/office-scraper/./../../LICENSE.txt (No such file or directory) -> [Help 1]
> {code}
--
This message is automatically generated by JIRA.
If you think it was sent incorrectly, please contact your JIRA administrators: https://issues.apache.org/jira/secure/ContactAdministrators!default.jspa
For more information on JIRA, see: http://www.atlassian.com/software/jira
[jira] [Commented] (ANY23-34) Plugin Integration Test Fails
Posted by "Simone Tripodi (Commented) (JIRA)" <ji...@apache.org>.
[ https://issues.apache.org/jira/browse/ANY23-34?page=com.atlassian.jira.plugin.system.issuetabpanels:comment-tabpanel&focusedCommentId=13186471#comment-13186471 ]
Simone Tripodi commented on ANY23-34:
-------------------------------------
Jenkins build should be fixed on rev1231648, now I'm working on the definitive solution rather than the workaround
> Plugin Integration Test Fails
> -----------------------------
>
> Key: ANY23-34
> URL: https://issues.apache.org/jira/browse/ANY23-34
> Project: Apache Any23
> Issue Type: Bug
> Reporter: Michele Mostarda
> Assignee: Michele Mostarda
>
> If performing mvn clean install the Plugin Integration Test module fails with the following message:
> {code}
> [INFO] --- maven-invoker-plugin:1.5:run (default) @ any23-integration-test ---
> [INFO] Building: basic-crawler/pom.xml
> [INFO] ..FAILED (36.2 s)
> [INFO] The build exited with code 1. See /home/hudson/hudson-slave/workspace/Any23-trunk/plugins/integration-test/target/plugins-build/basic-crawler/build.log for details.
> [INFO] Building: office-scraper/pom.xml
> [INFO] ..FAILED (8.7 s)
> [INFO] The build exited with code 1. See /home/hudson/hudson-slave/workspace/Any23-trunk/plugins/integration-test/target/plugins-build/office-scraper/build.log for details.
> [INFO] Building: html-scraper/pom.xml
> [INFO] ..FAILED (7.5 s)
> [INFO] The build exited with code 1. See /home/hudson/hudson-slave/workspace/Any23-trunk/plugins/integration-test/target/plugins-build/html-scraper/build.log for details.
> {code}
> The content of /home/hudson/hudson-slave/workspace/Any23-trunk/plugins/integration-test/target/plugins-build/*/build.log files report the following error:
> {code}
> [INFO] ------------------------------------------------------------------------
> [INFO] BUILD FAILURE
> [INFO] ------------------------------------------------------------------------
> [INFO] Total time: 11.195s
> [INFO] Finished at: Sun Jan 15 10:53:22 CET 2012
> [INFO] Final Memory: 23M/81M
> [INFO] ------------------------------------------------------------------------
> [ERROR] Failed to execute goal org.apache.maven.plugins:maven-assembly-plugin:2.2.2:single (assembly) on project any23-office-scraper: Failed to create assembly: Error filtering file '<PATH/TO/TRUNK>/plugins/integration-test/target/plugins-build/office-scraper/./../../LICENSE.txt': <PATH/TO/TRUNK>/plugins/integration-test/target/plugins-build/office-scraper/./../../LICENSE.txt (No such file or directory) -> [Help 1]
> {code}
--
This message is automatically generated by JIRA.
If you think it was sent incorrectly, please contact your JIRA administrators: https://issues.apache.org/jira/secure/ContactAdministrators!default.jspa
For more information on JIRA, see: http://www.atlassian.com/software/jira
[jira] [Resolved] (ANY23-34) Plugin Integration Test Fails
Posted by "Michele Mostarda (Resolved) (JIRA)" <ji...@apache.org>.
[ https://issues.apache.org/jira/browse/ANY23-34?page=com.atlassian.jira.plugin.system.issuetabpanels:all-tabpanel ]
Michele Mostarda resolved ANY23-34.
-----------------------------------
Resolution: Fixed
Fixed @ r1304825.
> Plugin Integration Test Fails
> -----------------------------
>
> Key: ANY23-34
> URL: https://issues.apache.org/jira/browse/ANY23-34
> Project: Apache Any23
> Issue Type: Bug
> Affects Versions: 0.7.0
> Reporter: Michele Mostarda
> Assignee: Simone Tripodi
> Fix For: 0.8.0
>
>
> If performing mvn clean install the Plugin Integration Test module fails with the following message:
> {code}
> [INFO] --- maven-invoker-plugin:1.5:run (default) @ any23-integration-test ---
> [INFO] Building: basic-crawler/pom.xml
> [INFO] ..FAILED (36.2 s)
> [INFO] The build exited with code 1. See /home/hudson/hudson-slave/workspace/Any23-trunk/plugins/integration-test/target/plugins-build/basic-crawler/build.log for details.
> [INFO] Building: office-scraper/pom.xml
> [INFO] ..FAILED (8.7 s)
> [INFO] The build exited with code 1. See /home/hudson/hudson-slave/workspace/Any23-trunk/plugins/integration-test/target/plugins-build/office-scraper/build.log for details.
> [INFO] Building: html-scraper/pom.xml
> [INFO] ..FAILED (7.5 s)
> [INFO] The build exited with code 1. See /home/hudson/hudson-slave/workspace/Any23-trunk/plugins/integration-test/target/plugins-build/html-scraper/build.log for details.
> {code}
> The content of /home/hudson/hudson-slave/workspace/Any23-trunk/plugins/integration-test/target/plugins-build/*/build.log files report the following error:
> {code}
> [INFO] ------------------------------------------------------------------------
> [INFO] BUILD FAILURE
> [INFO] ------------------------------------------------------------------------
> [INFO] Total time: 11.195s
> [INFO] Finished at: Sun Jan 15 10:53:22 CET 2012
> [INFO] Final Memory: 23M/81M
> [INFO] ------------------------------------------------------------------------
> [ERROR] Failed to execute goal org.apache.maven.plugins:maven-assembly-plugin:2.2.2:single (assembly) on project any23-office-scraper: Failed to create assembly: Error filtering file '<PATH/TO/TRUNK>/plugins/integration-test/target/plugins-build/office-scraper/./../../LICENSE.txt': <PATH/TO/TRUNK>/plugins/integration-test/target/plugins-build/office-scraper/./../../LICENSE.txt (No such file or directory) -> [Help 1]
> {code}
--
This message is automatically generated by JIRA.
If you think it was sent incorrectly, please contact your JIRA administrators: https://issues.apache.org/jira/secure/ContactAdministrators!default.jspa
For more information on JIRA, see: http://www.atlassian.com/software/jira
[jira] [Assigned] (ANY23-34) Plugin Integration Test Fails
Posted by "Michele Mostarda (Assigned) (JIRA)" <ji...@apache.org>.
[ https://issues.apache.org/jira/browse/ANY23-34?page=com.atlassian.jira.plugin.system.issuetabpanels:all-tabpanel ]
Michele Mostarda reassigned ANY23-34:
-------------------------------------
Assignee: Simone Tripodi (was: Michele Mostarda)
Simone is taking care of moving the META files in the release MVN profile.
> Plugin Integration Test Fails
> -----------------------------
>
> Key: ANY23-34
> URL: https://issues.apache.org/jira/browse/ANY23-34
> Project: Apache Any23
> Issue Type: Bug
> Reporter: Michele Mostarda
> Assignee: Simone Tripodi
>
> If performing mvn clean install the Plugin Integration Test module fails with the following message:
> {code}
> [INFO] --- maven-invoker-plugin:1.5:run (default) @ any23-integration-test ---
> [INFO] Building: basic-crawler/pom.xml
> [INFO] ..FAILED (36.2 s)
> [INFO] The build exited with code 1. See /home/hudson/hudson-slave/workspace/Any23-trunk/plugins/integration-test/target/plugins-build/basic-crawler/build.log for details.
> [INFO] Building: office-scraper/pom.xml
> [INFO] ..FAILED (8.7 s)
> [INFO] The build exited with code 1. See /home/hudson/hudson-slave/workspace/Any23-trunk/plugins/integration-test/target/plugins-build/office-scraper/build.log for details.
> [INFO] Building: html-scraper/pom.xml
> [INFO] ..FAILED (7.5 s)
> [INFO] The build exited with code 1. See /home/hudson/hudson-slave/workspace/Any23-trunk/plugins/integration-test/target/plugins-build/html-scraper/build.log for details.
> {code}
> The content of /home/hudson/hudson-slave/workspace/Any23-trunk/plugins/integration-test/target/plugins-build/*/build.log files report the following error:
> {code}
> [INFO] ------------------------------------------------------------------------
> [INFO] BUILD FAILURE
> [INFO] ------------------------------------------------------------------------
> [INFO] Total time: 11.195s
> [INFO] Finished at: Sun Jan 15 10:53:22 CET 2012
> [INFO] Final Memory: 23M/81M
> [INFO] ------------------------------------------------------------------------
> [ERROR] Failed to execute goal org.apache.maven.plugins:maven-assembly-plugin:2.2.2:single (assembly) on project any23-office-scraper: Failed to create assembly: Error filtering file '<PATH/TO/TRUNK>/plugins/integration-test/target/plugins-build/office-scraper/./../../LICENSE.txt': <PATH/TO/TRUNK>/plugins/integration-test/target/plugins-build/office-scraper/./../../LICENSE.txt (No such file or directory) -> [Help 1]
> {code}
--
This message is automatically generated by JIRA.
If you think it was sent incorrectly, please contact your JIRA administrators: https://issues.apache.org/jira/secure/ContactAdministrators!default.jspa
For more information on JIRA, see: http://www.atlassian.com/software/jira
[jira] [Resolved] (ANY23-34) Plugin Integration Test Fails
Posted by "Michele Mostarda (Resolved) (JIRA)" <ji...@apache.org>.
[ https://issues.apache.org/jira/browse/ANY23-34?page=com.atlassian.jira.plugin.system.issuetabpanels:all-tabpanel ]
Michele Mostarda resolved ANY23-34.
-----------------------------------
Resolution: Fixed
This is an old issue that was already solved and verified.
> Plugin Integration Test Fails
> -----------------------------
>
> Key: ANY23-34
> URL: https://issues.apache.org/jira/browse/ANY23-34
> Project: Apache Any23
> Issue Type: Bug
> Affects Versions: 0.7.0
> Reporter: Michele Mostarda
> Assignee: Simone Tripodi
> Fix For: 0.8.0
>
>
> If performing mvn clean install the Plugin Integration Test module fails with the following message:
> {code}
> [INFO] --- maven-invoker-plugin:1.5:run (default) @ any23-integration-test ---
> [INFO] Building: basic-crawler/pom.xml
> [INFO] ..FAILED (36.2 s)
> [INFO] The build exited with code 1. See /home/hudson/hudson-slave/workspace/Any23-trunk/plugins/integration-test/target/plugins-build/basic-crawler/build.log for details.
> [INFO] Building: office-scraper/pom.xml
> [INFO] ..FAILED (8.7 s)
> [INFO] The build exited with code 1. See /home/hudson/hudson-slave/workspace/Any23-trunk/plugins/integration-test/target/plugins-build/office-scraper/build.log for details.
> [INFO] Building: html-scraper/pom.xml
> [INFO] ..FAILED (7.5 s)
> [INFO] The build exited with code 1. See /home/hudson/hudson-slave/workspace/Any23-trunk/plugins/integration-test/target/plugins-build/html-scraper/build.log for details.
> {code}
> The content of /home/hudson/hudson-slave/workspace/Any23-trunk/plugins/integration-test/target/plugins-build/*/build.log files report the following error:
> {code}
> [INFO] ------------------------------------------------------------------------
> [INFO] BUILD FAILURE
> [INFO] ------------------------------------------------------------------------
> [INFO] Total time: 11.195s
> [INFO] Finished at: Sun Jan 15 10:53:22 CET 2012
> [INFO] Final Memory: 23M/81M
> [INFO] ------------------------------------------------------------------------
> [ERROR] Failed to execute goal org.apache.maven.plugins:maven-assembly-plugin:2.2.2:single (assembly) on project any23-office-scraper: Failed to create assembly: Error filtering file '<PATH/TO/TRUNK>/plugins/integration-test/target/plugins-build/office-scraper/./../../LICENSE.txt': <PATH/TO/TRUNK>/plugins/integration-test/target/plugins-build/office-scraper/./../../LICENSE.txt (No such file or directory) -> [Help 1]
> {code}
--
This message is automatically generated by JIRA.
If you think it was sent incorrectly, please contact your JIRA administrators: https://issues.apache.org/jira/secure/ContactAdministrators!default.jspa
For more information on JIRA, see: http://www.atlassian.com/software/jira
[jira] [Commented] (ANY23-34) Plugin Integration Test Fails
Posted by "Lewis John McGibbney (Commented) (JIRA)" <ji...@apache.org>.
[ https://issues.apache.org/jira/browse/ANY23-34?page=com.atlassian.jira.plugin.system.issuetabpanels:comment-tabpanel&focusedCommentId=13235615#comment-13235615 ]
Lewis John McGibbney commented on ANY23-34:
-------------------------------------------
This umbrella issue is still a problem, but it doesn't seem to the same suspect. It's the particular testDetectCLIPlugins.
Should be reopen until this is addressed?
> Plugin Integration Test Fails
> -----------------------------
>
> Key: ANY23-34
> URL: https://issues.apache.org/jira/browse/ANY23-34
> Project: Apache Any23
> Issue Type: Bug
> Affects Versions: 0.7.0
> Reporter: Michele Mostarda
> Assignee: Simone Tripodi
> Fix For: 0.8.0
>
>
> If performing mvn clean install the Plugin Integration Test module fails with the following message:
> {code}
> [INFO] --- maven-invoker-plugin:1.5:run (default) @ any23-integration-test ---
> [INFO] Building: basic-crawler/pom.xml
> [INFO] ..FAILED (36.2 s)
> [INFO] The build exited with code 1. See /home/hudson/hudson-slave/workspace/Any23-trunk/plugins/integration-test/target/plugins-build/basic-crawler/build.log for details.
> [INFO] Building: office-scraper/pom.xml
> [INFO] ..FAILED (8.7 s)
> [INFO] The build exited with code 1. See /home/hudson/hudson-slave/workspace/Any23-trunk/plugins/integration-test/target/plugins-build/office-scraper/build.log for details.
> [INFO] Building: html-scraper/pom.xml
> [INFO] ..FAILED (7.5 s)
> [INFO] The build exited with code 1. See /home/hudson/hudson-slave/workspace/Any23-trunk/plugins/integration-test/target/plugins-build/html-scraper/build.log for details.
> {code}
> The content of /home/hudson/hudson-slave/workspace/Any23-trunk/plugins/integration-test/target/plugins-build/*/build.log files report the following error:
> {code}
> [INFO] ------------------------------------------------------------------------
> [INFO] BUILD FAILURE
> [INFO] ------------------------------------------------------------------------
> [INFO] Total time: 11.195s
> [INFO] Finished at: Sun Jan 15 10:53:22 CET 2012
> [INFO] Final Memory: 23M/81M
> [INFO] ------------------------------------------------------------------------
> [ERROR] Failed to execute goal org.apache.maven.plugins:maven-assembly-plugin:2.2.2:single (assembly) on project any23-office-scraper: Failed to create assembly: Error filtering file '<PATH/TO/TRUNK>/plugins/integration-test/target/plugins-build/office-scraper/./../../LICENSE.txt': <PATH/TO/TRUNK>/plugins/integration-test/target/plugins-build/office-scraper/./../../LICENSE.txt (No such file or directory) -> [Help 1]
> {code}
--
This message is automatically generated by JIRA.
If you think it was sent incorrectly, please contact your JIRA administrators: https://issues.apache.org/jira/secure/ContactAdministrators!default.jspa
For more information on JIRA, see: http://www.atlassian.com/software/jira
[jira] [Updated] (ANY23-34) Plugin Integration Test Fails
Posted by "Lewis John McGibbney (Updated) (JIRA)" <ji...@apache.org>.
[ https://issues.apache.org/jira/browse/ANY23-34?page=com.atlassian.jira.plugin.system.issuetabpanels:all-tabpanel ]
Lewis John McGibbney updated ANY23-34:
--------------------------------------
Affects Version/s: 0.7.0
Fix Version/s: 0.8.0
> Plugin Integration Test Fails
> -----------------------------
>
> Key: ANY23-34
> URL: https://issues.apache.org/jira/browse/ANY23-34
> Project: Apache Any23
> Issue Type: Bug
> Affects Versions: 0.7.0
> Reporter: Michele Mostarda
> Assignee: Simone Tripodi
> Fix For: 0.8.0
>
>
> If performing mvn clean install the Plugin Integration Test module fails with the following message:
> {code}
> [INFO] --- maven-invoker-plugin:1.5:run (default) @ any23-integration-test ---
> [INFO] Building: basic-crawler/pom.xml
> [INFO] ..FAILED (36.2 s)
> [INFO] The build exited with code 1. See /home/hudson/hudson-slave/workspace/Any23-trunk/plugins/integration-test/target/plugins-build/basic-crawler/build.log for details.
> [INFO] Building: office-scraper/pom.xml
> [INFO] ..FAILED (8.7 s)
> [INFO] The build exited with code 1. See /home/hudson/hudson-slave/workspace/Any23-trunk/plugins/integration-test/target/plugins-build/office-scraper/build.log for details.
> [INFO] Building: html-scraper/pom.xml
> [INFO] ..FAILED (7.5 s)
> [INFO] The build exited with code 1. See /home/hudson/hudson-slave/workspace/Any23-trunk/plugins/integration-test/target/plugins-build/html-scraper/build.log for details.
> {code}
> The content of /home/hudson/hudson-slave/workspace/Any23-trunk/plugins/integration-test/target/plugins-build/*/build.log files report the following error:
> {code}
> [INFO] ------------------------------------------------------------------------
> [INFO] BUILD FAILURE
> [INFO] ------------------------------------------------------------------------
> [INFO] Total time: 11.195s
> [INFO] Finished at: Sun Jan 15 10:53:22 CET 2012
> [INFO] Final Memory: 23M/81M
> [INFO] ------------------------------------------------------------------------
> [ERROR] Failed to execute goal org.apache.maven.plugins:maven-assembly-plugin:2.2.2:single (assembly) on project any23-office-scraper: Failed to create assembly: Error filtering file '<PATH/TO/TRUNK>/plugins/integration-test/target/plugins-build/office-scraper/./../../LICENSE.txt': <PATH/TO/TRUNK>/plugins/integration-test/target/plugins-build/office-scraper/./../../LICENSE.txt (No such file or directory) -> [Help 1]
> {code}
--
This message is automatically generated by JIRA.
If you think it was sent incorrectly, please contact your JIRA administrators: https://issues.apache.org/jira/secure/ContactAdministrators!default.jspa
For more information on JIRA, see: http://www.atlassian.com/software/jira
[jira] [Commented] (ANY23-34) Plugin Integration Test Fails
Posted by "Hudson (Commented) (JIRA)" <ji...@apache.org>.
[ https://issues.apache.org/jira/browse/ANY23-34?page=com.atlassian.jira.plugin.system.issuetabpanels:comment-tabpanel&focusedCommentId=13186487#comment-13186487 ]
Hudson commented on ANY23-34:
-----------------------------
Integrated in Any23-trunk #74 (See [https://builds.apache.org/job/Any23-trunk/74/])
assembly invocation moved to the release profile - it doesn't solve [ANY23-34] but let Jenkins work
simonetripodi :
Files :
* /incubator/any23/trunk/core/pom.xml
* /incubator/any23/trunk/plugins/basic-crawler/pom.xml
* /incubator/any23/trunk/plugins/html-scraper/pom.xml
* /incubator/any23/trunk/plugins/office-scraper/pom.xml
* /incubator/any23/trunk/service/pom.xml
> Plugin Integration Test Fails
> -----------------------------
>
> Key: ANY23-34
> URL: https://issues.apache.org/jira/browse/ANY23-34
> Project: Apache Any23
> Issue Type: Bug
> Reporter: Michele Mostarda
> Assignee: Simone Tripodi
>
> If performing mvn clean install the Plugin Integration Test module fails with the following message:
> {code}
> [INFO] --- maven-invoker-plugin:1.5:run (default) @ any23-integration-test ---
> [INFO] Building: basic-crawler/pom.xml
> [INFO] ..FAILED (36.2 s)
> [INFO] The build exited with code 1. See /home/hudson/hudson-slave/workspace/Any23-trunk/plugins/integration-test/target/plugins-build/basic-crawler/build.log for details.
> [INFO] Building: office-scraper/pom.xml
> [INFO] ..FAILED (8.7 s)
> [INFO] The build exited with code 1. See /home/hudson/hudson-slave/workspace/Any23-trunk/plugins/integration-test/target/plugins-build/office-scraper/build.log for details.
> [INFO] Building: html-scraper/pom.xml
> [INFO] ..FAILED (7.5 s)
> [INFO] The build exited with code 1. See /home/hudson/hudson-slave/workspace/Any23-trunk/plugins/integration-test/target/plugins-build/html-scraper/build.log for details.
> {code}
> The content of /home/hudson/hudson-slave/workspace/Any23-trunk/plugins/integration-test/target/plugins-build/*/build.log files report the following error:
> {code}
> [INFO] ------------------------------------------------------------------------
> [INFO] BUILD FAILURE
> [INFO] ------------------------------------------------------------------------
> [INFO] Total time: 11.195s
> [INFO] Finished at: Sun Jan 15 10:53:22 CET 2012
> [INFO] Final Memory: 23M/81M
> [INFO] ------------------------------------------------------------------------
> [ERROR] Failed to execute goal org.apache.maven.plugins:maven-assembly-plugin:2.2.2:single (assembly) on project any23-office-scraper: Failed to create assembly: Error filtering file '<PATH/TO/TRUNK>/plugins/integration-test/target/plugins-build/office-scraper/./../../LICENSE.txt': <PATH/TO/TRUNK>/plugins/integration-test/target/plugins-build/office-scraper/./../../LICENSE.txt (No such file or directory) -> [Help 1]
> {code}
--
This message is automatically generated by JIRA.
If you think it was sent incorrectly, please contact your JIRA administrators: https://issues.apache.org/jira/secure/ContactAdministrators!default.jspa
For more information on JIRA, see: http://www.atlassian.com/software/jira
[jira] [Commented] (ANY23-34) Plugin Integration Test Fails
Posted by "Simone Tripodi (Commented) (JIRA)" <ji...@apache.org>.
[ https://issues.apache.org/jira/browse/ANY23-34?page=com.atlassian.jira.plugin.system.issuetabpanels:comment-tabpanel&focusedCommentId=13237630#comment-13237630 ]
Simone Tripodi commented on ANY23-34:
-------------------------------------
Yeah I feel so happy that this bug disappeared! Thanks Mike for fixing it and thanks also to Lewis for the nightly debug session! :)
> Plugin Integration Test Fails
> -----------------------------
>
> Key: ANY23-34
> URL: https://issues.apache.org/jira/browse/ANY23-34
> Project: Apache Any23
> Issue Type: Bug
> Affects Versions: 0.7.0
> Reporter: Michele Mostarda
> Assignee: Simone Tripodi
> Fix For: 0.8.0
>
>
> If performing mvn clean install the Plugin Integration Test module fails with the following message:
> {code}
> [INFO] --- maven-invoker-plugin:1.5:run (default) @ any23-integration-test ---
> [INFO] Building: basic-crawler/pom.xml
> [INFO] ..FAILED (36.2 s)
> [INFO] The build exited with code 1. See /home/hudson/hudson-slave/workspace/Any23-trunk/plugins/integration-test/target/plugins-build/basic-crawler/build.log for details.
> [INFO] Building: office-scraper/pom.xml
> [INFO] ..FAILED (8.7 s)
> [INFO] The build exited with code 1. See /home/hudson/hudson-slave/workspace/Any23-trunk/plugins/integration-test/target/plugins-build/office-scraper/build.log for details.
> [INFO] Building: html-scraper/pom.xml
> [INFO] ..FAILED (7.5 s)
> [INFO] The build exited with code 1. See /home/hudson/hudson-slave/workspace/Any23-trunk/plugins/integration-test/target/plugins-build/html-scraper/build.log for details.
> {code}
> The content of /home/hudson/hudson-slave/workspace/Any23-trunk/plugins/integration-test/target/plugins-build/*/build.log files report the following error:
> {code}
> [INFO] ------------------------------------------------------------------------
> [INFO] BUILD FAILURE
> [INFO] ------------------------------------------------------------------------
> [INFO] Total time: 11.195s
> [INFO] Finished at: Sun Jan 15 10:53:22 CET 2012
> [INFO] Final Memory: 23M/81M
> [INFO] ------------------------------------------------------------------------
> [ERROR] Failed to execute goal org.apache.maven.plugins:maven-assembly-plugin:2.2.2:single (assembly) on project any23-office-scraper: Failed to create assembly: Error filtering file '<PATH/TO/TRUNK>/plugins/integration-test/target/plugins-build/office-scraper/./../../LICENSE.txt': <PATH/TO/TRUNK>/plugins/integration-test/target/plugins-build/office-scraper/./../../LICENSE.txt (No such file or directory) -> [Help 1]
> {code}
--
This message is automatically generated by JIRA.
If you think it was sent incorrectly, please contact your JIRA administrators: https://issues.apache.org/jira/secure/ContactAdministrators!default.jspa
For more information on JIRA, see: http://www.atlassian.com/software/jira
[jira] [Commented] (ANY23-34) Plugin Integration Test Fails
Posted by "Simone Tripodi (Commented) (JIRA)" <ji...@apache.org>.
[ https://issues.apache.org/jira/browse/ANY23-34?page=com.atlassian.jira.plugin.system.issuetabpanels:comment-tabpanel&focusedCommentId=13186523#comment-13186523 ]
Simone Tripodi commented on ANY23-34:
-------------------------------------
Mike,
I created custom legal files in each module to include 3rd parties licenses in LICENSE/NOTICE in the distribution packages, according to http://www.apache.org/dev/release.html#distributing-code-under-several-licenses
Can you help me please on verifying that this is currently working?
Many thanks in advance, all the best!
> Plugin Integration Test Fails
> -----------------------------
>
> Key: ANY23-34
> URL: https://issues.apache.org/jira/browse/ANY23-34
> Project: Apache Any23
> Issue Type: Bug
> Reporter: Michele Mostarda
> Assignee: Simone Tripodi
>
> If performing mvn clean install the Plugin Integration Test module fails with the following message:
> {code}
> [INFO] --- maven-invoker-plugin:1.5:run (default) @ any23-integration-test ---
> [INFO] Building: basic-crawler/pom.xml
> [INFO] ..FAILED (36.2 s)
> [INFO] The build exited with code 1. See /home/hudson/hudson-slave/workspace/Any23-trunk/plugins/integration-test/target/plugins-build/basic-crawler/build.log for details.
> [INFO] Building: office-scraper/pom.xml
> [INFO] ..FAILED (8.7 s)
> [INFO] The build exited with code 1. See /home/hudson/hudson-slave/workspace/Any23-trunk/plugins/integration-test/target/plugins-build/office-scraper/build.log for details.
> [INFO] Building: html-scraper/pom.xml
> [INFO] ..FAILED (7.5 s)
> [INFO] The build exited with code 1. See /home/hudson/hudson-slave/workspace/Any23-trunk/plugins/integration-test/target/plugins-build/html-scraper/build.log for details.
> {code}
> The content of /home/hudson/hudson-slave/workspace/Any23-trunk/plugins/integration-test/target/plugins-build/*/build.log files report the following error:
> {code}
> [INFO] ------------------------------------------------------------------------
> [INFO] BUILD FAILURE
> [INFO] ------------------------------------------------------------------------
> [INFO] Total time: 11.195s
> [INFO] Finished at: Sun Jan 15 10:53:22 CET 2012
> [INFO] Final Memory: 23M/81M
> [INFO] ------------------------------------------------------------------------
> [ERROR] Failed to execute goal org.apache.maven.plugins:maven-assembly-plugin:2.2.2:single (assembly) on project any23-office-scraper: Failed to create assembly: Error filtering file '<PATH/TO/TRUNK>/plugins/integration-test/target/plugins-build/office-scraper/./../../LICENSE.txt': <PATH/TO/TRUNK>/plugins/integration-test/target/plugins-build/office-scraper/./../../LICENSE.txt (No such file or directory) -> [Help 1]
> {code}
--
This message is automatically generated by JIRA.
If you think it was sent incorrectly, please contact your JIRA administrators: https://issues.apache.org/jira/secure/ContactAdministrators!default.jspa
For more information on JIRA, see: http://www.atlassian.com/software/jira
[jira] [Commented] (ANY23-34) Plugin Integration Test Fails
Posted by "Simone Tripodi (Commented) (JIRA)" <ji...@apache.org>.
[ https://issues.apache.org/jira/browse/ANY23-34?page=com.atlassian.jira.plugin.system.issuetabpanels:comment-tabpanel&focusedCommentId=13186468#comment-13186468 ]
Simone Tripodi commented on ANY23-34:
-------------------------------------
Thanks for the notification Mic! I'm moving the assemblies in the `release` profile to let Jenkins work, then I'll fix the build!
> Plugin Integration Test Fails
> -----------------------------
>
> Key: ANY23-34
> URL: https://issues.apache.org/jira/browse/ANY23-34
> Project: Apache Any23
> Issue Type: Bug
> Reporter: Michele Mostarda
> Assignee: Michele Mostarda
>
> If performing mvn clean install the Plugin Integration Test module fails with the following message:
> {code}
> [INFO] --- maven-invoker-plugin:1.5:run (default) @ any23-integration-test ---
> [INFO] Building: basic-crawler/pom.xml
> [INFO] ..FAILED (36.2 s)
> [INFO] The build exited with code 1. See /home/hudson/hudson-slave/workspace/Any23-trunk/plugins/integration-test/target/plugins-build/basic-crawler/build.log for details.
> [INFO] Building: office-scraper/pom.xml
> [INFO] ..FAILED (8.7 s)
> [INFO] The build exited with code 1. See /home/hudson/hudson-slave/workspace/Any23-trunk/plugins/integration-test/target/plugins-build/office-scraper/build.log for details.
> [INFO] Building: html-scraper/pom.xml
> [INFO] ..FAILED (7.5 s)
> [INFO] The build exited with code 1. See /home/hudson/hudson-slave/workspace/Any23-trunk/plugins/integration-test/target/plugins-build/html-scraper/build.log for details.
> {code}
> The content of /home/hudson/hudson-slave/workspace/Any23-trunk/plugins/integration-test/target/plugins-build/*/build.log files report the following error:
> {code}
> [INFO] ------------------------------------------------------------------------
> [INFO] BUILD FAILURE
> [INFO] ------------------------------------------------------------------------
> [INFO] Total time: 11.195s
> [INFO] Finished at: Sun Jan 15 10:53:22 CET 2012
> [INFO] Final Memory: 23M/81M
> [INFO] ------------------------------------------------------------------------
> [ERROR] Failed to execute goal org.apache.maven.plugins:maven-assembly-plugin:2.2.2:single (assembly) on project any23-office-scraper: Failed to create assembly: Error filtering file '<PATH/TO/TRUNK>/plugins/integration-test/target/plugins-build/office-scraper/./../../LICENSE.txt': <PATH/TO/TRUNK>/plugins/integration-test/target/plugins-build/office-scraper/./../../LICENSE.txt (No such file or directory) -> [Help 1]
> {code}
--
This message is automatically generated by JIRA.
If you think it was sent incorrectly, please contact your JIRA administrators: https://issues.apache.org/jira/secure/ContactAdministrators!default.jspa
For more information on JIRA, see: http://www.atlassian.com/software/jira
[jira] [Closed] (ANY23-34) Plugin Integration Test Fails
Posted by "Lewis John McGibbney (JIRA)" <ji...@apache.org>.
[ https://issues.apache.org/jira/browse/ANY23-34?page=com.atlassian.jira.plugin.system.issuetabpanels:all-tabpanel ]
Lewis John McGibbney closed ANY23-34.
-------------------------------------
Bulk close for 0.7.0-incubating release
> Plugin Integration Test Fails
> -----------------------------
>
> Key: ANY23-34
> URL: https://issues.apache.org/jira/browse/ANY23-34
> Project: Apache Any23
> Issue Type: Bug
> Affects Versions: 0.7.0
> Reporter: Michele Mostarda
> Assignee: Simone Tripodi
> Fix For: 0.7.0
>
>
> If performing mvn clean install the Plugin Integration Test module fails with the following message:
> {code}
> [INFO] --- maven-invoker-plugin:1.5:run (default) @ any23-integration-test ---
> [INFO] Building: basic-crawler/pom.xml
> [INFO] ..FAILED (36.2 s)
> [INFO] The build exited with code 1. See /home/hudson/hudson-slave/workspace/Any23-trunk/plugins/integration-test/target/plugins-build/basic-crawler/build.log for details.
> [INFO] Building: office-scraper/pom.xml
> [INFO] ..FAILED (8.7 s)
> [INFO] The build exited with code 1. See /home/hudson/hudson-slave/workspace/Any23-trunk/plugins/integration-test/target/plugins-build/office-scraper/build.log for details.
> [INFO] Building: html-scraper/pom.xml
> [INFO] ..FAILED (7.5 s)
> [INFO] The build exited with code 1. See /home/hudson/hudson-slave/workspace/Any23-trunk/plugins/integration-test/target/plugins-build/html-scraper/build.log for details.
> {code}
> The content of /home/hudson/hudson-slave/workspace/Any23-trunk/plugins/integration-test/target/plugins-build/*/build.log files report the following error:
> {code}
> [INFO] ------------------------------------------------------------------------
> [INFO] BUILD FAILURE
> [INFO] ------------------------------------------------------------------------
> [INFO] Total time: 11.195s
> [INFO] Finished at: Sun Jan 15 10:53:22 CET 2012
> [INFO] Final Memory: 23M/81M
> [INFO] ------------------------------------------------------------------------
> [ERROR] Failed to execute goal org.apache.maven.plugins:maven-assembly-plugin:2.2.2:single (assembly) on project any23-office-scraper: Failed to create assembly: Error filtering file '<PATH/TO/TRUNK>/plugins/integration-test/target/plugins-build/office-scraper/./../../LICENSE.txt': <PATH/TO/TRUNK>/plugins/integration-test/target/plugins-build/office-scraper/./../../LICENSE.txt (No such file or directory) -> [Help 1]
> {code}
--
This message is automatically generated by JIRA.
If you think it was sent incorrectly, please contact your JIRA administrators: https://issues.apache.org/jira/secure/ContactAdministrators!default.jspa
For more information on JIRA, see: http://www.atlassian.com/software/jira