You are viewing a plain text version of this content. The canonical link for it is here.
Posted to commits@tuscany.apache.org by Apache Jenkins Server <je...@builds.apache.org> on 2011/12/31 01:30:00 UTC
Build failed in Jenkins: Tuscany-2x-deploy #605
See <https://builds.apache.org/job/Tuscany-2x-deploy/605/>
------------------------------------------
[...truncated 9184 lines...]
[INFO]
[INFO] --- maven-remote-resources-plugin:1.1:process (default) @ helloworld-webapp ---
[INFO] [INFO] Using 'UTF-8' encoding to copy filtered resources.
[INFO] skip non existing resourceDirectory <https://builds.apache.org/job/Tuscany-2x-deploy/ws/sca-2x/samples/getting-started/helloworld-webapp/src/main/resources>
[INFO] Copying 1 resource
[INFO] Copying 3 resources
[INFO] Copying 3 resources
[INFO] --- maven-resources-plugin:2.4.2:resources (default-resources) @ helloworld-webapp ---
[INFO] [INFO] Nothing to compile - all classes are up to date
[INFO] --- maven-compiler-plugin:2.2:compile (default-compile) @ helloworld-webapp ---
[INFO] [INFO] Configured Artifact: org.apache.tuscany.sca.samples:helloworld:2.0-SNAPSHOT:jar
[INFO] org.apache.tuscany.sca.samples:helloworld:2.0-SNAPSHOT:jar already exists in <https://builds.apache.org/job/Tuscany-2x-deploy/ws/sca-2x/samples/getting-started/helloworld-webapp/src/main/webapp/WEB-INF/sca-contributions>
[INFO] --- maven-dependency-plugin:2.1:copy (copy) @ helloworld-webapp ---
[INFO] [INFO] Using 'UTF-8' encoding to copy filtered resources.
[INFO] Copying 1 resource
[INFO] Copying 3 resources
[INFO] Copying 3 resources
[INFO] --- maven-resources-plugin:2.4.2:testResources (default-testResources) @ helloworld-webapp ---
[INFO] [INFO] Nothing to compile - all classes are up to date
[INFO] --- maven-compiler-plugin:2.2:testCompile (default-testCompile) @ helloworld-webapp ---
[JENKINS] Archiving disabled - not archiving <https://builds.apache.org/job/Tuscany-2x-deploy/ws/sca-2x/samples/getting-started/helloworld-webapp/pom.xml>
[JENKINS] Archiving disabled - not archiving <https://builds.apache.org/job/Tuscany-2x-deploy/ws/sca-2x/samples/getting-started/helloworld-webapp/pom.xml>
[INFO] ------------------------------------------------------------------------
[INFO] Reactor Summary:
[INFO]
[INFO] Apache Tuscany SCA Implementation Project (2.x) ... SUCCESS [33.563s]
[INFO] Apache Tuscany SCA Implementation Modules ......... SUCCESS [4.459s]
[INFO] Apache Tuscany SCA Monitor ........................ SUCCESS [5.869s]
[INFO] Apache Tuscany SCA Extensibility .................. SUCCESS [5.072s]
[INFO] Apache Tuscany SCA Assembly Model ................. SUCCESS [6.236s]
[INFO] Apache Tuscany SCA Assembly Model XSD Files ....... SUCCESS [7.209s]
[INFO] Apache Tuscany SCA Common XML ..................... SUCCESS [6.306s]
[INFO] Apache Tuscany SCA API ............................ SUCCESS [4.293s]
[INFO] Apache Tuscany SCA Common Java .................... SUCCESS [4.683s]
[INFO] Apache Tuscany SCA Contribution Model ............. SUCCESS [6.202s]
[INFO] Apache Tuscany SCA Node API ....................... SUCCESS [7.591s]
[INFO] Apache Tuscany SCA Core SPI ....................... SUCCESS [8.931s]
[INFO] Apache Tuscany SCA XSD Model ...................... SUCCESS [5.436s]
[INFO] Apache Tuscany SCA Assembly XML Model ............. SUCCESS [6.099s]
[INFO] Apache Tuscany SCA WSDL Interface Model ........... SUCCESS [5.981s]
[INFO] Apache Tuscany SCA Interface Java Model ........... SUCCESS [5.391s]
[INFO] Apache Tuscany SCA Core Runtime ................... SUCCESS [7.190s]
[INFO] Apache Tuscany SCA DataBinding Framework .......... SUCCESS [8.722s]
[INFO] Apache Tuscany SCA DataBinding for JAXB ........... SUCCESS [7.789s]
[INFO] Apache Tuscany SCA Model Builders ................. SUCCESS [6.441s]
[INFO] Apache Tuscany SCA Deployment ..................... SUCCESS [4.802s]
[INFO] Apache Tuscany SCA WS Binding Model ............... SUCCESS [4.731s]
[INFO] Apache Tuscany SCA Interface Java For JAXWS ....... SUCCESS [10.129s]
[INFO] Apache Tuscany SCA Core/DataBinding Integration ... SUCCESS [4.209s]
[INFO] Apache Tuscany SCA Web Service binding WSDL Generator SUCCESS [5.142s]
[INFO] Apache Tuscany SCA Binding SCA Runtime ............ SUCCESS [6.318s]
[INFO] Apache Tuscany SCA Implementation Java Model ...... SUCCESS [6.112s]
[INFO] Apache Tuscany SCA Implementation Java Runtime .... SUCCESS [7.005s]
[INFO] Apache Tuscany SCA Node Implementation ............ SUCCESS [6.343s]
[INFO] Apache Tuscany SCA Data API ....................... SUCCESS [4.862s]
[INFO] Apache Tuscany SCA Domain Node .................... SUCCESS [5.398s]
[INFO] Apache Tuscany SCA Web Implementation Model ....... SUCCESS [5.118s]
[INFO] Apache Tuscany SCA HTTP Servlet Host Extension Point SUCCESS [4.872s]
[INFO] Apache Tuscany SCA Webapp Host .................... SUCCESS [4.613s]
[INFO] Apache Tuscany SCA Web Implementation Runtime ..... SUCCESS [4.767s]
[INFO] Apache Tuscany SCA Launcher ....................... SUCCESS [4.089s]
[INFO] Apache Tuscany SCA Client Impl .................... SUCCESS [4.448s]
[INFO] Apache Tuscany SCA Jetty Servlet Host Extension ... SUCCESS [6.320s]
[INFO] Apache Tuscany SCA Shell .......................... SUCCESS [4.718s]
[INFO] Apache Tuscany SCA Stripes Web Framework Integration SUCCESS [7.520s]
[INFO] Apache Tuscany SCA Apache Wink JAX-RS Integration . SUCCESS [4.767s]
[INFO] Apache Tuscany SCA JAXWS-based WS Binding Extension SUCCESS [4.427s]
[INFO] Apache Tuscany SCA JAXWS RI based WS Binding Extension SUCCESS [6.005s]
[INFO] Apache Tuscany SCA Common HTTP .................... SUCCESS [3.926s]
[INFO] Apache Tuscany SCA Core Runtime POM ............... SUCCESS [2.441s]
[INFO] Apache Tuscany SCA Policy Security Model .......... SUCCESS [5.336s]
[INFO] Apache Tuscany SCA Atom Feed Binding Extension .... SUCCESS [4.883s]
[INFO] Apache Tuscany SCA Comet Binding Model ............ SUCCESS [5.193s]
[INFO] Apache Tuscany SCA CORBA Host Extension Point ..... SUCCESS [5.675s]
[INFO] Apache Tuscany SCA CORBA Binding Extension ........ SUCCESS [4.955s]
[INFO] Apache Tuscany SCA EJB Binding Model .............. SUCCESS [4.350s]
[INFO] Apache Tuscany SCA HTTP Binding Model ............. SUCCESS [4.654s]
[INFO] Apache Tuscany SCA JMS Binding Model .............. SUCCESS [5.382s]
[INFO] Apache Tuscany SCA JSONP Binding Model ............ SUCCESS [4.402s]
[INFO] Apache Tuscany SCA JSON-RPC Binding Model ......... SUCCESS [4.342s]
[INFO] Apache Tuscany SCA REST Binding Model ............. SUCCESS [4.530s]
[INFO] Apache Tuscany SCA RMI Binding Model .............. SUCCESS [4.216s]
[INFO] Apache Tuscany SCA BPEL Implementation Extension .. SUCCESS [5.876s]
[INFO] Apache Tuscany SCA Script Implementation Model .... SUCCESS [4.486s]
[INFO] Apache Tuscany SCA Spring Implementation Model .... SUCCESS [5.632s]
[INFO] Apache Tuscany SCA Widget Implementation Model .... SUCCESS [5.258s]
[INFO] Apache Tuscany SCA Base Runtime Jar ............... SUCCESS [13.668s]
[INFO] Apache Tuscany SCA EndPoint Registry using Hazelcast SUCCESS [5.816s]
[INFO] Apache Tuscany Maven Tuscany Plugin ............... SUCCESS [7.910s]
[INFO] Create an SCA JAR contribution project ............ SUCCESS [5.402s]
[INFO] Create an SCA ZIP contribution project ............ SUCCESS [3.472s]
[INFO] Tuscany SCA ZIP contribution Shared Assembly Descriptor SUCCESS [3.102s]
[INFO] Create a simple Apache Tuscany SCA webapp project . SUCCESS [3.963s]
[INFO] Create a Tuscany SCA and JSF project .............. SUCCESS [3.853s]
[INFO] Create a simple Apache Tuscany SCA webapp project using the Stripes Web Framework SUCCESS [4.555s]
[INFO] Create an SCA Webapp project using BPEL ........... SUCCESS [4.095s]
[INFO] Create a Tuscany binding extension project ........ SUCCESS [5.240s]
[INFO] Apache Tuscany SCA Maven Archetypes ............... SUCCESS [2.122s]
[INFO] Apache Tuscany SCA Web JavaScript ................. SUCCESS [4.390s]
[INFO] Apache Tuscany SCA Abdera Atom Feed Binding Extension SUCCESS [11.957s]
[INFO] Apache Tuscany SCA JAX-RS Implementation Model .... SUCCESS [5.035s]
[INFO] Apache Tuscany SCA Python Implementation Model .... SUCCESS [5.258s]
[INFO] Apache Tuscany SCA Base Runtime POM ............... SUCCESS [3.469s]
[INFO] Apache Tuscany SCA Comet Binding Runtime .......... SUCCESS [5.887s]
[INFO] Apache Tuscany SCA EJB Binding Runtime ............ SUCCESS [9.510s]
[INFO] Apache Tuscany SCA Data Binding for JSON .......... SUCCESS [6.259s]
[INFO] Apache Tuscany SCA HTTP Binding Runtime ........... SUCCESS [6.967s]
[INFO] Apache Tuscany SCA JMS Binding Runtime ............ SUCCESS [5.641s]
[INFO] Apache Tuscany SCA JMS Binding Runtime AcytiveMQ .. SUCCESS [5.148s]
[INFO] Apache Tuscany SCA JSONP Binding Runtime .......... SUCCESS [10.156s]
[INFO] Apache Tuscany SCA JSON-RPC Binding Runtime ....... SUCCESS [5.617s]
[INFO] Apache Tuscany SCA Interface Java For JAX_RS ...... SUCCESS [4.470s]
[INFO] Apache Tuscany SCA REST Binding Runtime ........... SUCCESS [5.752s]
[INFO] Apache Tuscany SCA RMI Host Extension Point ....... SUCCESS [4.462s]
[INFO] Apache Tuscany SCA RMI Binding Extension .......... SUCCESS [4.933s]
[INFO] Apache Tuscany SCA Websocket Binding Extension .... SUCCESS [6.659s]
[INFO] Apache Tuscany SCA Policy WS-Policy Model ......... SUCCESS [5.096s]
[INFO] Apache Tuscany SCA Data Binding for Axiom ......... SUCCESS [5.203s]
[INFO] Apache Tuscany SCA Data Binding for JAXB-AXIOM .... SUCCESS [5.174s]
[INFO] Apache Tuscany SCA Axis2-1.5-based WS Binding Runtime SUCCESS [6.183s]
[INFO] Apache Tuscany SCA Resource Import/Export Model ... SUCCESS [5.651s]
[INFO] Apache Tuscany SCA Data Binding for SDO ........... SUCCESS [7.619s]
[INFO] Apache Tuscany SCA Data Binding for SDO/AXIOM ..... SUCCESS [5.872s]
[INFO] Apache Tuscany SCA Tomcat Tribes Based EndPoint Registry SUCCESS [5.063s]
[INFO] Apache Tuscany SCA Extensibility for Eclipse Equinox SUCCESS [5.563s]
[INFO] Apache Tuscany SCA Node Equinox OSGi Launcher ..... SUCCESS [8.571s]
[INFO] Apache Tuscany SCA OSGi HTTP Service Based Servlet Host Extension SUCCESS [5.247s]
[INFO] Apache Tuscany SCA BPEL ODE Implementation Extension SUCCESS [18.563s]
[INFO] Apache Tuscany SCA JAX-RS Implementation Runtime .. SUCCESS [21.064s]
[INFO] Apache Tuscany SCA Python Implementation Extension SUCCESS [10.237s]
[INFO] Apache Tuscany SCA Script Implementation Extension SUCCESS [11.237s]
[INFO] Apache Tuscany SCA Spring Implementation Runtime Model SUCCESS [26.776s]
[INFO] Apache Tuscany SCA Spring Implementation WebApp Integration SUCCESS [11.176s]
[INFO] Apache Tuscany SCA Spring Implementation Runtime Stub SUCCESS [14.902s]
[INFO] Apache Tuscany SCA Spring Implementation Runtime Tie SUCCESS [11.564s]
[INFO] Apache Tuscany SCA Web Implementation Client ...... SUCCESS [12.616s]
[INFO] Apache Tuscany SCA Widget Implementation Runtime .. SUCCESS [8.828s]
[INFO] Apache Tuscany SCA Web JavaScript for DOJO ........ SUCCESS [47.108s]
[INFO] Apache Tuscany SCA Widget Implementation Runtime (Dojo) SUCCESS [36.909s]
[INFO] Apache Tuscany SCA MyFaces JSF Integration ........ SUCCESS [5.344s]
[INFO] Apache Tuscany SCA Node Launcher .................. SUCCESS [5.353s]
[INFO] Apache Tuscany SCA Node Manager ................... SUCCESS [4.980s]
[INFO] Apache Tuscany SCA Extension Policy Logging Model . SUCCESS [5.524s]
[INFO] Apache Tuscany SCA Java JSR250 Implementation ..... SUCCESS [5.615s]
[INFO] Apache Tuscany SCA Transaction Policy Model ....... SUCCESS [10.933s]
[INFO] Apache Tuscany SCA Transaction Policy Runtime ..... SUCCESS [4.526s]
[INFO] Apache Tuscany SCA Transaction Policy Runtime (Geronimo) SUCCESS [6.629s]
[INFO] Apache Tuscany SCA AOP-based Logging and Tracing .. SUCCESS [4.919s]
[INFO] Apache Tuscany SCA Contribution OSGi Bundle ....... SUCCESS [4.021s]
[INFO] Apache Tuscany SCA OSGi Implementation Extension .. SUCCESS [4.990s]
[INFO] Apache Tuscany SCA OSGi Implementation Extension Runtime SUCCESS [4.543s]
[INFO] Apache Tuscany SCA OSGi Node Implementation ....... SUCCESS [6.760s]
[INFO] Apache Tuscany SCA JSE built-in CORBA Host ........ SUCCESS [4.869s]
[INFO] Apache Tuscany SCA JEE environment CORBA Host ..... SUCCESS [6.690s]
[INFO] Apache Tuscany SCA CORBA Binding Runtime .......... SUCCESS [5.957s]
[INFO] Apache Tuscany SCA Transient Name Server CORBA Host SUCCESS [5.972s]
[INFO] Apache Tuscany SCA Composite Diagram Generator Application SUCCESS [6.605s]
[INFO] Apache Tuscany SCA OSGi Runtime POM ............... SUCCESS [3.941s]
[INFO] Apache Tuscany SCA Samples ........................ SUCCESS [1.642s]
[INFO] Apache Tuscany SCA Samples Helloworld ............. SUCCESS [3.972s]
[INFO] Apache Tuscany SCA Samples Helloworld JAX-RS ...... SUCCESS [3.783s]
[INFO] Apache Tuscany SCA Samples Helloworld JSONP ....... SUCCESS [4.902s]
[INFO] Apache Tuscany SCA Samples Helloworld JSON-RPC .... SUCCESS [4.685s]
[INFO] Apache Tuscany SCA Samples Helloworld SCAClient ... SUCCESS [3.902s]
[INFO] Apache Tuscany SCA Samples Helloworld Spring ...... SUCCESS [4.252s]
[INFO] Apache Tuscany SCA Samples Helloworld WebApp ...... FAILURE [4.680s]
[INFO] Apache Tuscany SCA Samples Helloworld Web Service . SKIPPED
[INFO] Apache Tuscany SCA Samples Helloworld With Dependencies SKIPPED
[INFO] Apache Tuscany SCA Samples Getting Started ........ SKIPPED
[INFO] Apache Tuscany SCA Samples Running Tuscany ........ SKIPPED
[INFO] Apache Tuscany SCA Samples JSE .................... SKIPPED
[INFO] Apache Tuscany SCA Samples JUnit .................. SKIPPED
[INFO] Apache Tuscany SCA Sample Async Invocation ........ SKIPPED
[INFO] Apache Tuscany SCA Sample Learning More ........... SKIPPED
[INFO] Apache Tuscany SCA Sample binding.comet ........... SKIPPED
[INFO] Apache Tuscany SCA Sample binding.comet Real-Time Suggestions Webapp SKIPPED
[INFO] Apache Tuscany SCA Sample binding.comet Weather Monitor Webapp SKIPPED
[INFO] Apache Tuscany SCA Sample binding.comet PubSub Webapp SKIPPED
[INFO] Apache Tuscany SCA Sample binding.comet Chat Webapp SKIPPED
[INFO] Apache Tuscany SCA Sample binding.websocket ....... SKIPPED
[INFO] Apache Tuscany SCA Sample binding.websocket Autocomplete Webapp SKIPPED
[INFO] Apache Tuscany SCA Sample binding.websocket Weather Monitor Webapp SKIPPED
[INFO] Apache Tuscany SCA Sample binding.websocket Chat Webapp SKIPPED
[INFO] Apache Tuscany SCA Sample binding.websocket PubSub Webapp SKIPPED
[INFO] Apache Tuscany SCA Sample Calculator OSGi ......... SKIPPED
[INFO] Apache Tuscany SCA Sample OSGi Remote Services Calculator SKIPPED
[INFO] Apache Tuscany SCA Sample OSGi Remote Services Calculator Operations SKIPPED
[INFO] Apache Tuscany SCA Distributed OSGI Statically Configured Samples SKIPPED
[INFO] Apache Tuscany SCA All-in-one Distribution ........ SKIPPED
[INFO] ------------------------------------------------------------------------
[INFO] BUILD FAILURE
[INFO] ------------------------------------------------------------------------
[INFO] Total time: 18:48.878s
[INFO] Finished at: Sat Dec 31 00:29:55 UTC 2011
[INFO] Final Memory: 88M/744M
[INFO] ------------------------------------------------------------------------
Waiting for Jenkins to finish collecting data
mavenExecutionResult exceptions not empty
message : Internal error: java.lang.NullPointerException
cause : null
Stack trace :
org.apache.maven.InternalErrorException: Internal error: java.lang.NullPointerException
at org.apache.maven.lifecycle.internal.BuilderCommon.handleBuildError(BuilderCommon.java:128)
at org.apache.maven.lifecycle.internal.LifecycleModuleBuilder.buildProject(LifecycleModuleBuilder.java:95)
at org.apache.maven.lifecycle.internal.LifecycleModuleBuilder.buildProject(LifecycleModuleBuilder.java:59)
at org.apache.maven.lifecycle.internal.LifecycleStarter.singleThreadedBuild(LifecycleStarter.java:183)
at org.apache.maven.lifecycle.internal.LifecycleStarter.execute(LifecycleStarter.java:161)
at org.apache.maven.DefaultMaven.doExecute(DefaultMaven.java:319)
at org.apache.maven.DefaultMaven.execute(DefaultMaven.java:156)
at org.jvnet.hudson.maven3.launcher.Maven3Launcher.main(Maven3Launcher.java:79)
at sun.reflect.NativeMethodAccessorImpl.invoke0(Native Method)
at sun.reflect.NativeMethodAccessorImpl.invoke(NativeMethodAccessorImpl.java:39)
at sun.reflect.DelegatingMethodAccessorImpl.invoke(DelegatingMethodAccessorImpl.java:25)
at java.lang.reflect.Method.invoke(Method.java:597)
at org.codehaus.plexus.classworlds.launcher.Launcher.launchStandard(Launcher.java:329)
at org.codehaus.plexus.classworlds.launcher.Launcher.launch(Launcher.java:239)
at org.jvnet.hudson.maven3.agent.Maven3Main.launch(Maven3Main.java:158)
at hudson.maven.Maven3Builder.call(Maven3Builder.java:112)
at hudson.maven.Maven3Builder.call(Maven3Builder.java:70)
at hudson.remoting.UserRequest.perform(UserRequest.java:118)
at hudson.remoting.UserRequest.perform(UserRequest.java:48)
at hudson.remoting.Request$2.run(Request.java:287)
at java.util.concurrent.Executors$RunnableAdapter.call(Executors.java:441)
at java.util.concurrent.FutureTask$Sync.innerRun(FutureTask.java:303)
at java.util.concurrent.FutureTask.run(FutureTask.java:138)
at java.util.concurrent.ThreadPoolExecutor$Worker.runTask(ThreadPoolExecutor.java:886)
at java.util.concurrent.ThreadPoolExecutor$Worker.run(ThreadPoolExecutor.java:908)
at java.lang.Thread.run(Thread.java:662)
Caused by: java.lang.NullPointerException
at hudson.maven.ExecutedMojo.getMojoClass(ExecutedMojo.java:114)
at hudson.maven.ExecutedMojo.<init>(ExecutedMojo.java:99)
at hudson.maven.Maven3Builder$MavenExecutionListener.recordExecutionTime(Maven3Builder.java:524)
at hudson.maven.Maven3Builder$MavenExecutionListener.recordMojoSucceeded(Maven3Builder.java:493)
at hudson.maven.Maven3Builder$MavenExecutionListener.forkSucceeded(Maven3Builder.java:601)
at org.apache.maven.lifecycle.internal.DefaultExecutionEventCatapult.fire(DefaultExecutionEventCatapult.java:97)
at org.apache.maven.lifecycle.internal.DefaultExecutionEventCatapult.fire(DefaultExecutionEventCatapult.java:42)
at org.apache.maven.lifecycle.internal.MojoExecutor.executeForkedExecutions(MojoExecutor.java:383)
at org.apache.maven.lifecycle.internal.MojoExecutor.execute(MojoExecutor.java:199)
at org.apache.maven.lifecycle.internal.MojoExecutor.execute(MojoExecutor.java:153)
at org.apache.maven.lifecycle.internal.MojoExecutor.execute(MojoExecutor.java:145)
at org.apache.maven.lifecycle.internal.LifecycleModuleBuilder.buildProject(LifecycleModuleBuilder.java:84)
... 24 more
Sending e-mails to: commits@tuscany.apache.org
channel stopped
Jenkins build is back to normal : Tuscany-2x-deploy #608
Posted by Apache Jenkins Server <je...@builds.apache.org>.
See <https://builds.apache.org/job/Tuscany-2x-deploy/608/>
Build failed in Jenkins: Tuscany-2x-deploy #607
Posted by Apache Jenkins Server <je...@builds.apache.org>.
See <https://builds.apache.org/job/Tuscany-2x-deploy/607/>
------------------------------------------
[...truncated 9183 lines...]
[INFO] --- maven-enforcer-plugin:1.0:enforce (enforce-plugin-versions) @ helloworld-webapp ---
[INFO]
[INFO] --- maven-remote-resources-plugin:1.1:process (default) @ helloworld-webapp ---
[INFO] [INFO] Using 'UTF-8' encoding to copy filtered resources.
[INFO] skip non existing resourceDirectory <https://builds.apache.org/job/Tuscany-2x-deploy/ws/sca-2x/samples/getting-started/helloworld-webapp/src/main/resources>
[INFO] Copying 1 resource
[INFO] Copying 3 resources
[INFO] Copying 3 resources
[INFO] --- maven-resources-plugin:2.4.2:resources (default-resources) @ helloworld-webapp ---
[INFO] [INFO] Nothing to compile - all classes are up to date
[INFO] --- maven-compiler-plugin:2.2:compile (default-compile) @ helloworld-webapp ---
[INFO] [INFO] Configured Artifact: org.apache.tuscany.sca.samples:helloworld:2.0-SNAPSHOT:jar
[INFO] org.apache.tuscany.sca.samples:helloworld:2.0-SNAPSHOT:jar already exists in <https://builds.apache.org/job/Tuscany-2x-deploy/ws/sca-2x/samples/getting-started/helloworld-webapp/src/main/webapp/WEB-INF/sca-contributions>
[INFO] --- maven-dependency-plugin:2.1:copy (copy) @ helloworld-webapp ---
[INFO] [INFO] Using 'UTF-8' encoding to copy filtered resources.
[INFO] Copying 1 resource
[INFO] Copying 3 resources
[INFO] Copying 3 resources
[INFO] --- maven-resources-plugin:2.4.2:testResources (default-testResources) @ helloworld-webapp ---
[INFO] [INFO] Nothing to compile - all classes are up to date
[INFO] --- maven-compiler-plugin:2.2:testCompile (default-testCompile) @ helloworld-webapp ---
[JENKINS] Archiving disabled - not archiving <https://builds.apache.org/job/Tuscany-2x-deploy/ws/sca-2x/samples/getting-started/helloworld-webapp/pom.xml>
[JENKINS] Archiving disabled - not archiving <https://builds.apache.org/job/Tuscany-2x-deploy/ws/sca-2x/samples/getting-started/helloworld-webapp/pom.xml>
[INFO] ------------------------------------------------------------------------
[INFO] Reactor Summary:
[INFO]
[INFO] Apache Tuscany SCA Implementation Project (2.x) ... SUCCESS [48.900s]
[INFO] Apache Tuscany SCA Implementation Modules ......... SUCCESS [6.513s]
[INFO] Apache Tuscany SCA Monitor ........................ SUCCESS [5.777s]
[INFO] Apache Tuscany SCA Extensibility .................. SUCCESS [5.074s]
[INFO] Apache Tuscany SCA Assembly Model ................. SUCCESS [6.380s]
[INFO] Apache Tuscany SCA Assembly Model XSD Files ....... SUCCESS [4.608s]
[INFO] Apache Tuscany SCA Common XML ..................... SUCCESS [6.072s]
[INFO] Apache Tuscany SCA API ............................ SUCCESS [9.097s]
[INFO] Apache Tuscany SCA Common Java .................... SUCCESS [4.952s]
[INFO] Apache Tuscany SCA Contribution Model ............. SUCCESS [6.939s]
[INFO] Apache Tuscany SCA Node API ....................... SUCCESS [4.615s]
[INFO] Apache Tuscany SCA Core SPI ....................... SUCCESS [9.475s]
[INFO] Apache Tuscany SCA XSD Model ...................... SUCCESS [6.349s]
[INFO] Apache Tuscany SCA Assembly XML Model ............. SUCCESS [5.803s]
[INFO] Apache Tuscany SCA WSDL Interface Model ........... SUCCESS [5.672s]
[INFO] Apache Tuscany SCA Interface Java Model ........... SUCCESS [5.060s]
[INFO] Apache Tuscany SCA Core Runtime ................... SUCCESS [6.066s]
[INFO] Apache Tuscany SCA DataBinding Framework .......... SUCCESS [5.371s]
[INFO] Apache Tuscany SCA DataBinding for JAXB ........... SUCCESS [7.395s]
[INFO] Apache Tuscany SCA Model Builders ................. SUCCESS [9.669s]
[INFO] Apache Tuscany SCA Deployment ..................... SUCCESS [4.944s]
[INFO] Apache Tuscany SCA WS Binding Model ............... SUCCESS [4.932s]
[INFO] Apache Tuscany SCA Interface Java For JAXWS ....... SUCCESS [10.491s]
[INFO] Apache Tuscany SCA Core/DataBinding Integration ... SUCCESS [5.229s]
[INFO] Apache Tuscany SCA Web Service binding WSDL Generator SUCCESS [5.393s]
[INFO] Apache Tuscany SCA Binding SCA Runtime ............ SUCCESS [6.034s]
[INFO] Apache Tuscany SCA Implementation Java Model ...... SUCCESS [6.591s]
[INFO] Apache Tuscany SCA Implementation Java Runtime .... SUCCESS [6.335s]
[INFO] Apache Tuscany SCA Node Implementation ............ SUCCESS [5.663s]
[INFO] Apache Tuscany SCA Data API ....................... SUCCESS [3.962s]
[INFO] Apache Tuscany SCA Domain Node .................... SUCCESS [6.067s]
[INFO] Apache Tuscany SCA Web Implementation Model ....... SUCCESS [5.159s]
[INFO] Apache Tuscany SCA HTTP Servlet Host Extension Point SUCCESS [5.616s]
[INFO] Apache Tuscany SCA Webapp Host .................... SUCCESS [6.686s]
[INFO] Apache Tuscany SCA Web Implementation Runtime ..... SUCCESS [6.073s]
[INFO] Apache Tuscany SCA Launcher ....................... SUCCESS [5.467s]
[INFO] Apache Tuscany SCA Client Impl .................... SUCCESS [4.013s]
[INFO] Apache Tuscany SCA Jetty Servlet Host Extension ... SUCCESS [5.865s]
[INFO] Apache Tuscany SCA Shell .......................... SUCCESS [5.579s]
[INFO] Apache Tuscany SCA Stripes Web Framework Integration SUCCESS [4.687s]
[INFO] Apache Tuscany SCA Apache Wink JAX-RS Integration . SUCCESS [4.497s]
[INFO] Apache Tuscany SCA JAXWS-based WS Binding Extension SUCCESS [4.341s]
[INFO] Apache Tuscany SCA JAXWS RI based WS Binding Extension SUCCESS [4.834s]
[INFO] Apache Tuscany SCA Common HTTP .................... SUCCESS [4.484s]
[INFO] Apache Tuscany SCA Core Runtime POM ............... SUCCESS [2.206s]
[INFO] Apache Tuscany SCA Policy Security Model .......... SUCCESS [5.004s]
[INFO] Apache Tuscany SCA Atom Feed Binding Extension .... SUCCESS [4.389s]
[INFO] Apache Tuscany SCA Comet Binding Model ............ SUCCESS [4.315s]
[INFO] Apache Tuscany SCA CORBA Host Extension Point ..... SUCCESS [4.522s]
[INFO] Apache Tuscany SCA CORBA Binding Extension ........ SUCCESS [4.134s]
[INFO] Apache Tuscany SCA EJB Binding Model .............. SUCCESS [3.950s]
[INFO] Apache Tuscany SCA HTTP Binding Model ............. SUCCESS [4.967s]
[INFO] Apache Tuscany SCA JMS Binding Model .............. SUCCESS [10.145s]
[INFO] Apache Tuscany SCA JSONP Binding Model ............ SUCCESS [4.393s]
[INFO] Apache Tuscany SCA JSON-RPC Binding Model ......... SUCCESS [4.955s]
[INFO] Apache Tuscany SCA REST Binding Model ............. SUCCESS [5.026s]
[INFO] Apache Tuscany SCA RMI Binding Model .............. SUCCESS [4.479s]
[INFO] Apache Tuscany SCA BPEL Implementation Extension .. SUCCESS [6.300s]
[INFO] Apache Tuscany SCA Script Implementation Model .... SUCCESS [3.983s]
[INFO] Apache Tuscany SCA Spring Implementation Model .... SUCCESS [4.072s]
[INFO] Apache Tuscany SCA Widget Implementation Model .... SUCCESS [5.426s]
[INFO] Apache Tuscany SCA Base Runtime Jar ............... SUCCESS [13.802s]
[INFO] Apache Tuscany SCA EndPoint Registry using Hazelcast SUCCESS [5.454s]
[INFO] Apache Tuscany Maven Tuscany Plugin ............... SUCCESS [6.360s]
[INFO] Create an SCA JAR contribution project ............ SUCCESS [4.456s]
[INFO] Create an SCA ZIP contribution project ............ SUCCESS [4.132s]
[INFO] Tuscany SCA ZIP contribution Shared Assembly Descriptor SUCCESS [3.263s]
[INFO] Create a simple Apache Tuscany SCA webapp project . SUCCESS [4.758s]
[INFO] Create a Tuscany SCA and JSF project .............. SUCCESS [4.972s]
[INFO] Create a simple Apache Tuscany SCA webapp project using the Stripes Web Framework SUCCESS [6.458s]
[INFO] Create an SCA Webapp project using BPEL ........... SUCCESS [8.095s]
[INFO] Create a Tuscany binding extension project ........ SUCCESS [7.216s]
[INFO] Apache Tuscany SCA Maven Archetypes ............... SUCCESS [2.012s]
[INFO] Apache Tuscany SCA Web JavaScript ................. SUCCESS [4.642s]
[INFO] Apache Tuscany SCA Abdera Atom Feed Binding Extension SUCCESS [8.054s]
[INFO] Apache Tuscany SCA JAX-RS Implementation Model .... SUCCESS [4.869s]
[INFO] Apache Tuscany SCA Python Implementation Model .... SUCCESS [4.376s]
[INFO] Apache Tuscany SCA Base Runtime POM ............... SUCCESS [3.980s]
[INFO] Apache Tuscany SCA Comet Binding Runtime .......... SUCCESS [6.054s]
[INFO] Apache Tuscany SCA EJB Binding Runtime ............ SUCCESS [7.738s]
[INFO] Apache Tuscany SCA Data Binding for JSON .......... SUCCESS [4.981s]
[INFO] Apache Tuscany SCA HTTP Binding Runtime ........... SUCCESS [5.294s]
[INFO] Apache Tuscany SCA JMS Binding Runtime ............ SUCCESS [5.977s]
[INFO] Apache Tuscany SCA JMS Binding Runtime AcytiveMQ .. SUCCESS [5.022s]
[INFO] Apache Tuscany SCA JSONP Binding Runtime .......... SUCCESS [6.125s]
[INFO] Apache Tuscany SCA JSON-RPC Binding Runtime ....... SUCCESS [5.812s]
[INFO] Apache Tuscany SCA Interface Java For JAX_RS ...... SUCCESS [5.187s]
[INFO] Apache Tuscany SCA REST Binding Runtime ........... SUCCESS [5.928s]
[INFO] Apache Tuscany SCA RMI Host Extension Point ....... SUCCESS [4.718s]
[INFO] Apache Tuscany SCA RMI Binding Extension .......... SUCCESS [4.496s]
[INFO] Apache Tuscany SCA Websocket Binding Extension .... SUCCESS [5.918s]
[INFO] Apache Tuscany SCA Policy WS-Policy Model ......... SUCCESS [4.719s]
[INFO] Apache Tuscany SCA Data Binding for Axiom ......... SUCCESS [4.940s]
[INFO] Apache Tuscany SCA Data Binding for JAXB-AXIOM .... SUCCESS [5.141s]
[INFO] Apache Tuscany SCA Axis2-1.5-based WS Binding Runtime SUCCESS [6.868s]
[INFO] Apache Tuscany SCA Resource Import/Export Model ... SUCCESS [5.621s]
[INFO] Apache Tuscany SCA Data Binding for SDO ........... SUCCESS [7.782s]
[INFO] Apache Tuscany SCA Data Binding for SDO/AXIOM ..... SUCCESS [6.283s]
[INFO] Apache Tuscany SCA Tomcat Tribes Based EndPoint Registry SUCCESS [4.781s]
[INFO] Apache Tuscany SCA Extensibility for Eclipse Equinox SUCCESS [6.165s]
[INFO] Apache Tuscany SCA Node Equinox OSGi Launcher ..... SUCCESS [8.440s]
[INFO] Apache Tuscany SCA OSGi HTTP Service Based Servlet Host Extension SUCCESS [4.937s]
[INFO] Apache Tuscany SCA BPEL ODE Implementation Extension SUCCESS [7.879s]
[INFO] Apache Tuscany SCA JAX-RS Implementation Runtime .. SUCCESS [5.564s]
[INFO] Apache Tuscany SCA Python Implementation Extension SUCCESS [5.357s]
[INFO] Apache Tuscany SCA Script Implementation Extension SUCCESS [6.331s]
[INFO] Apache Tuscany SCA Spring Implementation Runtime Model SUCCESS [4.932s]
[INFO] Apache Tuscany SCA Spring Implementation WebApp Integration SUCCESS [6.249s]
[INFO] Apache Tuscany SCA Spring Implementation Runtime Stub SUCCESS [5.657s]
[INFO] Apache Tuscany SCA Spring Implementation Runtime Tie SUCCESS [5.013s]
[INFO] Apache Tuscany SCA Web Implementation Client ...... SUCCESS [6.318s]
[INFO] Apache Tuscany SCA Widget Implementation Runtime .. SUCCESS [6.898s]
[INFO] Apache Tuscany SCA Web JavaScript for DOJO ........ SUCCESS [26.184s]
[INFO] Apache Tuscany SCA Widget Implementation Runtime (Dojo) SUCCESS [18.906s]
[INFO] Apache Tuscany SCA MyFaces JSF Integration ........ SUCCESS [7.097s]
[INFO] Apache Tuscany SCA Node Launcher .................. SUCCESS [17.574s]
[INFO] Apache Tuscany SCA Node Manager ................... SUCCESS [6.148s]
[INFO] Apache Tuscany SCA Extension Policy Logging Model . SUCCESS [6.904s]
[INFO] Apache Tuscany SCA Java JSR250 Implementation ..... SUCCESS [5.551s]
[INFO] Apache Tuscany SCA Transaction Policy Model ....... SUCCESS [5.273s]
[INFO] Apache Tuscany SCA Transaction Policy Runtime ..... SUCCESS [7.051s]
[INFO] Apache Tuscany SCA Transaction Policy Runtime (Geronimo) SUCCESS [8.402s]
[INFO] Apache Tuscany SCA AOP-based Logging and Tracing .. SUCCESS [7.097s]
[INFO] Apache Tuscany SCA Contribution OSGi Bundle ....... SUCCESS [6.742s]
[INFO] Apache Tuscany SCA OSGi Implementation Extension .. SUCCESS [11.818s]
[INFO] Apache Tuscany SCA OSGi Implementation Extension Runtime SUCCESS [4.856s]
[INFO] Apache Tuscany SCA OSGi Node Implementation ....... SUCCESS [7.636s]
[INFO] Apache Tuscany SCA JSE built-in CORBA Host ........ SUCCESS [6.068s]
[INFO] Apache Tuscany SCA JEE environment CORBA Host ..... SUCCESS [5.424s]
[INFO] Apache Tuscany SCA CORBA Binding Runtime .......... SUCCESS [9.138s]
[INFO] Apache Tuscany SCA Transient Name Server CORBA Host SUCCESS [5.280s]
[INFO] Apache Tuscany SCA Composite Diagram Generator Application SUCCESS [8.685s]
[INFO] Apache Tuscany SCA OSGi Runtime POM ............... SUCCESS [1.901s]
[INFO] Apache Tuscany SCA Samples ........................ SUCCESS [2.231s]
[INFO] Apache Tuscany SCA Samples Helloworld ............. SUCCESS [4.592s]
[INFO] Apache Tuscany SCA Samples Helloworld JAX-RS ...... SUCCESS [3.878s]
[INFO] Apache Tuscany SCA Samples Helloworld JSONP ....... SUCCESS [4.301s]
[INFO] Apache Tuscany SCA Samples Helloworld JSON-RPC .... SUCCESS [4.615s]
[INFO] Apache Tuscany SCA Samples Helloworld SCAClient ... SUCCESS [3.948s]
[INFO] Apache Tuscany SCA Samples Helloworld Spring ...... SUCCESS [5.215s]
[INFO] Apache Tuscany SCA Samples Helloworld WebApp ...... FAILURE [4.833s]
[INFO] Apache Tuscany SCA Samples Helloworld Web Service . SKIPPED
[INFO] Apache Tuscany SCA Samples Helloworld With Dependencies SKIPPED
[INFO] Apache Tuscany SCA Samples Getting Started ........ SKIPPED
[INFO] Apache Tuscany SCA Samples Running Tuscany ........ SKIPPED
[INFO] Apache Tuscany SCA Samples JSE .................... SKIPPED
[INFO] Apache Tuscany SCA Samples JUnit .................. SKIPPED
[INFO] Apache Tuscany SCA Sample Async Invocation ........ SKIPPED
[INFO] Apache Tuscany SCA Sample Learning More ........... SKIPPED
[INFO] Apache Tuscany SCA Sample binding.comet ........... SKIPPED
[INFO] Apache Tuscany SCA Sample binding.comet Real-Time Suggestions Webapp SKIPPED
[INFO] Apache Tuscany SCA Sample binding.comet Weather Monitor Webapp SKIPPED
[INFO] Apache Tuscany SCA Sample binding.comet PubSub Webapp SKIPPED
[INFO] Apache Tuscany SCA Sample binding.comet Chat Webapp SKIPPED
[INFO] Apache Tuscany SCA Sample binding.websocket ....... SKIPPED
[INFO] Apache Tuscany SCA Sample binding.websocket Autocomplete Webapp SKIPPED
[INFO] Apache Tuscany SCA Sample binding.websocket Weather Monitor Webapp SKIPPED
[INFO] Apache Tuscany SCA Sample binding.websocket Chat Webapp SKIPPED
[INFO] Apache Tuscany SCA Sample binding.websocket PubSub Webapp SKIPPED
[INFO] Apache Tuscany SCA Sample Calculator OSGi ......... SKIPPED
[INFO] Apache Tuscany SCA Sample OSGi Remote Services Calculator SKIPPED
[INFO] Apache Tuscany SCA Sample OSGi Remote Services Calculator Operations SKIPPED
[INFO] Apache Tuscany SCA Distributed OSGI Statically Configured Samples SKIPPED
[INFO] Apache Tuscany SCA All-in-one Distribution ........ SKIPPED
[INFO] ------------------------------------------------------------------------
[INFO] BUILD FAILURE
[INFO] ------------------------------------------------------------------------
[INFO] Total time: 17:40.175s
[INFO] Finished at: Sun Jan 01 00:29:38 UTC 2012
[INFO] Final Memory: 88M/744M
[INFO] ------------------------------------------------------------------------
mavenExecutionResult exceptions not empty
message : Internal error: java.lang.NullPointerException
cause : null
Stack trace :
org.apache.maven.InternalErrorException: Internal error: java.lang.NullPointerException
at org.apache.maven.lifecycle.internal.BuilderCommon.handleBuildError(BuilderCommon.java:128)
at org.apache.maven.lifecycle.internal.LifecycleModuleBuilder.buildProject(LifecycleModuleBuilder.java:95)
at org.apache.maven.lifecycle.internal.LifecycleModuleBuilder.buildProject(LifecycleModuleBuilder.java:59)
at org.apache.maven.lifecycle.internal.LifecycleStarter.singleThreadedBuild(LifecycleStarter.java:183)
at org.apache.maven.lifecycle.internal.LifecycleStarter.execute(LifecycleStarter.java:161)
at org.apache.maven.DefaultMaven.doExecute(DefaultMaven.java:319)
at org.apache.maven.DefaultMaven.execute(DefaultMaven.java:156)
at org.jvnet.hudson.maven3.launcher.Maven3Launcher.main(Maven3Launcher.java:79)
at sun.reflect.NativeMethodAccessorImpl.invoke0(Native Method)
at sun.reflect.NativeMethodAccessorImpl.invoke(NativeMethodAccessorImpl.java:39)
at sun.reflect.DelegatingMethodAccessorImpl.invoke(DelegatingMethodAccessorImpl.java:25)
at java.lang.reflect.Method.invoke(Method.java:597)
at org.codehaus.plexus.classworlds.launcher.Launcher.launchStandard(Launcher.java:329)
at org.codehaus.plexus.classworlds.launcher.Launcher.launch(Launcher.java:239)
at org.jvnet.hudson.maven3.agent.Maven3Main.launch(Maven3Main.java:158)
at hudson.maven.Maven3Builder.call(Maven3Builder.java:112)
at hudson.maven.Maven3Builder.call(Maven3Builder.java:70)
at hudson.remoting.UserRequest.perform(UserRequest.java:118)
at hudson.remoting.UserRequest.perform(UserRequest.java:48)
at hudson.remoting.Request$2.run(Request.java:287)
at java.util.concurrent.Executors$RunnableAdapter.call(Executors.java:441)
at java.util.concurrent.FutureTask$Sync.innerRun(FutureTask.java:303)
at java.util.concurrent.FutureTask.run(FutureTask.java:138)
at java.util.concurrent.ThreadPoolExecutor$Worker.runTask(ThreadPoolExecutor.java:886)
at java.util.concurrent.ThreadPoolExecutor$Worker.run(ThreadPoolExecutor.java:908)
at java.lang.Thread.run(Thread.java:662)
Caused by: java.lang.NullPointerException
at hudson.maven.ExecutedMojo.getMojoClass(ExecutedMojo.java:114)
at hudson.maven.ExecutedMojo.<init>(ExecutedMojo.java:99)
at hudson.maven.Maven3Builder$MavenExecutionListener.recordExecutionTime(Maven3Builder.java:524)
at hudson.maven.Maven3Builder$MavenExecutionListener.recordMojoSucceeded(Maven3Builder.java:493)
at hudson.maven.Maven3Builder$MavenExecutionListener.forkSucceeded(Maven3Builder.java:601)
at org.apache.maven.lifecycle.internal.DefaultExecutionEventCatapult.fire(DefaultExecutionEventCatapult.java:97)
at org.apache.maven.lifecycle.internal.DefaultExecutionEventCatapult.fire(DefaultExecutionEventCatapult.java:42)
at org.apache.maven.lifecycle.internal.MojoExecutor.executeForkedExecutions(MojoExecutor.java:383)
at org.apache.maven.lifecycle.internal.MojoExecutor.execute(MojoExecutor.java:199)
at org.apache.maven.lifecycle.internal.MojoExecutor.execute(MojoExecutor.java:153)
at org.apache.maven.lifecycle.internal.MojoExecutor.execute(MojoExecutor.java:145)
at org.apache.maven.lifecycle.internal.LifecycleModuleBuilder.buildProject(LifecycleModuleBuilder.java:84)
... 24 more
Sending e-mails to: commits@tuscany.apache.org
channel stopped
Build failed in Jenkins: Tuscany-2x-deploy #606
Posted by Apache Jenkins Server <je...@builds.apache.org>.
See <https://builds.apache.org/job/Tuscany-2x-deploy/606/>
------------------------------------------
[...truncated 9183 lines...]
[INFO]
[INFO] --- maven-remote-resources-plugin:1.1:process (default) @ helloworld-webapp ---
[INFO] The requirePluginVersions rule is currently not compatible with Maven3.
[INFO]
[INFO] --- maven-resources-plugin:2.4.2:resources (default-resources) @ helloworld-webapp ---
[INFO]
[INFO] --- maven-compiler-plugin:2.2:compile (default-compile) @ helloworld-webapp ---
[INFO] Using 'UTF-8' encoding to copy filtered resources.
[INFO] skip non existing resourceDirectory <https://builds.apache.org/job/Tuscany-2x-deploy/ws/sca-2x/samples/getting-started/helloworld-webapp/src/main/resources>
[INFO] Copying 1 resource
[INFO] Copying 3 resources
[INFO] Copying 3 resources
[INFO]
[INFO] --- maven-dependency-plugin:2.1:copy (copy) @ helloworld-webapp ---
[INFO] Nothing to compile - all classes are up to date
[INFO]
[INFO] --- maven-resources-plugin:2.4.2:testResources (default-testResources) @ helloworld-webapp ---
[INFO] Configured Artifact: org.apache.tuscany.sca.samples:helloworld:2.0-SNAPSHOT:jar
[INFO] org.apache.tuscany.sca.samples:helloworld:2.0-SNAPSHOT:jar already exists in <https://builds.apache.org/job/Tuscany-2x-deploy/ws/sca-2x/samples/getting-started/helloworld-webapp/src/main/webapp/WEB-INF/sca-contributions>
[INFO]
[INFO] --- maven-compiler-plugin:2.2:testCompile (default-testCompile) @ helloworld-webapp ---
[INFO] Using 'UTF-8' encoding to copy filtered resources.
[INFO] Copying 1 resource
[INFO] Copying 3 resources
[INFO] Copying 3 resources
[INFO] Nothing to compile - all classes are up to date
[JENKINS] Archiving disabled - not archiving <https://builds.apache.org/job/Tuscany-2x-deploy/ws/sca-2x/samples/getting-started/helloworld-webapp/pom.xml>
[JENKINS] Archiving disabled - not archiving <https://builds.apache.org/job/Tuscany-2x-deploy/ws/sca-2x/samples/getting-started/helloworld-webapp/pom.xml>
[INFO] ------------------------------------------------------------------------
[INFO] Reactor Summary:
[INFO]
[INFO] Apache Tuscany SCA Implementation Project (2.x) ... SUCCESS [28:49.785s]
[INFO] Apache Tuscany SCA Implementation Modules ......... SUCCESS [4:54.735s]
[INFO] Apache Tuscany SCA Monitor ........................ SUCCESS [3:06.925s]
[INFO] Apache Tuscany SCA Extensibility .................. SUCCESS [2:51.037s]
[INFO] Apache Tuscany SCA Assembly Model ................. SUCCESS [1:49.647s]
[INFO] Apache Tuscany SCA Assembly Model XSD Files ....... SUCCESS [2:05.794s]
[INFO] Apache Tuscany SCA Common XML ..................... SUCCESS [1:47.172s]
[INFO] Apache Tuscany SCA API ............................ SUCCESS [1:50.279s]
[INFO] Apache Tuscany SCA Common Java .................... SUCCESS [1:50.684s]
[INFO] Apache Tuscany SCA Contribution Model ............. SUCCESS [26.541s]
[INFO] Apache Tuscany SCA Node API ....................... SUCCESS [4.057s]
[INFO] Apache Tuscany SCA Core SPI ....................... SUCCESS [8.099s]
[INFO] Apache Tuscany SCA XSD Model ...................... SUCCESS [4.455s]
[INFO] Apache Tuscany SCA Assembly XML Model ............. SUCCESS [5.473s]
[INFO] Apache Tuscany SCA WSDL Interface Model ........... SUCCESS [4.997s]
[INFO] Apache Tuscany SCA Interface Java Model ........... SUCCESS [4.845s]
[INFO] Apache Tuscany SCA Core Runtime ................... SUCCESS [5.692s]
[INFO] Apache Tuscany SCA DataBinding Framework .......... SUCCESS [5.020s]
[INFO] Apache Tuscany SCA DataBinding for JAXB ........... SUCCESS [6.839s]
[INFO] Apache Tuscany SCA Model Builders ................. SUCCESS [5.021s]
[INFO] Apache Tuscany SCA Deployment ..................... SUCCESS [6.274s]
[INFO] Apache Tuscany SCA WS Binding Model ............... SUCCESS [3.994s]
[INFO] Apache Tuscany SCA Interface Java For JAXWS ....... SUCCESS [2:51.922s]
[INFO] Apache Tuscany SCA Core/DataBinding Integration ... SUCCESS [2:20.198s]
[INFO] Apache Tuscany SCA Web Service binding WSDL Generator SUCCESS [2:23.648s]
[INFO] Apache Tuscany SCA Binding SCA Runtime ............ SUCCESS [2:13.165s]
[INFO] Apache Tuscany SCA Implementation Java Model ...... SUCCESS [2:17.251s]
[INFO] Apache Tuscany SCA Implementation Java Runtime .... SUCCESS [2:19.965s]
[INFO] Apache Tuscany SCA Node Implementation ............ SUCCESS [2:23.221s]
[INFO] Apache Tuscany SCA Data API ....................... SUCCESS [2:29.286s]
[INFO] Apache Tuscany SCA Domain Node .................... SUCCESS [2:07.663s]
[INFO] Apache Tuscany SCA Web Implementation Model ....... SUCCESS [2:20.031s]
[INFO] Apache Tuscany SCA HTTP Servlet Host Extension Point SUCCESS [2:25.088s]
[INFO] Apache Tuscany SCA Webapp Host .................... SUCCESS [2:27.791s]
[INFO] Apache Tuscany SCA Web Implementation Runtime ..... SUCCESS [2:05.718s]
[INFO] Apache Tuscany SCA Launcher ....................... SUCCESS [2:31.781s]
[INFO] Apache Tuscany SCA Client Impl .................... SUCCESS [2:34.097s]
[INFO] Apache Tuscany SCA Jetty Servlet Host Extension ... SUCCESS [2:06.288s]
[INFO] Apache Tuscany SCA Shell .......................... SUCCESS [1:53.085s]
[INFO] Apache Tuscany SCA Stripes Web Framework Integration SUCCESS [1:39.562s]
[INFO] Apache Tuscany SCA Apache Wink JAX-RS Integration . SUCCESS [1:57.016s]
[INFO] Apache Tuscany SCA JAXWS-based WS Binding Extension SUCCESS [1:45.968s]
[INFO] Apache Tuscany SCA JAXWS RI based WS Binding Extension SUCCESS [1:52.296s]
[INFO] Apache Tuscany SCA Common HTTP .................... SUCCESS [1:43.425s]
[INFO] Apache Tuscany SCA Core Runtime POM ............... SUCCESS [52.856s]
[INFO] Apache Tuscany SCA Policy Security Model .......... SUCCESS [2:06.620s]
[INFO] Apache Tuscany SCA Atom Feed Binding Extension .... SUCCESS [1:56.088s]
[INFO] Apache Tuscany SCA Comet Binding Model ............ SUCCESS [1:49.319s]
[INFO] Apache Tuscany SCA CORBA Host Extension Point ..... SUCCESS [1:53.602s]
[INFO] Apache Tuscany SCA CORBA Binding Extension ........ SUCCESS [33.579s]
[INFO] Apache Tuscany SCA EJB Binding Model .............. SUCCESS [4.358s]
[INFO] Apache Tuscany SCA HTTP Binding Model ............. SUCCESS [4.181s]
[INFO] Apache Tuscany SCA JMS Binding Model .............. SUCCESS [4.913s]
[INFO] Apache Tuscany SCA JSONP Binding Model ............ SUCCESS [3.781s]
[INFO] Apache Tuscany SCA JSON-RPC Binding Model ......... SUCCESS [3.654s]
[INFO] Apache Tuscany SCA REST Binding Model ............. SUCCESS [7.874s]
[INFO] Apache Tuscany SCA RMI Binding Model .............. SUCCESS [3.998s]
[INFO] Apache Tuscany SCA BPEL Implementation Extension .. SUCCESS [4.944s]
[INFO] Apache Tuscany SCA Script Implementation Model .... SUCCESS [4.467s]
[INFO] Apache Tuscany SCA Spring Implementation Model .... SUCCESS [4.134s]
[INFO] Apache Tuscany SCA Widget Implementation Model .... SUCCESS [4.626s]
[INFO] Apache Tuscany SCA Base Runtime Jar ............... SUCCESS [14.830s]
[INFO] Apache Tuscany SCA EndPoint Registry using Hazelcast SUCCESS [58.069s]
[INFO] Apache Tuscany Maven Tuscany Plugin ............... SUCCESS [2:01.370s]
[INFO] Create an SCA JAR contribution project ............ SUCCESS [1:45.130s]
[INFO] Create an SCA ZIP contribution project ............ SUCCESS [1:33.400s]
[INFO] Tuscany SCA ZIP contribution Shared Assembly Descriptor SUCCESS [1:39.214s]
[INFO] Create a simple Apache Tuscany SCA webapp project . SUCCESS [2:23.903s]
[INFO] Create a Tuscany SCA and JSF project .............. SUCCESS [1:38.509s]
[INFO] Create a simple Apache Tuscany SCA webapp project using the Stripes Web Framework SUCCESS [1:33.132s]
[INFO] Create an SCA Webapp project using BPEL ........... SUCCESS [1:31.317s]
[INFO] Create a Tuscany binding extension project ........ SUCCESS [1:28.547s]
[INFO] Apache Tuscany SCA Maven Archetypes ............... SUCCESS [43.846s]
[INFO] Apache Tuscany SCA Web JavaScript ................. SUCCESS [1:43.478s]
[INFO] Apache Tuscany SCA Abdera Atom Feed Binding Extension SUCCESS [1:39.433s]
[INFO] Apache Tuscany SCA JAX-RS Implementation Model .... SUCCESS [1:36.201s]
[INFO] Apache Tuscany SCA Python Implementation Model .... SUCCESS [1:38.079s]
[INFO] Apache Tuscany SCA Base Runtime POM ............... SUCCESS [50.519s]
[INFO] Apache Tuscany SCA Comet Binding Runtime .......... SUCCESS [1:43.225s]
[INFO] Apache Tuscany SCA EJB Binding Runtime ............ SUCCESS [1:41.344s]
[INFO] Apache Tuscany SCA Data Binding for JSON .......... SUCCESS [1:45.785s]
[INFO] Apache Tuscany SCA HTTP Binding Runtime ........... SUCCESS [1:43.313s]
[INFO] Apache Tuscany SCA JMS Binding Runtime ............ SUCCESS [1:36.593s]
[INFO] Apache Tuscany SCA JMS Binding Runtime AcytiveMQ .. SUCCESS [1:39.611s]
[INFO] Apache Tuscany SCA JSONP Binding Runtime .......... SUCCESS [1:35.303s]
[INFO] Apache Tuscany SCA JSON-RPC Binding Runtime ....... SUCCESS [1:34.983s]
[INFO] Apache Tuscany SCA Interface Java For JAX_RS ...... SUCCESS [1:37.112s]
[INFO] Apache Tuscany SCA REST Binding Runtime ........... SUCCESS [1:37.948s]
[INFO] Apache Tuscany SCA RMI Host Extension Point ....... SUCCESS [1:37.623s]
[INFO] Apache Tuscany SCA RMI Binding Extension .......... SUCCESS [1:39.534s]
[INFO] Apache Tuscany SCA Websocket Binding Extension .... SUCCESS [1:39.316s]
[INFO] Apache Tuscany SCA Policy WS-Policy Model ......... SUCCESS [1:36.180s]
[INFO] Apache Tuscany SCA Data Binding for Axiom ......... SUCCESS [1:36.402s]
[INFO] Apache Tuscany SCA Data Binding for JAXB-AXIOM .... SUCCESS [1:58.187s]
[INFO] Apache Tuscany SCA Axis2-1.5-based WS Binding Runtime SUCCESS [1:41.264s]
[INFO] Apache Tuscany SCA Resource Import/Export Model ... SUCCESS [1:39.037s]
[INFO] Apache Tuscany SCA Data Binding for SDO ........... SUCCESS [2:04.629s]
[INFO] Apache Tuscany SCA Data Binding for SDO/AXIOM ..... SUCCESS [2:01.937s]
[INFO] Apache Tuscany SCA Tomcat Tribes Based EndPoint Registry SUCCESS [1:57.531s]
[INFO] Apache Tuscany SCA Extensibility for Eclipse Equinox SUCCESS [1:47.276s]
[INFO] Apache Tuscany SCA Node Equinox OSGi Launcher ..... SUCCESS [1:40.830s]
[INFO] Apache Tuscany SCA OSGi HTTP Service Based Servlet Host Extension SUCCESS [1:37.992s]
[INFO] Apache Tuscany SCA BPEL ODE Implementation Extension SUCCESS [1:53.350s]
[INFO] Apache Tuscany SCA JAX-RS Implementation Runtime .. SUCCESS [1:44.113s]
[INFO] Apache Tuscany SCA Python Implementation Extension SUCCESS [1:42.042s]
[INFO] Apache Tuscany SCA Script Implementation Extension SUCCESS [1:44.020s]
[INFO] Apache Tuscany SCA Spring Implementation Runtime Model SUCCESS [1:38.508s]
[INFO] Apache Tuscany SCA Spring Implementation WebApp Integration SUCCESS [1:39.238s]
[INFO] Apache Tuscany SCA Spring Implementation Runtime Stub SUCCESS [1:38.986s]
[INFO] Apache Tuscany SCA Spring Implementation Runtime Tie SUCCESS [1:36.503s]
[INFO] Apache Tuscany SCA Web Implementation Client ...... SUCCESS [1:35.178s]
[INFO] Apache Tuscany SCA Widget Implementation Runtime .. SUCCESS [1:37.549s]
[INFO] Apache Tuscany SCA Web JavaScript for DOJO ........ SUCCESS [1:54.675s]
[INFO] Apache Tuscany SCA Widget Implementation Runtime (Dojo) SUCCESS [1:35.729s]
[INFO] Apache Tuscany SCA MyFaces JSF Integration ........ SUCCESS [1:36.889s]
[INFO] Apache Tuscany SCA Node Launcher .................. SUCCESS [1:45.416s]
[INFO] Apache Tuscany SCA Node Manager ................... SUCCESS [1:36.820s]
[INFO] Apache Tuscany SCA Extension Policy Logging Model . SUCCESS [2:09.938s]
[INFO] Apache Tuscany SCA Java JSR250 Implementation ..... SUCCESS [2:21.183s]
[INFO] Apache Tuscany SCA Transaction Policy Model ....... SUCCESS [2:36.680s]
[INFO] Apache Tuscany SCA Transaction Policy Runtime ..... SUCCESS [2:58.458s]
[INFO] Apache Tuscany SCA Transaction Policy Runtime (Geronimo) SUCCESS [3:11.983s]
[INFO] Apache Tuscany SCA AOP-based Logging and Tracing .. SUCCESS [2:40.005s]
[INFO] Apache Tuscany SCA Contribution OSGi Bundle ....... SUCCESS [2:26.727s]
[INFO] Apache Tuscany SCA OSGi Implementation Extension .. SUCCESS [2:35.258s]
[INFO] Apache Tuscany SCA OSGi Implementation Extension Runtime SUCCESS [2:33.414s]
[INFO] Apache Tuscany SCA OSGi Node Implementation ....... SUCCESS [2:19.165s]
[INFO] Apache Tuscany SCA JSE built-in CORBA Host ........ SUCCESS [2:04.430s]
[INFO] Apache Tuscany SCA JEE environment CORBA Host ..... SUCCESS [2:26.674s]
[INFO] Apache Tuscany SCA CORBA Binding Runtime .......... SUCCESS [2:26.035s]
[INFO] Apache Tuscany SCA Transient Name Server CORBA Host SUCCESS [1:52.335s]
[INFO] Apache Tuscany SCA Composite Diagram Generator Application SUCCESS [1:47.647s]
[INFO] Apache Tuscany SCA OSGi Runtime POM ............... SUCCESS [48.348s]
[INFO] Apache Tuscany SCA Samples ........................ SUCCESS [53.120s]
[INFO] Apache Tuscany SCA Samples Helloworld ............. SUCCESS [2:06.652s]
[INFO] Apache Tuscany SCA Samples Helloworld JAX-RS ...... SUCCESS [2:10.163s]
[INFO] Apache Tuscany SCA Samples Helloworld JSONP ....... SUCCESS [2:08.319s]
[INFO] Apache Tuscany SCA Samples Helloworld JSON-RPC .... SUCCESS [2:09.402s]
[INFO] Apache Tuscany SCA Samples Helloworld SCAClient ... SUCCESS [2:09.934s]
[INFO] Apache Tuscany SCA Samples Helloworld Spring ...... SUCCESS [2:22.404s]
[INFO] Apache Tuscany SCA Samples Helloworld WebApp ...... FAILURE [4:50.902s]
[INFO] Apache Tuscany SCA Samples Helloworld Web Service . SKIPPED
[INFO] Apache Tuscany SCA Samples Helloworld With Dependencies SKIPPED
[INFO] Apache Tuscany SCA Samples Getting Started ........ SKIPPED
[INFO] Apache Tuscany SCA Samples Running Tuscany ........ SKIPPED
[INFO] Apache Tuscany SCA Samples JSE .................... SKIPPED
[INFO] Apache Tuscany SCA Samples JUnit .................. SKIPPED
[INFO] Apache Tuscany SCA Sample Async Invocation ........ SKIPPED
[INFO] Apache Tuscany SCA Sample Learning More ........... SKIPPED
[INFO] Apache Tuscany SCA Sample binding.comet ........... SKIPPED
[INFO] Apache Tuscany SCA Sample binding.comet Real-Time Suggestions Webapp SKIPPED
[INFO] Apache Tuscany SCA Sample binding.comet Weather Monitor Webapp SKIPPED
[INFO] Apache Tuscany SCA Sample binding.comet PubSub Webapp SKIPPED
[INFO] Apache Tuscany SCA Sample binding.comet Chat Webapp SKIPPED
[INFO] Apache Tuscany SCA Sample binding.websocket ....... SKIPPED
[INFO] Apache Tuscany SCA Sample binding.websocket Autocomplete Webapp SKIPPED
[INFO] Apache Tuscany SCA Sample binding.websocket Weather Monitor Webapp SKIPPED
[INFO] Apache Tuscany SCA Sample binding.websocket Chat Webapp SKIPPED
[INFO] Apache Tuscany SCA Sample binding.websocket PubSub Webapp SKIPPED
[INFO] Apache Tuscany SCA Sample Calculator OSGi ......... SKIPPED
[INFO] Apache Tuscany SCA Sample OSGi Remote Services Calculator SKIPPED
[INFO] Apache Tuscany SCA Sample OSGi Remote Services Calculator Operations SKIPPED
[INFO] Apache Tuscany SCA Distributed OSGI Statically Configured Samples SKIPPED
[INFO] Apache Tuscany SCA All-in-one Distribution ........ SKIPPED
[INFO] ------------------------------------------------------------------------
[INFO] BUILD FAILURE
[INFO] ------------------------------------------------------------------------
[INFO] Total time: 6:04:02.302s
[INFO] Finished at: Sat Dec 31 07:22:33 UTC 2011
[INFO] Final Memory: 88M/744M
[INFO] ------------------------------------------------------------------------
mavenExecutionResult exceptions not empty
message : Internal error: java.lang.NullPointerException
cause : null
Stack trace :
org.apache.maven.InternalErrorException: Internal error: java.lang.NullPointerException
at org.apache.maven.lifecycle.internal.BuilderCommon.handleBuildError(BuilderCommon.java:128)
at org.apache.maven.lifecycle.internal.LifecycleModuleBuilder.buildProject(LifecycleModuleBuilder.java:95)
at org.apache.maven.lifecycle.internal.LifecycleModuleBuilder.buildProject(LifecycleModuleBuilder.java:59)
at org.apache.maven.lifecycle.internal.LifecycleStarter.singleThreadedBuild(LifecycleStarter.java:183)
at org.apache.maven.lifecycle.internal.LifecycleStarter.execute(LifecycleStarter.java:161)
at org.apache.maven.DefaultMaven.doExecute(DefaultMaven.java:319)
at org.apache.maven.DefaultMaven.execute(DefaultMaven.java:156)
at org.jvnet.hudson.maven3.launcher.Maven3Launcher.main(Maven3Launcher.java:79)
at sun.reflect.NativeMethodAccessorImpl.invoke0(Native Method)
at sun.reflect.NativeMethodAccessorImpl.invoke(NativeMethodAccessorImpl.java:39)
at sun.reflect.DelegatingMethodAccessorImpl.invoke(DelegatingMethodAccessorImpl.java:25)
at java.lang.reflect.Method.invoke(Method.java:597)
at org.codehaus.plexus.classworlds.launcher.Launcher.launchStandard(Launcher.java:329)
at org.codehaus.plexus.classworlds.launcher.Launcher.launch(Launcher.java:239)
at org.jvnet.hudson.maven3.agent.Maven3Main.launch(Maven3Main.java:158)
at hudson.maven.Maven3Builder.call(Maven3Builder.java:112)
at hudson.maven.Maven3Builder.call(Maven3Builder.java:70)
at hudson.remoting.UserRequest.perform(UserRequest.java:118)
at hudson.remoting.UserRequest.perform(UserRequest.java:48)
at hudson.remoting.Request$2.run(Request.java:287)
at java.util.concurrent.Executors$RunnableAdapter.call(Executors.java:441)
at java.util.concurrent.FutureTask$Sync.innerRun(FutureTask.java:303)
at java.util.concurrent.FutureTask.run(FutureTask.java:138)
at java.util.concurrent.ThreadPoolExecutor$Worker.runTask(ThreadPoolExecutor.java:886)
at java.util.concurrent.ThreadPoolExecutor$Worker.run(ThreadPoolExecutor.java:908)
at java.lang.Thread.run(Thread.java:662)
Caused by: java.lang.NullPointerException
at hudson.maven.ExecutedMojo.getMojoClass(ExecutedMojo.java:114)
at hudson.maven.ExecutedMojo.<init>(ExecutedMojo.java:99)
at hudson.maven.Maven3Builder$MavenExecutionListener.recordExecutionTime(Maven3Builder.java:524)
at hudson.maven.Maven3Builder$MavenExecutionListener.recordMojoSucceeded(Maven3Builder.java:493)
at hudson.maven.Maven3Builder$MavenExecutionListener.forkSucceeded(Maven3Builder.java:601)
at org.apache.maven.lifecycle.internal.DefaultExecutionEventCatapult.fire(DefaultExecutionEventCatapult.java:97)
at org.apache.maven.lifecycle.internal.DefaultExecutionEventCatapult.fire(DefaultExecutionEventCatapult.java:42)
at org.apache.maven.lifecycle.internal.MojoExecutor.executeForkedExecutions(MojoExecutor.java:383)
at org.apache.maven.lifecycle.internal.MojoExecutor.execute(MojoExecutor.java:199)
at org.apache.maven.lifecycle.internal.MojoExecutor.execute(MojoExecutor.java:153)
at org.apache.maven.lifecycle.internal.MojoExecutor.execute(MojoExecutor.java:145)
at org.apache.maven.lifecycle.internal.LifecycleModuleBuilder.buildProject(LifecycleModuleBuilder.java:84)
... 24 more
Sending e-mails to: commits@tuscany.apache.org
channel stopped