You are viewing a plain text version of this content. The canonical link for it is here.
Posted to dev@lucene.apache.org by Apache Jenkins Server <je...@builds.apache.org> on 2014/10/02 10:48:01 UTC
[JENKINS] Lucene-Solr-SmokeRelease-trunk - Build # 207 - Failure
Build: https://builds.apache.org/job/Lucene-Solr-SmokeRelease-trunk/207/
No tests ran.
Build Log:
[...truncated 50886 lines...]
prepare-release-no-sign:
[mkdir] Created dir: /usr/home/jenkins/jenkins-slave/workspace/Lucene-Solr-SmokeRelease-trunk/lucene/build/smokeTestRelease/dist
[copy] Copying 446 files to /usr/home/jenkins/jenkins-slave/workspace/Lucene-Solr-SmokeRelease-trunk/lucene/build/smokeTestRelease/dist/lucene
[copy] Copying 245 files to /usr/home/jenkins/jenkins-slave/workspace/Lucene-Solr-SmokeRelease-trunk/lucene/build/smokeTestRelease/dist/solr
[smoker] Java 1.7 JAVA_HOME=/home/jenkins/tools/java/latest1.7
[smoker] NOTE: output encoding is US-ASCII
[smoker]
[smoker] Load release URL "file:/usr/home/jenkins/jenkins-slave/workspace/Lucene-Solr-SmokeRelease-trunk/lucene/build/smokeTestRelease/dist/"...
[smoker]
[smoker] Test Lucene...
[smoker] test basics...
[smoker] get KEYS
[smoker] 0.1 MB in 0.01 sec (14.4 MB/sec)
[smoker] check changes HTML...
[smoker] download lucene-6.0.0-src.tgz...
[smoker] 27.6 MB in 0.04 sec (663.1 MB/sec)
[smoker] verify md5/sha1 digests
[smoker] download lucene-6.0.0.tgz...
[smoker] 61.0 MB in 0.16 sec (374.7 MB/sec)
[smoker] verify md5/sha1 digests
[smoker] download lucene-6.0.0.zip...
[smoker] 70.5 MB in 0.10 sec (704.9 MB/sec)
[smoker] verify md5/sha1 digests
[smoker] unpack lucene-6.0.0.tgz...
[smoker] verify JAR metadata/identity/no javax.* or java.* classes...
[smoker] test demo with 1.7...
[smoker] got 5573 hits for query "lucene"
[smoker] checkindex with 1.7...
[smoker] check Lucene's javadoc JAR
[smoker] unpack lucene-6.0.0.zip...
[smoker] verify JAR metadata/identity/no javax.* or java.* classes...
[smoker] test demo with 1.7...
[smoker] got 5573 hits for query "lucene"
[smoker] checkindex with 1.7...
[smoker] check Lucene's javadoc JAR
[smoker] unpack lucene-6.0.0-src.tgz...
[smoker] make sure no JARs/WARs in src dist...
[smoker] run "ant validate"
[smoker] run tests w/ Java 7 and testArgs='-Dtests.jettyConnector=Socket -Dtests.disableHdfs=true -Dtests.multiplier=1 -Dtests.slow=false'...
[smoker] test demo with 1.7...
[smoker] got 217 hits for query "lucene"
[smoker] checkindex with 1.7...
[smoker] generate javadocs w/ Java 7...
[smoker]
[smoker] Crawl/parse...
[smoker]
[smoker] Verify...
[smoker] confirm all releases have coverage in TestBackwardsCompatibility
[smoker] find all past Lucene releases...
[smoker] run TestBackwardsCompatibility..
[smoker] success!
[smoker]
[smoker] Test Solr...
[smoker] test basics...
[smoker] get KEYS
[smoker] 0.1 MB in 0.01 sec (9.3 MB/sec)
[smoker] check changes HTML...
[smoker] download solr-6.0.0-src.tgz...
[smoker] 33.8 MB in 0.08 sec (400.5 MB/sec)
[smoker] verify md5/sha1 digests
[smoker] download solr-6.0.0.tgz...
[smoker] 115.8 MB in 0.37 sec (313.1 MB/sec)
[smoker] verify md5/sha1 digests
[smoker] download solr-6.0.0.zip...
[smoker] 121.9 MB in 0.23 sec (528.4 MB/sec)
[smoker] verify md5/sha1 digests
[smoker] unpack solr-6.0.0.tgz...
[smoker] verify JAR metadata/identity/no javax.* or java.* classes...
[smoker] unpack lucene-6.0.0.tgz...
[smoker] **WARNING**: skipping check of /usr/home/jenkins/jenkins-slave/workspace/Lucene-Solr-SmokeRelease-trunk/lucene/build/smokeTestRelease/tmp/unpack/solr-6.0.0/contrib/dataimporthandler-extras/lib/javax.mail-1.5.1.jar: it has javax.* classes
[smoker] **WARNING**: skipping check of /usr/home/jenkins/jenkins-slave/workspace/Lucene-Solr-SmokeRelease-trunk/lucene/build/smokeTestRelease/tmp/unpack/solr-6.0.0/contrib/dataimporthandler-extras/lib/activation-1.1.1.jar: it has javax.* classes
[smoker] verify WAR metadata/contained JAR identity/no javax.* or java.* classes...
[smoker] unpack lucene-6.0.0.tgz...
[smoker] copying unpacked distribution for Java 7 ...
[smoker] test solr example w/ Java 7...
[smoker] start Solr instance (log=/usr/home/jenkins/jenkins-slave/workspace/Lucene-Solr-SmokeRelease-trunk/lucene/build/smokeTestRelease/tmp/unpack/solr-6.0.0-java7/solr-example.log)...
[smoker] startup done
[smoker] test utf8...
[smoker] index example docs...
[smoker] run query...
[smoker] stop server (SIGINT)...
[smoker] unpack solr-6.0.0.zip...
[smoker] verify JAR metadata/identity/no javax.* or java.* classes...
[smoker] unpack lucene-6.0.0.tgz...
[smoker] **WARNING**: skipping check of /usr/home/jenkins/jenkins-slave/workspace/Lucene-Solr-SmokeRelease-trunk/lucene/build/smokeTestRelease/tmp/unpack/solr-6.0.0/contrib/dataimporthandler-extras/lib/activation-1.1.1.jar: it has javax.* classes
[smoker] **WARNING**: skipping check of /usr/home/jenkins/jenkins-slave/workspace/Lucene-Solr-SmokeRelease-trunk/lucene/build/smokeTestRelease/tmp/unpack/solr-6.0.0/contrib/dataimporthandler-extras/lib/javax.mail-1.5.1.jar: it has javax.* classes
[smoker] verify WAR metadata/contained JAR identity/no javax.* or java.* classes...
[smoker] unpack lucene-6.0.0.tgz...
[smoker] copying unpacked distribution for Java 7 ...
[smoker] test solr example w/ Java 7...
[smoker] start Solr instance (log=/usr/home/jenkins/jenkins-slave/workspace/Lucene-Solr-SmokeRelease-trunk/lucene/build/smokeTestRelease/tmp/unpack/solr-6.0.0-java7/solr-example.log)...
[smoker] startup done
[smoker] test utf8...
[smoker] index example docs...
[smoker] run query...
[smoker] stop server (SIGINT)...
[smoker] unpack solr-6.0.0-src.tgz...
[smoker] make sure no JARs/WARs in src dist...
[smoker] run "ant validate"
[smoker] run tests w/ Java 7 and testArgs='-Dtests.jettyConnector=Socket -Dtests.disableHdfs=true -Dtests.multiplier=1 -Dtests.slow=false'...
[smoker]
[smoker] command "export JAVA_HOME="/home/jenkins/tools/java/latest1.7" PATH="/home/jenkins/tools/java/latest1.7/bin:$PATH" JAVACMD="/home/jenkins/tools/java/latest1.7/bin/java"; ant clean test -Dtests.slow=false -Dtests.jettyConnector=Socket -Dtests.disableHdfs=true -Dtests.multiplier=1 -Dtests.slow=false" failed:
[smoker] Buildfile: /usr/home/jenkins/jenkins-slave/workspace/Lucene-Solr-SmokeRelease-trunk/lucene/build/smokeTestRelease/tmp/unpack/solr-6.0.0/solr/build.xml
[smoker]
[smoker] clean:
[smoker] [delete] Deleting directory /usr/home/jenkins/jenkins-slave/workspace/Lucene-Solr-SmokeRelease-trunk/lucene/build/smokeTestRelease/tmp/unpack/solr-6.0.0/solr/build
[smoker]
[smoker] ivy-availability-check:
[smoker]
[smoker] ivy-fail:
[smoker]
[smoker] ivy-configure:
[smoker] [ivy:configure] :: Apache Ivy 2.3.0 - 20130110142753 :: http://ant.apache.org/ivy/ ::
[smoker] [ivy:configure] :: loading settings :: file = /usr/home/jenkins/jenkins-slave/workspace/Lucene-Solr-SmokeRelease-trunk/lucene/build/smokeTestRelease/tmp/unpack/solr-6.0.0/lucene/ivy-settings.xml
[smoker]
[smoker] resolve-groovy:
[smoker] [ivy:cachepath] :: resolving dependencies :: org.codehaus.groovy#groovy-all-caller;working
[smoker] [ivy:cachepath] confs: [default]
[smoker] [ivy:cachepath] found org.codehaus.groovy#groovy-all;2.3.6 in public
[smoker] [ivy:cachepath] :: resolution report :: resolve 140ms :: artifacts dl 3ms
[smoker] ---------------------------------------------------------------------
[smoker] | | modules || artifacts |
[smoker] | conf | number| search|dwnlded|evicted|| number|dwnlded|
[smoker] ---------------------------------------------------------------------
[smoker] | default | 1 | 0 | 0 | 0 || 1 | 0 |
[smoker] ---------------------------------------------------------------------
[smoker]
[smoker] -init-totals:
[smoker] [mkdir] Created dir: /usr/home/jenkins/jenkins-slave/workspace/Lucene-Solr-SmokeRelease-trunk/lucene/build/smokeTestRelease/tmp/unpack/solr-6.0.0/solr/build/solr
[smoker]
[smoker] -clover.load:
[smoker]
[smoker] test-solr-core:
[smoker]
[smoker] test:
[smoker]
[smoker] -clover.disable:
[smoker]
[smoker] ivy-availability-check:
[smoker]
[smoker] ivy-fail:
[smoker]
[smoker] ivy-configure:
[smoker] [ivy:configure] :: loading settings :: file = /usr/home/jenkins/jenkins-slave/workspace/Lucene-Solr-SmokeRelease-trunk/lucene/build/smokeTestRelease/tmp/unpack/solr-6.0.0/lucene/ivy-settings.xml
[smoker]
[smoker] -clover.load:
[smoker]
[smoker] -clover.classpath:
[smoker]
[smoker] -clover.setup:
[smoker]
[smoker] clover:
[smoker]
[smoker] check-analyzers-icu-uptodate:
[smoker]
[smoker] jar-analyzers-icu:
[smoker]
[smoker] -compile-analysis-extras:
[smoker]
[smoker] check-analyzers-icu-uptodate:
[smoker]
[smoker] jar-analyzers-icu:
[smoker]
[smoker] compile-solr-core:
[smoker]
[smoker] compile-solrj:
[smoker]
[smoker] check-lucene-core-uptodate:
[smoker]
[smoker] jar-lucene-core:
[smoker]
[smoker] check-backward-codecs-uptodate:
[smoker]
[smoker] jar-backward-codecs:
[smoker]
[smoker] check-analyzers-phonetic-uptodate:
[smoker]
[smoker] jar-analyzers-phonetic:
[smoker]
[smoker] check-analyzers-kuromoji-uptodate:
[smoker]
[smoker] jar-analyzers-kuromoji:
[smoker]
[smoker] check-codecs-uptodate:
[smoker]
[smoker] jar-codecs:
[smoker]
[smoker] check-expressions-uptodate:
[smoker]
[smoker] jar-expressions:
[smoker]
[smoker] check-suggest-uptodate:
[smoker]
[smoker] jar-suggest:
[smoker]
[smoker] check-highlighter-uptodate:
[smoker]
[smoker] jar-highlighter:
[smoker]
[smoker] check-memory-uptodate:
[smoker]
[smoker] jar-memory:
[smoker]
[smoker] check-misc-uptodate:
[smoker]
[smoker] jar-misc:
[smoker]
[smoker] check-spatial-uptodate:
[smoker]
[smoker] jar-spatial:
[smoker]
[smoker] check-grouping-uptodate:
[smoker]
[smoker] jar-grouping:
[smoker]
[smoker] check-queries-uptodate:
[smoker]
[smoker] jar-queries:
[smoker]
[smoker] check-queryparser-uptodate:
[smoker]
[smoker] jar-queryparser:
[smoker]
[smoker] check-join-uptodate:
[smoker]
[smoker] jar-join:
[smoker]
[smoker] prep-lucene-jars:
[smoker]
[smoker] resolve-example:
[smoker]
[smoker] ivy-availability-check:
[smoker]
[smoker] ivy-fail:
[smoker]
[smoker] ivy-fail:
[smoker]
[smoker] ivy-configure:
[smoker] [ivy:configure] :: loading settings :: file = /usr/home/jenkins/jenkins-slave/workspace/Lucene-Solr-SmokeRelease-trunk/lucene/build/smokeTestRelease/tmp/unpack/solr-6.0.0/lucene/ivy-settings.xml
[smoker]
[smoker] sync-hack:
[smoker]
[smoker] resolve:
[smoker]
[smoker] ivy-availability-check:
[smoker]
[smoker] ivy-fail:
[smoker]
[smoker] ivy-configure:
[smoker] [ivy:configure] :: loading settings :: file = /usr/home/jenkins/jenkins-slave/workspace/Lucene-Solr-SmokeRelease-trunk/lucene/build/smokeTestRelease/tmp/unpack/solr-6.0.0/lucene/ivy-settings.xml
[smoker]
[smoker] resolve:
[smoker]
[smoker] ivy-availability-check:
[smoker]
[smoker] ivy-fail:
[smoker]
[smoker] ivy-fail:
[smoker]
[smoker] ivy-configure:
[smoker] [ivy:configure] :: loading settings :: file = /usr/home/jenkins/jenkins-slave/workspace/Lucene-Solr-SmokeRelease-trunk/lucene/build/smokeTestRelease/tmp/unpack/solr-6.0.0/lucene/ivy-settings.xml
[smoker]
[smoker] resolve:
[smoker]
[smoker] common.init:
[smoker]
[smoker] compile-lucene-core:
[smoker]
[smoker] ivy-availability-check:
[smoker]
[smoker] ivy-fail:
[smoker]
[smoker] ivy-configure:
[smoker] [ivy:configure] :: loading settings :: file = /usr/home/jenkins/jenkins-slave/workspace/Lucene-Solr-SmokeRelease-trunk/lucene/build/smokeTestRelease/tmp/unpack/solr-6.0.0/lucene/ivy-settings.xml
[smoker]
[smoker] resolve:
[smoker]
[smoker] init:
[smoker]
[smoker] -clover.disable:
[smoker]
[smoker] -clover.load:
[smoker]
[smoker] -clover.classpath:
[smoker]
[smoker] -clover.setup:
[smoker]
[smoker] clover:
[smoker]
[smoker] compile-core:
[smoker]
[smoker] init:
[smoker]
[smoker] -clover.disable:
[smoker]
[smoker] -clover.load:
[smoker]
[smoker] -clover.classpath:
[smoker]
[smoker] -clover.setup:
[smoker]
[smoker] clover:
[smoker]
[smoker] common.compile-core:
[smoker] [mkdir] Created dir: /usr/home/jenkins/jenkins-slave/workspace/Lucene-Solr-SmokeRelease-trunk/lucene/build/smokeTestRelease/tmp/unpack/solr-6.0.0/solr/build/solr-solrj/classes/java
[smoker] [javac] Compiling 145 source files to /usr/home/jenkins/jenkins-slave/workspace/Lucene-Solr-SmokeRelease-trunk/lucene/build/smokeTestRelease/tmp/unpack/solr-6.0.0/solr/build/solr-solrj/classes/java
[smoker] [javac] Note: Some input files use or override a deprecated API.
[smoker] [javac] Note: Recompile with -Xlint:deprecation for details.
[smoker] [javac] Note: Some input files use unchecked or unsafe operations.
[smoker] [javac] Note: Recompile with -Xlint:unchecked for details.
[smoker]
[smoker] compile-core:
[smoker]
[smoker] check-lucene-core-uptodate:
[smoker]
[smoker] jar-lucene-core:
[smoker]
[smoker] check-backward-codecs-uptodate:
[smoker]
[smoker] jar-backward-codecs:
[smoker]
[smoker] check-analyzers-phonetic-uptodate:
[smoker]
[smoker] jar-analyzers-phonetic:
[smoker]
[smoker] check-analyzers-kuromoji-uptodate:
[smoker]
[smoker] jar-analyzers-kuromoji:
[smoker]
[smoker] check-codecs-uptodate:
[smoker]
[smoker] jar-codecs:
[smoker]
[smoker] check-expressions-uptodate:
[smoker]
[smoker] jar-expressions:
[smoker]
[smoker] check-suggest-uptodate:
[smoker]
[smoker] jar-suggest:
[smoker]
[smoker] check-highlighter-uptodate:
[smoker]
[smoker] jar-highlighter:
[smoker]
[smoker] check-memory-uptodate:
[smoker]
[smoker] jar-memory:
[smoker]
[smoker] check-misc-uptodate:
[smoker]
[smoker] jar-misc:
[smoker]
[smoker] check-spatial-uptodate:
[smoker]
[smoker] jar-spatial:
[smoker]
[smoker] check-grouping-uptodate:
[smoker]
[smoker] jar-grouping:
[smoker]
[smoker] check-queries-uptodate:
[smoker]
[smoker] jar-queries:
[smoker]
[smoker] check-queryparser-uptodate:
[smoker]
[smoker] jar-queryparser:
[smoker]
[smoker] check-join-uptodate:
[smoker]
[smoker] jar-join:
[smoker]
[smoker] prep-lucene-jars:
[smoker]
[smoker] resolve-example:
[smoker]
[smoker] ivy-availability-check:
[smoker]
[smoker] ivy-fail:
[smoker]
[smoker] ivy-fail:
[smoker]
[smoker] ivy-configure:
[smoker] [ivy:configure] :: loading settings :: file = /usr/home/jenkins/jenkins-slave/workspace/Lucene-Solr-SmokeRelease-trunk/lucene/build/smokeTestRelease/tmp/unpack/solr-6.0.0/lucene/ivy-settings.xml
[smoker]
[smoker] sync-hack:
[smoker]
[smoker] resolve:
[smoker]
[smoker] ivy-availability-check:
[smoker]
[smoker] ivy-fail:
[smoker]
[smoker] ivy-configure:
[smoker] [ivy:configure] :: loading settings :: file = /usr/home/jenkins/jenkins-slave/workspace/Lucene-Solr-SmokeRelease-trunk/lucene/build/smokeTestRelease/tmp/unpack/solr-6.0.0/lucene/ivy-settings.xml
[smoker]
[smoker] resolve:
[smoker]
[smoker] ivy-availability-check:
[smoker]
[smoker] ivy-fail:
[smoker]
[smoker] ivy-fail:
[smoker]
[smoker] ivy-configure:
[smoker] [ivy:configure] :: loading settings :: file = /usr/home/jenkins/jenkins-slave/workspace/Lucene-Solr-SmokeRelease-trunk/lucene/build/smokeTestRelease/tmp/unpack/solr-6.0.0/lucene/ivy-settings.xml
[smoker]
[smoker] resolve:
[smoker]
[smoker] common.init:
[smoker]
[smoker] compile-lucene-core:
[smoker]
[smoker] ivy-availability-check:
[smoker]
[smoker] ivy-fail:
[smoker]
[smoker] ivy-configure:
[smoker] [ivy:configure] :: loading settings :: file = /usr/home/jenkins/jenkins-slave/workspace/Lucene-Solr-SmokeRelease-trunk/lucene/build/smokeTestRelease/tmp/unpack/solr-6.0.0/lucene/ivy-settings.xml
[smoker]
[smoker] resolve:
[smoker]
[smoker] init:
[smoker]
[smoker] -clover.disable:
[smoker]
[smoker] -clover.load:
[smoker]
[smoker] -clover.classpath:
[smoker]
[smoker] -clover.setup:
[smoker]
[smoker] clover:
[smoker]
[smoker] compile-core:
[smoker]
[smoker] init:
[smoker]
[smoker] -clover.disable:
[smoker]
[smoker] -clover.load:
[smoker]
[smoker] -clover.classpath:
[smoker]
[smoker] -clover.setup:
[smoker]
[smoker] clover:
[smoker]
[smoker] common.compile-core:
[smoker] [mkdir] Created dir: /usr/home/jenkins/jenkins-slave/workspace/Lucene-Solr-SmokeRelease-trunk/lucene/build/smokeTestRelease/tmp/unpack/solr-6.0.0/solr/build/solr-core/classes/java
[smoker] [javac] Compiling 677 source files to /usr/home/jenkins/jenkins-slave/workspace/Lucene-Solr-SmokeRelease-trunk/lucene/build/smokeTestRelease/tmp/unpack/solr-6.0.0/solr/build/solr-core/classes/java
[smoker] [javac] Note: Some input files use or override a deprecated API.
[smoker] [javac] Note: Recompile with -Xlint:deprecation for details.
[smoker] [javac] Note: Some input files use unchecked or unsafe operations.
[smoker] [javac] Note: Recompile with -Xlint:unchecked for details.
[smoker]
[smoker] common-solr.compile-core:
[smoker]
[smoker] compile-core:
[smoker]
[smoker] compile-solrj:
[smoker]
[smoker] check-lucene-core-uptodate:
[smoker]
[smoker] jar-lucene-core:
[smoker]
[smoker] check-backward-codecs-uptodate:
[smoker]
[smoker] jar-backward-codecs:
[smoker]
[smoker] check-analyzers-phonetic-uptodate:
[smoker]
[smoker] jar-analyzers-phonetic:
[smoker]
[smoker] check-analyzers-kuromoji-uptodate:
[smoker]
[smoker] jar-analyzers-kuromoji:
[smoker]
[smoker] check-codecs-uptodate:
[smoker]
[smoker] jar-codecs:
[smoker]
[smoker] check-expressions-uptodate:
[smoker]
[smoker] jar-expressions:
[smoker]
[smoker] check-suggest-uptodate:
[smoker]
[smoker] jar-suggest:
[smoker]
[smoker] check-highlighter-uptodate:
[smoker]
[smoker] jar-highlighter:
[smoker]
[smoker] check-memory-uptodate:
[smoker]
[smoker] jar-memory:
[smoker]
[smoker] check-misc-uptodate:
[smoker]
[smoker] jar-misc:
[smoker]
[smoker] check-spatial-uptodate:
[smoker]
[smoker] jar-spatial:
[smoker]
[smoker] check-grouping-uptodate:
[smoker]
[smoker] jar-grouping:
[smoker]
[smoker] check-queries-uptodate:
[smoker]
[smoker] jar-queries:
[smoker]
[smoker] check-queryparser-uptodate:
[smoker]
[smoker] jar-queryparser:
[smoker]
[smoker] check-join-uptodate:
[smoker]
[smoker] jar-join:
[smoker]
[smoker] prep-lucene-jars:
[smoker]
[smoker] resolve-example:
[smoker]
[smoker] ivy-availability-check:
[smoker]
[smoker] ivy-fail:
[smoker]
[smoker] ivy-fail:
[smoker]
[smoker] ivy-configure:
[smoker] [ivy:configure] :: loading settings :: file = /usr/home/jenkins/jenkins-slave/workspace/Lucene-Solr-SmokeRelease-trunk/lucene/build/smokeTestRelease/tmp/unpack/solr-6.0.0/lucene/ivy-settings.xml
[smoker]
[smoker] sync-hack:
[smoker]
[smoker] resolve:
[smoker]
[smoker] ivy-availability-check:
[smoker]
[smoker] ivy-fail:
[smoker]
[smoker] ivy-configure:
[smoker] [ivy:configure] :: loading settings :: file = /usr/home/jenkins/jenkins-slave/workspace/Lucene-Solr-SmokeRelease-trunk/lucene/build/smokeTestRelease/tmp/unpack/solr-6.0.0/lucene/ivy-settings.xml
[smoker]
[smoker] resolve:
[smoker]
[smoker] ivy-availability-check:
[smoker]
[smoker] ivy-fail:
[smoker]
[smoker] ivy-fail:
[smoker]
[smoker] ivy-configure:
[smoker] [ivy:configure] :: loading settings :: file = /usr/home/jenkins/jenkins-slave/workspace/Lucene-Solr-SmokeRelease-trunk/lucene/build/smokeTestRelease/tmp/unpack/solr-6.0.0/lucene/ivy-settings.xml
[smoker]
[smoker] resolve:
[smoker]
[smoker] common.init:
[smoker]
[smoker] compile-lucene-core:
[smoker]
[smoker] ivy-availability-check:
[smoker]
[smoker] ivy-fail:
[smoker]
[smoker] ivy-configure:
[smoker] [ivy:configure] :: loading settings :: file = /usr/home/jenkins/jenkins-slave/workspace/Lucene-Solr-SmokeRelease-trunk/lucene/build/smokeTestRelease/tmp/unpack/solr-6.0.0/lucene/ivy-settings.xml
[smoker]
[smoker] resolve:
[smoker]
[smoker] init:
[smoker]
[smoker] -clover.disable:
[smoker]
[smoker] -clover.load:
[smoker]
[smoker] -clover.classpath:
[smoker]
[smoker] -clover.setup:
[smoker]
[smoker] clover:
[smoker]
[smoker] compile-core:
[smoker]
[smoker] init:
[smoker]
[smoker] -clover.disable:
[smoker]
[smoker] -clover.load:
[smoker]
[smoker] -clover.classpath:
[smoker]
[smoker] -clover.setup:
[smoker]
[smoker] clover:
[smoker]
[smoker] common.compile-core:
[smoker]
[smoker] compile-core:
[smoker]
[smoker] check-lucene-core-uptodate:
[smoker]
[smoker] jar-lucene-core:
[smoker]
[smoker] check-backward-codecs-uptodate:
[smoker]
[smoker] jar-backward-codecs:
[smoker]
[smoker] check-analyzers-phonetic-uptodate:
[smoker]
[smoker] jar-analyzers-phonetic:
[smoker]
[smoker] check-analyzers-kuromoji-uptodate:
[smoker]
[smoker] jar-analyzers-kuromoji:
[smoker]
[smoker] check-codecs-uptodate:
[smoker]
[smoker] jar-codecs:
[smoker]
[smoker] check-expressions-uptodate:
[smoker]
[smoker] jar-expressions:
[smoker]
[smoker] check-suggest-uptodate:
[smoker]
[smoker] jar-suggest:
[smoker]
[smoker] check-highlighter-uptodate:
[smoker]
[smoker] jar-highlighter:
[smoker]
[smoker] check-memory-uptodate:
[smoker]
[smoker] jar-memory:
[smoker]
[smoker] check-misc-uptodate:
[smoker]
[smoker] jar-misc:
[smoker]
[smoker] check-spatial-uptodate:
[smoker]
[smoker] jar-spatial:
[smoker]
[smoker] check-grouping-uptodate:
[smoker]
[smoker] jar-grouping:
[smoker]
[smoker] check-queries-uptodate:
[smoker]
[smoker] jar-queries:
[smoker]
[smoker] check-queryparser-uptodate:
[smoker]
[smoker] jar-queryparser:
[smoker]
[smoker] check-join-uptodate:
[smoker]
[smoker] jar-join:
[smoker]
[smoker] prep-lucene-jars:
[smoker]
[smoker] resolve-example:
[smoker]
[smoker] ivy-availability-check:
[smoker]
[smoker] ivy-fail:
[smoker]
[smoker] ivy-fail:
[smoker]
[smoker] ivy-configure:
[smoker] [ivy:configure] :: loading settings :: file = /usr/home/jenkins/jenkins-slave/workspace/Lucene-Solr-SmokeRelease-trunk/lucene/build/smokeTestRelease/tmp/unpack/solr-6.0.0/lucene/ivy-settings.xml
[smoker]
[smoker] sync-hack:
[smoker]
[smoker] resolve:
[smoker]
[smoker] ivy-availability-check:
[smoker]
[smoker] ivy-fail:
[smoker]
[smoker] ivy-configure:
[smoker] [ivy:configure] :: loading settings :: file = /usr/home/jenkins/jenkins-slave/workspace/Lucene-Solr-SmokeRelease-trunk/lucene/build/smokeTestRelease/tmp/unpack/solr-6.0.0/lucene/ivy-settings.xml
[smoker]
[smoker] resolve:
[smoker]
[smoker] ivy-availability-check:
[smoker]
[smoker] ivy-fail:
[smoker]
[smoker] ivy-fail:
[smoker]
[smoker] ivy-configure:
[smoker] [ivy:configure] :: loading settings :: file = /usr/home/jenkins/jenkins-slave/workspace/Lucene-Solr-SmokeRelease-trunk/lucene/build/smokeTestRelease/tmp/unpack/solr-6.0.0/lucene/ivy-settings.xml
[smoker]
[smoker] resolve:
[smoker]
[smoker] common.init:
[smoker]
[smoker] compile-lucene-core:
[smoker]
[smoker] ivy-availability-check:
[smoker]
[smoker] ivy-fail:
[smoker]
[smoker] ivy-configure:
[smoker] [ivy:configure] :: loading settings :: file = /usr/home/jenkins/jenkins-slave/workspace/Lucene-Solr-SmokeRelease-trunk/lucene/build/smokeTestRelease/tmp/unpack/solr-6.0.0/lucene/ivy-settings.xml
[smoker]
[smoker] resolve:
[smoker]
[smoker] init:
[smoker]
[smoker] -clover.disable:
[smoker]
[smoker] -clover.load:
[smoker]
[smoker] -clover.classpath:
[smoker]
[smoker] -clover.setup:
[smoker]
[smoker] clover:
[smoker]
[smoker] compile-core:
[smoker]
[smoker] init:
[smoker]
[smoker] -clover.disable:
[smoker]
[smoker] -clover.load:
[smoker]
[smoker] -clover.classpath:
[smoker]
[smoker] -clover.setup:
[smoker]
[smoker] clover:
[smoker]
[smoker] common.compile-core:
[smoker] [mkdir] Created dir: /usr/home/jenkins/jenkins-slave/workspace/Lucene-Solr-SmokeRelease-trunk/lucene/build/smokeTestRelease/tmp/unpack/solr-6.0.0/solr/build/contrib/solr-analysis-extras/classes/java
[smoker] [javac] Compiling 1 source file to /usr/home/jenkins/jenkins-slave/workspace/Lucene-Solr-SmokeRelease-trunk/lucene/build/smokeTestRelease/tmp/unpack/solr-6.0.0/solr/build/contrib/solr-analysis-extras/classes/java
[smoker] [javac] Note: /usr/home/jenkins/jenkins-slave/workspace/Lucene-Solr-SmokeRelease-trunk/lucene/build/smokeTestRelease/tmp/unpack/solr-6.0.0/solr/contrib/analysis-extras/src/java/org/apache/solr/schema/ICUCollationField.java uses or overrides a deprecated API.
[smoker] [javac] Note: Recompile with -Xlint:deprecation for details.
[smoker]
[smoker] common-solr.compile-core:
[smoker]
[smoker] solr-contrib-build.compile-core:
[smoker]
[smoker] compile-core:
[smoker]
[smoker] compile:
[smoker]
[smoker] compile-solr-test-framework:
[smoker]
[smoker] ivy-availability-check:
[smoker]
[smoker] ivy-fail:
[smoker]
[smoker] ivy-configure:
[smoker] [ivy:configure] :: loading settings :: file = /usr/home/jenkins/jenkins-slave/workspace/Lucene-Solr-SmokeRelease-trunk/lucene/build/smokeTestRelease/tmp/unpack/solr-6.0.0/lucene/ivy-settings.xml
[smoker]
[smoker] resolve:
[smoker]
[smoker] compile-solr-core:
[smoker]
[smoker] compile-solrj:
[smoker]
[smoker] check-lucene-core-uptodate:
[smoker]
[smoker] jar-lucene-core:
[smoker]
[smoker] check-backward-codecs-uptodate:
[smoker]
[smoker] jar-backward-codecs:
[smoker]
[smoker] check-analyzers-phonetic-uptodate:
[smoker]
[smoker] jar-analyzers-phonetic:
[smoker]
[smoker] check-analyzers-kuromoji-uptodate:
[smoker]
[smoker] jar-analyzers-kuromoji:
[smoker]
[smoker] check-codecs-uptodate:
[smoker]
[smoker] jar-codecs:
[smoker]
[smoker] check-expressions-uptodate:
[smoker]
[smoker] jar-expressions:
[smoker]
[smoker] check-suggest-uptodate:
[smoker]
[smoker] jar-suggest:
[smoker]
[smoker] check-highlighter-uptodate:
[smoker]
[smoker] jar-highlighter:
[smoker]
[smoker] check-memory-uptodate:
[smoker]
[smoker] jar-memory:
[smoker]
[smoker] check-misc-uptodate:
[smoker]
[smoker] jar-misc:
[smoker]
[smoker] check-spatial-uptodate:
[smoker]
[smoker] jar-spatial:
[smoker]
[smoker] check-grouping-uptodate:
[smoker]
[smoker] jar-grouping:
[smoker]
[smoker] check-queries-uptodate:
[smoker]
[smoker] jar-queries:
[smoker]
[smoker] check-queryparser-uptodate:
[smoker]
[smoker] jar-queryparser:
[smoker]
[smoker] check-join-uptodate:
[smoker]
[smoker] jar-join:
[smoker]
[smoker] prep-lucene-jars:
[smoker]
[smoker] resolve-example:
[smoker]
[smoker] ivy-availability-check:
[smoker]
[smoker] ivy-fail:
[smoker]
[smoker] ivy-fail:
[smoker]
[smoker] ivy-configure:
[smoker] [ivy:configure] :: loading settings :: file = /usr/home/jenkins/jenkins-slave/workspace/Lucene-Solr-SmokeRelease-trunk/lucene/build/smokeTestRelease/tmp/unpack/solr-6.0.0/lucene/ivy-settings.xml
[smoker]
[smoker] sync-hack:
[smoker]
[smoker] resolve:
[smoker]
[smoker] ivy-availability-check:
[smoker]
[smoker] ivy-fail:
[smoker]
[smoker] ivy-configure:
[smoker] [ivy:configure] :: loading settings :: file = /usr/home/jenkins/jenkins-slave/workspace/Lucene-Solr-SmokeRelease-trunk/lucene/build/smokeTestRelease/tmp/unpack/solr-6.0.0/lucene/ivy-settings.xml
[smoker]
[smoker] resolve:
[smoker]
[smoker] ivy-availability-check:
[smoker]
[smoker] ivy-fail:
[smoker]
[smoker] ivy-fail:
[smoker]
[smoker] ivy-configure:
[smoker] [ivy:configure] :: loading settings :: file = /usr/home/jenkins/jenkins-slave/workspace/Lucene-Solr-SmokeRelease-trunk/lucene/build/smokeTestRelease/tmp/unpack/solr-6.0.0/lucene/ivy-settings.xml
[smoker]
[smoker] resolve:
[smoker]
[smoker] common.init:
[smoker]
[smoker] compile-lucene-core:
[smoker]
[smoker] ivy-availability-check:
[smoker]
[smoker] ivy-fail:
[smoker]
[smoker] ivy-configure:
[smoker] [ivy:configure] :: loading settings :: file = /usr/home/jenkins/jenkins-slave/workspace/Lucene-Solr-SmokeRelease-trunk/lucene/build/smokeTestRelease/tmp/unpack/solr-6.0.0/lucene/ivy-settings.xml
[smoker]
[smoker] resolve:
[smoker]
[smoker] init:
[smoker]
[smoker] -clover.disable:
[smoker]
[smoker] -clover.load:
[smoker]
[smoker] -clover.classpath:
[smoker]
[smoker] -clover.setup:
[smoker]
[smoker] clover:
[smoker]
[smoker] compile-core:
[smoker]
[smoker] init:
[smoker]
[smoker] -clover.disable:
[smoker]
[smoker] -clover.load:
[smoker]
[smoker] -clover.classpath:
[smoker]
[smoker] -clover.setup:
[smoker]
[smoker] clover:
[smoker]
[smoker] common.compile-core:
[smoker]
[smoker] compile-core:
[smoker]
[smoker] check-lucene-core-uptodate:
[smoker]
[smoker] jar-lucene-core:
[smoker]
[smoker] check-backward-codecs-uptodate:
[smoker]
[smoker] jar-backward-codecs:
[smoker]
[smoker] check-analyzers-phonetic-uptodate:
[smoker]
[smoker] jar-analyzers-phonetic:
[smoker]
[smoker] check-analyzers-kuromoji-uptodate:
[smoker]
[smoker] jar-analyzers-kuromoji:
[smoker]
[smoker] check-codecs-uptodate:
[smoker]
[smoker] jar-codecs:
[smoker]
[smoker] check-expressions-uptodate:
[smoker]
[smoker] jar-expressions:
[smoker]
[smoker] check-suggest-uptodate:
[smoker]
[smoker] jar-suggest:
[smoker]
[smoker] check-highlighter-uptodate:
[smoker]
[smoker] jar-highlighter:
[smoker]
[smoker] check-memory-uptodate:
[smoker]
[smoker] jar-memory:
[smoker]
[smoker] check-misc-uptodate:
[smoker]
[smoker] jar-misc:
[smoker]
[smoker] check-spatial-uptodate:
[smoker]
[smoker] jar-spatial:
[smoker]
[smoker] check-grouping-uptodate:
[smoker]
[smoker] jar-grouping:
[smoker]
[smoker] check-queries-uptodate:
[smoker]
[smoker] jar-queries:
[smoker]
[smoker] check-queryparser-uptodate:
[smoker]
[smoker] jar-queryparser:
[smoker]
[smoker] check-join-uptodate:
[smoker]
[smoker] jar-join:
[smoker]
[smoker] prep-lucene-jars:
[smoker]
[smoker] resolve-example:
[smoker]
[smoker] ivy-availability-check:
[smoker]
[smoker] ivy-fail:
[smoker]
[smoker] ivy-fail:
[smoker]
[smoker] ivy-configure:
[smoker] [ivy:configure] :: loading settings :: file = /usr/home/jenkins/jenkins-slave/workspace/Lucene-Solr-SmokeRelease-trunk/lucene/build/smokeTestRelease/tmp/unpack/solr-6.0.0/lucene/ivy-settings.xml
[smoker]
[smoker] sync-hack:
[smoker]
[smoker] resolve:
[smoker]
[smoker] ivy-availability-check:
[smoker]
[smoker] ivy-fail:
[smoker]
[smoker] ivy-configure:
[smoker] [ivy:configure] :: loading settings :: file = /usr/home/jenkins/jenkins-slave/workspace/Lucene-Solr-SmokeRelease-trunk/lucene/build/smokeTestRelease/tmp/unpack/solr-6.0.0/lucene/ivy-settings.xml
[smoker]
[smoker] resolve:
[smoker]
[smoker] ivy-availability-check:
[smoker]
[smoker] ivy-fail:
[smoker]
[smoker] ivy-fail:
[smoker]
[smoker] ivy-configure:
[smoker] [ivy:configure] :: loading settings :: file = /usr/home/jenkins/jenkins-slave/workspace/Lucene-Solr-SmokeRelease-trunk/lucene/build/smokeTestRelease/tmp/unpack/solr-6.0.0/lucene/ivy-settings.xml
[smoker]
[smoker] resolve:
[smoker]
[smoker] common.init:
[smoker]
[smoker] compile-lucene-core:
[smoker]
[smoker] ivy-availability-check:
[smoker]
[smoker] ivy-fail:
[smoker]
[smoker] ivy-configure:
[smoker] [ivy:configure] :: loading settings :: file = /usr/home/jenkins/jenkins-slave/workspace/Lucene-Solr-SmokeRelease-trunk/lucene/build/smokeTestRelease/tmp/unpack/solr-6.0.0/lucene/ivy-settings.xml
[smoker]
[smoker] resolve:
[smoker]
[smoker] init:
[smoker]
[smoker] -clover.disable:
[smoker]
[smoker] -clover.load:
[smoker]
[smoker] -clover.classpath:
[smoker]
[smoker] -clover.setup:
[smoker]
[smoker] clover:
[smoker]
[smoker] compile-core:
[smoker]
[smoker] init:
[smoker]
[smoker] -clover.disable:
[smoker]
[smoker] -clover.load:
[smoker]
[smoker] -clover.classpath:
[smoker]
[smoker] -clover.setup:
[smoker]
[smoker] clover:
[smoker]
[smoker] common.compile-core:
[smoker]
[smoker] common-solr.compile-core:
[smoker]
[smoker] compile-core:
[smoker]
[smoker] compile-test-framework:
[smoker]
[smoker] compile-test-framework:
[smoker]
[smoker] ivy-availability-check:
[smoker]
[smoker] ivy-fail:
[smoker]
[smoker] ivy-configure:
[smoker] [ivy:configure] :: loading settings :: file = /usr/home/jenkins/jenkins-slave/workspace/Lucene-Solr-SmokeRelease-trunk/lucene/build/smokeTestRelease/tmp/unpack/solr-6.0.0/lucene/ivy-settings.xml
[smoker]
[smoker] resolve:
[smoker]
[smoker] init:
[smoker]
[smoker] compile-lucene-core:
[smoker]
[smoker] ivy-availability-check:
[smoker]
[smoker] ivy-fail:
[smoker]
[smoker] ivy-configure:
[smoker] [ivy:configure] :: loading settings :: file = /usr/home/jenkins/jenkins-slave/workspace/Lucene-Solr-SmokeRelease-trunk/lucene/build/smokeTestRelease/tmp/unpack/solr-6.0.0/lucene/ivy-settings.xml
[smoker]
[smoker] resolve:
[smoker]
[smoker] init:
[smoker]
[smoker] -clover.disable:
[smoker]
[smoker] -clover.load:
[smoker]
[smoker] -clover.classpath:
[smoker]
[smoker] -clover.setup:
[smoker]
[smoker] clover:
[smoker]
[smoker] compile-core:
[smoker]
[smoker] compile-codecs:
[smoker]
[smoker] ivy-availability-check:
[smoker]
[smoker] ivy-fail:
[smoker]
[smoker] ivy-configure:
[smoker] [ivy:configure] :: loading settings :: file = /usr/home/jenkins/jenkins-slave/workspace/Lucene-Solr-SmokeRelease-trunk/lucene/build/smokeTestRelease/tmp/unpack/solr-6.0.0/lucene/ivy-settings.xml
[smoker]
[smoker] resolve:
[smoker]
[smoker] common.init:
[smoker]
[smoker] compile-lucene-core:
[smoker]
[smoker] init:
[smoker]
[smoker] -clover.disable:
[smoker]
[smoker] -clover.load:
[smoker]
[smoker] -clover.classpath:
[smoker]
[smoker] -clover.setup:
[smoker]
[smoker] clover:
[smoker]
[smoker] compile-core:
[smoker]
[smoker] -clover.disable:
[smoker]
[smoker] -clover.load:
[smoker]
[smoker] -clover.classpath:
[smoker]
[smoker] -clover.setup:
[smoker]
[smoker] clover:
[smoker]
[smoker] common.compile-core:
[smoker]
[smoker] compile-core:
[smoker]
[smoker] compile-core:
[smoker] [mkdir] Created dir: /usr/home/jenkins/jenkins-slave/workspace/Lucene-Solr-SmokeRelease-trunk/lucene/build/smokeTestRelease/tmp/unpack/solr-6.0.0/solr/build/solr-test-framework/classes/java
[smoker] [javac] Compiling 36 source files to /usr/home/jenkins/jenkins-slave/workspace/Lucene-Solr-SmokeRelease-trunk/lucene/build/smokeTestRelease/tmp/unpack/solr-6.0.0/solr/build/solr-test-framework/classes/java
[smoker] [javac] Note: Some input files use or override a deprecated API.
[smoker] [javac] Note: Recompile with -Xlint:deprecation for details.
[smoker] [javac] Note: Some input files use unchecked or unsafe operations.
[smoker] [javac] Note: Recompile with -Xlint:unchecked for details.
[smoker]
[smoker] compile-solrj:
[smoker]
[smoker] check-lucene-core-uptodate:
[smoker]
[smoker] jar-lucene-core:
[smoker]
[smoker] check-backward-codecs-uptodate:
[smoker]
[smoker] jar-backward-codecs:
[smoker]
[smoker] check-analyzers-phonetic-uptodate:
[smoker]
[smoker] jar-analyzers-phonetic:
[smoker]
[smoker] check-analyzers-kuromoji-uptodate:
[smoker]
[smoker] jar-analyzers-kuromoji:
[smoker]
[smoker] check-codecs-uptodate:
[smoker]
[smoker] jar-codecs:
[smoker]
[smoker] check-expressions-uptodate:
[smoker]
[smoker] jar-expressions:
[smoker]
[smoker] check-suggest-uptodate:
[smoker]
[smoker] jar-suggest:
[smoker]
[smoker] check-highlighter-uptodate:
[smoker]
[smoker] jar-highlighter:
[smoker]
[smoker] check-memory-uptodate:
[smoker]
[smoker] jar-memory:
[smoker]
[smoker] check-misc-uptodate:
[smoker]
[smoker] jar-misc:
[smoker]
[smoker] check-spatial-uptodate:
[smoker]
[smoker] jar-spatial:
[smoker]
[smoker] check-grouping-uptodate:
[smoker]
[smoker] jar-grouping:
[smoker]
[smoker] check-queries-uptodate:
[smoker]
[smoker] jar-queries:
[smoker]
[smoker] check-queryparser-uptodate:
[smoker]
[smoker] jar-queryparser:
[smoker]
[smoker] check-join-uptodate:
[smoker]
[smoker] jar-join:
[smoker]
[smoker] prep-lucene-jars:
[smoker]
[smoker] resolve-example:
[smoker]
[smoker] ivy-availability-check:
[smoker]
[smoker] ivy-fail:
[smoker]
[smoker] ivy-fail:
[smoker]
[smoker] ivy-configure:
[smoker] [ivy:configure] :: loading settings :: file = /usr/home/jenkins/jenkins-slave/workspace/Lucene-Solr-SmokeRelease-trunk/lucene/build/smokeTestRelease/tmp/unpack/solr-6.0.0/lucene/ivy-settings.xml
[smoker]
[smoker] sync-hack:
[smoker]
[smoker] resolve:
[smoker]
[smoker] ivy-availability-check:
[smoker]
[smoker] ivy-fail:
[smoker]
[smoker] ivy-configure:
[smoker] [ivy:configure] :: loading settings :: file = /usr/home/jenkins/jenkins-slave/workspace/Lucene-Solr-SmokeRelease-trunk/lucene/build/smokeTestRelease/tmp/unpack/solr-6.0.0/lucene/ivy-settings.xml
[smoker]
[smoker] resolve:
[smoker]
[smoker] ivy-availability-check:
[smoker]
[smoker] ivy-fail:
[smoker]
[smoker] ivy-fail:
[smoker]
[smoker] ivy-configure:
[smoker] [ivy:configure] :: loading settings :: file = /usr/home/jenkins/jenkins-slave/workspace/Lucene-Solr-SmokeRelease-trunk/lucene/build/smokeTestRelease/tmp/unpack/solr-6.0.0/lucene/ivy-settings.xml
[smoker]
[smoker] resolve:
[smoker]
[smoker] common.init:
[smoker]
[smoker] compile-lucene-core:
[smoker]
[smoker] ivy-availability-check:
[smoker]
[smoker] ivy-fail:
[smoker]
[smoker] ivy-configure:
[smoker] [ivy:configure] :: loading settings :: file = /usr/home/jenkins/jenkins-slave/workspace/Lucene-Solr-SmokeRelease-trunk/lucene/build/smokeTestRelease/tmp/unpack/solr-6.0.0/lucene/ivy-settings.xml
[smoker]
[smoker] resolve:
[smoker]
[smoker] init:
[smoker]
[smoker] -clover.disable:
[smoker]
[smoker] -clover.load:
[smoker]
[smoker] -clover.classpath:
[smoker]
[smoker] -clover.setup:
[smoker]
[smoker] clover:
[smoker]
[smoker] compile-core:
[smoker]
[smoker] init:
[smoker]
[smoker] -clover.disable:
[smoker]
[smoker] -clover.load:
[smoker]
[smoker] -clover.classpath:
[smoker]
[smoker] -clover.setup:
[smoker]
[smoker] clover:
[smoker]
[smoker] common.compile-core:
[smoker]
[smoker] compile-core:
[smoker]
[smoker] check-lucene-core-uptodate:
[smoker]
[smoker] jar-lucene-core:
[smoker]
[smoker] check-backward-codecs-uptodate:
[smoker]
[smoker] jar-backward-codecs:
[smoker]
[smoker] check-analyzers-phonetic-uptodate:
[smoker]
[smoker] jar-analyzers-phonetic:
[smoker]
[smoker] check-analyzers-kuromoji-uptodate:
[smoker]
[smoker] jar-analyzers-kuromoji:
[smoker]
[smoker] check-codecs-uptodate:
[smoker]
[smoker] jar-codecs:
[smoker]
[smoker] check-expressions-uptodate:
[smoker]
[smoker] jar-expressions:
[smoker]
[smoker] check-suggest-uptodate:
[smoker]
[smoker] jar-suggest:
[smoker]
[smoker] check-highlighter-uptodate:
[smoker]
[smoker] jar-highlighter:
[smoker]
[smoker] check-memory-uptodate:
[smoker]
[smoker] jar-memory:
[smoker]
[smoker] check-misc-uptodate:
[smoker]
[smoker] jar-misc:
[smoker]
[smoker] check-spatial-uptodate:
[smoker]
[smoker] jar-spatial:
[smoker]
[smoker] check-grouping-uptodate:
[smoker]
[smoker] jar-grouping:
[smoker]
[smoker] check-queries-uptodate:
[smoker]
[smoker] jar-queries:
[smoker]
[smoker] check-queryparser-uptodate:
[smoker]
[smoker] jar-queryparser:
[smoker]
[smoker] check-join-uptodate:
[smoker]
[smoker] jar-join:
[smoker]
[smoker] prep-lucene-jars:
[smoker]
[smoker] resolve-example:
[smoker]
[smoker] ivy-availability-check:
[smoker]
[smoker] ivy-fail:
[smoker]
[smoker] ivy-fail:
[smoker]
[smoker] ivy-configure:
[smoker] [ivy:configure] :: loading settings :: file = /usr/home/jenkins/jenkins-slave/workspace/Lucene-Solr-SmokeRelease-trunk/lucene/build/smokeTestRelease/tmp/unpack/solr-6.0.0/lucene/ivy-settings.xml
[smoker]
[smoker] sync-hack:
[smoker]
[smoker] resolve:
[smoker]
[smoker] ivy-availability-check:
[smoker]
[smoker] ivy-fail:
[smoker]
[smoker] ivy-configure:
[smoker] [ivy:configure] :: loading settings :: file = /usr/home/jenkins/jenkins-slave/workspace/Lucene-Solr-SmokeRelease-trunk/lucene/build/smokeTestRelease/tmp/unpack/solr-6.0.0/lucene/ivy-settings.xml
[smoker]
[smoker] resolve:
[smoker]
[smoker] ivy-fail:
[smoker]
[smoker] resolve:
[smoker]
[smoker] common.init:
[smoker]
[smoker] compile-lucene-core:
[smoker]
[smoker] ivy-availability-check:
[smoker]
[smoker] ivy-fail:
[smoker]
[smoker] ivy-configure:
[smoker] [ivy:configure] :: loading settings :: file = /usr/home/jenkins/jenkins-slave/workspace/Lucene-Solr-SmokeRelease-trunk/lucene/build/smokeTestRelease/tmp/unpack/solr-6.0.0/lucene/ivy-settings.xml
[smoker]
[smoker] resolve:
[smoker]
[smoker] init:
[smoker]
[smoker] -clover.disable:
[smoker]
[smoker] -clover.load:
[smoker]
[smoker] -clover.classpath:
[smoker]
[smoker] -clover.setup:
[smoker]
[smoker] clover:
[smoker]
[smoker] compile-core:
[smoker]
[smoker] init:
[smoker]
[smoker] common.compile-core:
[smoker]
[smoker] common-solr.compile-core:
[smoker]
[smoker] compile-core:
[smoker]
[smoker] compile-test-framework:
[smoker]
[smoker] ivy-availability-check:
[smoker]
[smoker] ivy-fail:
[smoker]
[smoker] ivy-configure:
[smoker] [ivy:configure] :: loading settings :: file = /usr/home/jenkins/jenkins-slave/workspace/Lucene-Solr-SmokeRelease-trunk/lucene/build/smokeTestRelease/tmp/unpack/solr-6.0.0/lucene/ivy-settings.xml
[smoker]
[smoker] resolve:
[smoker]
[smoker] init:
[smoker]
[smoker] compile-lucene-core:
[smoker]
[smoker] compile-codecs:
[smoker]
[smoker] ivy-availability-check:
[smoker]
[smoker] ivy-fail:
[smoker]
[smoker] ivy-configure:
[smoker] [ivy:configure] :: loading settings :: file = /usr/home/jenkins/jenkins-slave/workspace/Lucene-Solr-SmokeRelease-trunk/lucene/build/smokeTestRelease/tmp/unpack/solr-6.0.0/lucene/ivy-settings.xml
[smoker]
[smoker] resolve:
[smoker]
[smoker] common.init:
[smoker]
[smoker] compile-lucene-core:
[smoker]
[smoker] init:
[smoker]
[smoker] -clover.disable:
[smoker]
[smoker] -clover.load:
[smoker]
[smoker] -clover.classpath:
[smoker]
[smoker] -clover.setup:
[smoker]
[smoker] clover:
[smoker]
[smoker] compile-core:
[smoker]
[smoker] -clover.disable:
[smoker]
[smoker] -clover.load:
[smoker]
[smoker] -clover.classpath:
[smoker]
[smoker] -clover.setup:
[smoker]
[smoker] clover:
[smoker]
[smoker] common.compile-core:
[smoker]
[smoker] compile-core:
[smoker]
[smoker] common.compile-test:
[smoker] [mkdir] Created dir: /usr/home/jenkins/jenkins-slave/workspace/Lucene-Solr-SmokeRelease-trunk/lucene/build/smokeTestRelease/tmp/unpack/solr-6.0.0/solr/build/solr-core/classes/test
[smoker] [javac] Compiling 472 source files to /usr/home/jenkins/jenkins-slave/workspace/Lucene-Solr-SmokeRelease-trunk/lucene/build/smokeTestRelease/tmp/unpack/solr-6.0.0/solr/build/solr-core/classes/test
[smoker] [javac] Note: Some input files use or override a deprecated API.
[smoker] [javac] Note: Recompile with -Xlint:deprecation for details.
[smoker] [javac] Note: Some input files use unchecked or unsafe operations.
[smoker] [javac] Note: Recompile with -Xlint:unchecked for details.
[smoker] [copy] Copying 1 file to /usr/home/jenkins/jenkins-slave/workspace/Lucene-Solr-SmokeRelease-trunk/lucene/build/smokeTestRelease/tmp/unpack/solr-6.0.0/solr/build/solr-core/classes/test
[smoker]
[smoker] common-solr.compile-test:
[smoker]
[smoker] compile-test:
[smoker]
[smoker] install-junit4-taskdef:
[smoker]
[smoker] compile-tools:
[smoker]
[smoker] ivy-availability-check:
[smoker]
[smoker] ivy-fail:
[smoker]
[smoker] ivy-configure:
[smoker] [ivy:configure] :: loading settings :: file = /usr/home/jenkins/jenkins-slave/workspace/Lucene-Solr-SmokeRelease-trunk/lucene/build/smokeTestRelease/tmp/unpack/solr-6.0.0/lucene/ivy-settings.xml
[smoker]
[smoker] resolve:
[smoker]
[smoker] init:
[smoker]
[smoker] compile-core:
[smoker]
[smoker] validate:
[smoker]
[smoker] resolve-groovy:
[smoker]
[smoker] -init-totals:
[smoker]
[smoker] -test:
[smoker] [mkdir] Created dir: /usr/home/jenkins/jenkins-slave/workspace/Lucene-Solr-SmokeRelease-trunk/lucene/build/smokeTestRelease/tmp/unpack/solr-6.0.0/solr/build/solr-core/test
[smoker] [loadresource] Do not set property tests.explicitclass as its length is 0.
[smoker] [mkdir] Created dir: /usr/home/jenkins/jenkins-slave/workspace/Lucene-Solr-SmokeRelease-trunk/lucene/build/smokeTestRelease/tmp/unpack/solr-6.0.0/solr/build/solr-core/test/temp
[smoker] [mkdir] Created dir: /usr/home/jenkins/jenkins-slave/workspace/Lucene-Solr-SmokeRelease-trunk/lucene/build/smokeTestRelease/tmp/unpack/solr-6.0.0/.caches/test-stats/solr-core
[smoker] [junit4] <JUnit4> says hello! Master seed: C06E90B258529789
[smoker] [junit4] Your default console's encoding may not display certain unicode glyphs: US-ASCII
[smoker] [junit4] Executing 435 suites with 4 JVMs.
[smoker] [junit4]
[smoker] [junit4] Started J3 PID(68163@lucene.zones.apache.org).
[smoker] [junit4] Started J1 PID(68162@lucene.zones.apache.org).
[smoker] [junit4] Started J0 PID(68164@lucene.zones.apache.org).
[smoker] [junit4] Started J2 PID(68165@lucene.zones.apache.org).
[smoker] [junit4] Suite: org.apache.solr.cloud.ExternalCollectionsTest
[smoker] [junit4] IGNOR/A 0.19s J3 | ExternalCollectionsTest.testDistribSearch
[smoker] [junit4] > Assumption #1: 'slow' test group is disabled (@Slow())
[smoker] [junit4] Completed on J3 in 3.37s, 1 test, 1 skipped
[smoker] [junit4]
[smoker] [junit4] Suite: org.apache.solr.cloud.CollectionsAPIAsyncDistributedZkTest
[smoker] [junit4] IGNOR/A 0.19s J1 | CollectionsAPIAsyncDistributedZkTest.testDistribSearch
[smoker] [junit4] > Assumption #1: 'slow' test group is disabled (@Slow())
[smoker] [junit4] Completed on J1 in 3.38s, 1 test, 1 skipped
[smoker] [junit4]
[smoker] [junit4] Suite: org.apache.solr.cloud.AsyncMigrateRouteKeyTest
[smoker] [junit4] IGNOR/A 0.18s J2 | AsyncMigrateRouteKeyTest.testDistribSearch
[smoker] [junit4] > Assumption #1: 'slow' test group is disabled (@Slow())
[smoker] [junit4] Completed on J2 in 3.26s, 1 test, 1 skipped
[smoker] [junit4]
[smoker] [junit4] Suite: org.apache.solr.schema.ChangedSchemaMergeTest
[smoker] [junit4] Completed on J3 in 34.20s, 1 test
[smoker] [junit4]
[smoker] [junit4] Suite: org.apache.solr.highlight.HighlighterMaxOffsetTest
[smoker] [junit4] Completed on J3 in 8.24s, 6 tests
[smoker] [junit4]
[smoker] [junit4] Suite: org.apache.solr.search.TestComponentsName
[smoker] [junit4] Completed on J1 in 42.80s, 1 test
[smoker] [junit4]
[smoker] [junit4] Suite: org.apache.solr.search.QueryEqualityTest
[smoker] [junit4] Completed on J0 in 47.58s, 72 tests
[smoker] [junit4]
[smoker] [junit4] Suite: org.apache.solr.schema.IndexSchemaTest
[smoker] [junit4] Completed on J2 in 47.95s, 3 tests
[smoker] [junit4]
[smoker] [junit4] Suite: org.apache.solr.internal.csv.writer.CSVFieldTest
[smoker] [junit4] Completed on J2 in 0.07s, 2 tests
[smoker] [junit4]
[smoker] [junit4] Suite: org.apache.solr.schema.CurrencyFieldOpenExchangeTest
[smoker] [junit4] Completed on J1 in 11.16s, 10 tests, 1 skipped
[smoker] [junit4]
[smoker] [junit4] Suite: org.apache.solr.cloud.TestCloudInspectUtil
[smoker] [junit4] Completed on J1 in 0.10s, 1 test
[smoker] [junit4]
[smoker] [junit4] Suite: org.apache.solr.cloud.OverseerCollectionProcessorTest
[smoker] [junit4] Completed on J2 in 7.56s, 14 tests
[smoker] [junit4]
[smoker] [junit4] Suite: org.apache.solr.cloud.TestLeaderElectionZkExpiry
[smoker] [junit4] Completed on J3 in 16.30s, 1 test
[smoker] [junit4]
[smoker] [junit4] Suite: org.apache.solr.schema.TestBinaryField
[smoker] [junit4] Completed on J1 in 16.14s, 1 test
[smoker] [junit4]
[smoker] [junit4] Suite: org.apache.solr.handler.component.DistributedDebugComponentTest
[smoker] [junit4] Completed on J0 in 26.94s, 5 tests
[smoker] [junit4]
[smoker] [junit4] Suite: org.apache.solr.update.UpdateParamsTest
[smoker] [junit4] Completed on J1 in 2.05s, 1 test
[smoker] [junit4]
[smoker] [junit4] Suite: org.apache.solr.handler.JsonLoaderTest
[smoker] [junit4] Completed on J0 in 3.69s, 20 tests
[smoker] [junit4]
[smoker] [junit4] Suite: org.apache.solr.rest.schema.TestSolrQueryParserResource
[smoker] [junit4] Completed on J2 in 18.39s, 1 test
[smoker] [junit4]
[smoker] [junit4] Suite: org.apache.solr.core.TestXIncludeConfig
[smoker] [junit4] Completed on J0 in 1.11s, 1 test
[smoker] [junit4]
[smoker] [junit4] Suite: org.apache.solr.update.TestIndexingPerformance
[smoker] [junit4] Completed on J2 in 3.40s, 1 test
[smoker] [junit4]
[smoker] [junit4] Suite: org.apache.solr.core.TestArbitraryIndexDir
[smoker] [junit4] Completed on J0 in 2.81s, 1 test
[smoker] [junit4]
[smoker] [junit4] Suite: org.apache.solr.util.SimplePostToolTest
[smoker] [junit4] Completed on J0 in 0.31s, 11 tests
[smoker] [junit4]
[smoker] [junit4] Suite: org.apache.solr.servlet.DirectSolrConnectionTest
[smoker] [junit4] Completed on J0 in 1.46s, 2 tests
[smoker] [junit4]
[smoker] [junit4] Suite: org.apache.solr.internal.csv.CharBufferTest
[smoker] [junit4] Completed on J0 in 0.09s, 13 tests
[smoker] [junit4]
[smoker] [junit4] Suite: org.apache.solr.spelling.suggest.TestFileDictionaryLookup
[smoker] [junit4] Completed on J2 in 3.61s, 1 test
[smoker] [junit4]
[smoker] [junit4] Suite: org.apache.solr.search.similarities.TestIBSimilarityFactory
[smoker] [junit4] Completed on J0 in 0.98s, 2 tests
[smoker] [junit4]
[smoker] [junit4] Suite: org.apache.solr.rest.schema.TestDefaultSearchFieldResource
[smoker] [junit4] Completed on J3 in 22.96s, 1 test
[smoker] [junit4]
[smoker] [junit4] Suite: org.apache.solr.update.processor.FieldMutatingUpdateProcessorTest
[smoker] [junit4] Completed on J3 in 8.65s, 27 tests
[smoker] [junit4]
[smoker] [junit4] Suite: org.apache.solr.update.AnalysisErrorHandlingTest
[smoker] [junit4] Completed on J3 in 0.97s, 1 test
[smoker] [junit4]
[smoker] [junit4] Suite: org.apache.solr.spelling.SpellPossibilityIteratorTest
[smoker] [junit4] Completed on J3 in 0.66s, 3 tests
[smoker] [junit4]
[smoker] [junit4] Suite: org.apache.solr.search.TestStressRecovery
[smoker] [junit4] Completed on J2 in 10.79s, 1 test
[smoker] [junit4]
[smoker] [junit4] Suite: org.apache.solr.update.PeerSyncTest
[smoker] [junit4] Completed on J1 in 23.45s, 1 test
[smoker] [junit4]
[smoker] [junit4] Suite: org.apache.solr.spelling.suggest.TestAnalyzeInfixSuggestions
[smoker] [junit4] Completed on J1 in 4.48s, 2 tests
[smoker] [junit4]
[smoker] [junit4] Suite: org.apache.solr.search.TestStressReorder
[smoker] [junit4] Completed on J0 in 19.82s, 1 test
[smoker] [junit4]
[smoker] [junit4] Suite: org.apache.solr.search.TestCollapseQParserPlugin
[smoker] [junit4] Completed on J0 in 3.66s, 2 tests
[smoker] [junit4]
[smoker] [junit4] Suite: org.apache.solr.cloud.TestCollectionAPI
[smoker] [junit4] IGNOR/A 0.13s J0 | TestCollectionAPI.testDistribSearch
[smoker] [junit4] > Assumption #1: 'slow' test group is disabled (@Slow())
[smoker] [junit4] Completed on J0 in 0.26s, 1 test, 1 skipped
[smoker] [junit4]
[smoker] [junit4] Suite: org.apache.solr.handler.component.QueryElevationComponentTest
[smoker] [junit4] Completed on J2 in 14.54s, 8 tests
[smoker] [junit4]
[smoker] [junit4] Suite: org.apache.solr.search.TestQueryTypes
[smoker] [junit4] Completed on J0 in 2.08s, 1 test
[smoker] [junit4]
[smoker] [junit4] Suite: org.apache.solr.search.TestQueryUtils
[smoker] [junit4] Completed on J2 in 2.36s, 1 test
[smoker] [junit4]
[smoker] [junit4] Suite: org.apache.solr.cloud.SyncSliceTest
[smoker] [junit4] IGNOR/A 0.00s J2 | SyncSliceTest.testDistribSearch
[smoker] [junit4] > Assumption #1: 'slow' test group is disabled (@Slow())
[smoker] [junit4] Completed on J2 in 0.01s, 1 test, 1 skipped
[smoker] [junit4]
[smoker] [junit4] Suite: org.apache.solr.rest.schema.TestFieldTypeResource
[smoker] [junit4] Completed on J1 in 11.05s, 4 tests
[smoker] [junit4]
[smoker] [junit4] Suite: org.apache.solr.search.similarities.TestLMDirichletSimilarityFactory
[smoker] [junit4] Completed on J1 in 1.13s, 2 tests
[smoker] [junit4]
[smoker] [junit4] Suite: org.apache.solr.cloud.hdfs.HdfsBasicDistributedZk2Test
[smoker] [junit4] IGNOR/A 0.00s J1 | HdfsBasicDistributedZk2Test.testDistribSearch
[smoker] [junit4] > Assumption #1: 'nightly' test group is disabled (@Nightly(value=))
[smoker] [junit4] Completed on J1 in 0.01s, 1 test, 1 skipped
[smoker] [junit4]
[smoker] [junit4] Suite: org.apache.solr.request.TestFaceting
[smoker] [junit4] Completed on J0 in 7.26s, 9 tests
[smoker] [junit4]
[smoker] [junit4] Suite: org.apache.solr.search.similarities.TestDefaultSimilarityFactory
[smoker] [junit4] Completed on J0 in 0.69s, 2 tests
[smoker] [junit4]
[smoker] [junit4] Suite: org.apache.solr.rest.schema.TestSchemaSimilarityResource
[smoker] [junit4] Completed on J1 in 6.16s, 1 test
[smoker] [junit4]
[smoker] [junit4] Suite: org.apache.solr.search.SpatialFilterTest
[smoker] [junit4] Completed on J1 in 3.14s, 3 tests
[smoker] [junit4]
[smoker] [junit4] Suite: org.apache.solr.TestTolerantSearch
[smoker] [junit4] Completed on J0 in 8.33s, 2 tests
[smoker] [junit4]
[smoker] [junit4] Suite: org.apache.solr.update.processor.ScriptEngineTest
[smoker] [junit4] Completed on J0 in 0.16s, 6 tests, 6 skipped
[smoker] [junit4]
[smoker] [junit4] Suite: org.apache.solr.cloud.hdfs.HdfsUnloadDistributedZkTest
[smoker] [junit4] IGNOR/A 0.00s J0 | HdfsUnloadDistributedZkTest.testDistribSearch
[smoker] [junit4] > Assumption #1: 'nightly' test group is disabled (@Nightly(value=))
[smoker] [junit4] Completed on J0 in 0.01s, 1 test, 1 skipped
[smoker] [junit4]
[smoker] [junit4] Suite: org.apache.solr.handler.component.StatsComponentTest
[smoker] [junit4] Completed on J2 in 21.06s, 14 tests
[smoker] [junit4]
[smoker] [junit4] Suite: org.apache.solr.schema.DateRangeFieldTest
[smoker] [junit4] Completed on J2 in 2.86s, 2 tests
[smoker] [junit4]
[smoker] [junit4] Suite: org.apache.solr.schema.TestCloudManagedSchemaConcurrent
[smoker] [junit4] IGNOR/A 0.00s J2 | TestCloudManagedSchemaConcurrent.testDistribSearch
[smoker] [junit4] > Assumption #1: 'slow' test group is disabled (@Slow())
[smoker] [junit4] Completed on J2 in 0.00s, 1 test, 1 skipped
[smoker] [junit4]
[smoker] [junit4] Suite: org.apache.solr.rest.schema.TestSolrQueryParserDefaultOperatorResource
[smoker] [junit4] Completed on J2 in 6.46s, 1 test
[smoker] [junit4]
[smoker] [junit4] Suite: org.apache.solr.analysis.TestLuceneMatchVersion
[smoker] [junit4] Completed on J2 in 0.84s, 1 test
[smoker] [junit4]
[smoker] [junit4] Suite: org.apache.solr.cloud.hdfs.HdfsCollectionsAPIDistributedZkTest
[smoker] [junit4] IGNOR/A 0.00s J2 | HdfsCollectionsAPIDistributedZkTest.testDistribSearch
[smoker] [junit4] > Assumption #1: 'slow' test group is disabled (@Slow())
[smoker] [junit4] Completed on J2 in 0.01s, 1 test, 1 skipped
[smoker] [junit4]
[smoker] [junit4] Suite: org.apache.solr.cloud.OutOfBoxZkACLAndCredentialsProvidersTest
[smoker] [junit4] Completed on J2 in 2.55s, 2 tests
[smoker] [junit4]
[smoker] [junit4] Suite: org.apache.solr.schema.CopyFieldTest
[smoker] [junit4] Completed on J2 in 2.02s, 9 tests
[smoker] [junit4]
[smoker] [junit4] Suite: org.apache.solr.search.TestRecovery
[smoker] [junit4] Completed on J1 in 28.88s, 11 tests
[smoker] [junit4]
[smoker] [junit4] Suite: org.apache.solr.schema.RequiredFieldsTest
[smoker] [junit4] Completed on J1 in 1.73s, 3 tests
[smoker] [junit4]
[smoker] [junit4] Suite: org.apache.solr.cloud.ChaosMonkeySafeLeaderTest
[smoker] [junit4] IGNOR/A 0.00s J1 | ChaosMonkeySafeLeaderTest.testDistribSearch
[smoker] [junit4] > Assumption #1: 'slow' test group is disabled (@Slow())
[smoker] [junit4] Completed on J1 in 0.01s, 1 test, 1 skipped
[smoker] [junit4]
[smoker] [junit4] Suite: org.apache.solr.core.TestConfig
[smoker] [junit4] Completed on J1 in 1.68s, 6 tests
[smoker] [junit4]
[smoker] [junit4] Suite: org.apache.solr.cloud.ShardSplitTest
[smoker] [junit4] IGNOR/A 0.00s J1 | ShardSplitTest.testDistribSearch
[smoker] [junit4] > Assumption #1: 'slow' test group is disabled (@Slow())
[smoker] [junit4] Completed on J1 in 0.01s, 1 test, 1 skipped
[smoker] [junit4]
[smoker] [junit4] Suite: org.apache.solr.update.SolrCmdDistributorTest
[smoker] [junit4] Completed on J0 in 30.94s, 1 test
[smoker] [junit4]
[smoker] [junit4] Suite: org.apache.solr.core.ResourceLoaderTest
[smoker] [junit4] Completed on J0 in 0.27s, 7 tests
[smoker] [junit4]
[smoker] [junit4] Suite: org.apache.solr.schema.TestCollationField
[smoker] [junit4] Completed on J1 in 0.83s, 8 tests
[smoker] [junit4]
[smoker] [junit4] Suite: org.apache.solr.handler.component.DistributedTermsComponentTest
[smoker] [junit4] Completed on J3 in 63.68s, 1 test
[smoker] [junit4]
[smoker] [junit4] Suite: org.apache.solr.search.TestSimpleQParserPlugin
[smoker] [junit4] Completed on J3 in 1.44s, 16 tests
[smoker] [junit4]
[smoker] [junit4] Suite: org.apache.solr.cloud.UnloadDistributedZkTest
[smoker] [junit4] IGNOR/A 0.00s J3 | UnloadDistributedZkTest.testDistribSearch
[smoker] [junit4] > Assumption #1: 'slow' test group is disabled (@Slow())
[smoker] [junit4] Completed on J3 in 0.01s, 1 test, 1 skipped
[smoker] [junit4]
[smoker] [junit4] Suite: org.apache.solr.handler.component.ResponseLogComponentTest
[smoker] [junit4] Completed on J3 in 1.64s, 3 tests
[smoker] [junit4]
[smoker] [junit4] Suite: org.apache.solr.rest.schema.TestFieldResource
[smoker] [junit4] Completed on J1 in 6.32s, 7 tests
[smoker] [junit4]
[smoker] [junit4] Suite: org.apache.solr.rest.schema.TestSchemaVersionResource
[smoker] [junit4] Completed on J3 in 6.12s, 1 test
[smoker] [junit4]
[smoker] [junit4] Suite: org.apache.solr.schema.TestCloudSchemaless
[smoker] [junit4] IGNOR/A 0.00s J3 | TestCloudSchemaless.testDistribSearch
[smoker] [junit4] > Assumption #1: 'slow' test group is disabled (@Slow())
[smoker] [junit4] Completed on J3 in 0.01s, 1 test, 1 skipped
[smoker] [junit4]
[smoker] [junit4] Suite: org.apache.solr.response.TestRawResponseWriter
[smoker] [junit4] Completed on J3 in 1.88s, 3 tests
[smoker] [junit4]
[smoker] [junit4] Suite: org.apache.solr.cloud.ConnectionManagerTest
[smoker] [junit4] IGNOR/A 0.00s J3 | ConnectionManagerTest.testLikelyExpired
[smoker] [junit4] > Assumption #1: 'slow' test group is disabled (@Slow())
[smoker] [junit4] Completed on J3 in 0.01s, 2 tests, 2 skipped
[smoker] [junit4]
[smoker] [junit4] Suite: org.apache.solr.core.ExitableDirectoryReaderTest
[smoker] [junit4] Completed on J0 in 11.73s, 2 tests
[smoker] [junit4]
[smoker] [junit4] Suite: org.apache.solr.TestGroupingSearch
[smoker] [junit4] Completed on J1 in 6.92s, 13 tests
[smoker] [junit4]
[smoker] [junit4] Suite: org.apache.solr.core.TestInitParams
[smoker] [junit4] Completed on J0 in 1.74s, 4 tests
[smoker] [junit4]
[smoker] [junit4] Suite: org.apache.solr.core.SOLR749Test
[smoker] [junit4] Completed on J3 in 3.26s, 2 tests
[smoker] [junit4]
[smoker] [junit4] Suite: org.apache.solr.TestTrie
[smoker] [junit4] Completed on J0 in 1.86s, 8 tests
[smoker] [junit4]
[smoker] [junit4] Suite: org.apache.solr.analysis.PathHierarchyTokenizerFactoryTest
[smoker] [junit4] Completed on J1 in 2.01s, 2 tests
[smoker] [junit4]
[smoker] [junit4] Suite: org.apache.solr.handler.component.DistributedQueryComponentOptimizationTest
[smoker] [junit4] Completed on J2 in 25.88s, 1 test
[smoker] [junit4]
[smoker] [junit4] Suite: org.apache.solr.TestRandomDVFaceting
[smoker] [junit4] IGNOR/A 0.00s J2 | TestRandomDVFaceting.testRandomFaceting
[smoker] [junit4] > Assumption #1: 'slow' test group is disabled (@Slow())
[smoker] [junit4] Completed on J2 in 0.01s, 1 test, 1 skipped
[smoker] [junit4]
[smoker] [junit4] Suite: org.apache.solr.update.DirectUpdateHandlerOptimizeTest
[smoker] [junit4] Completed on J1 in 1.85s, 1 test
[smoker] [junit4]
[smoker] [junit4] Suite: org.apache.solr.cloud.SliceStateTest
[smoker] [junit4] Completed on J3 in 2.58s, 1 test
[smoker] [junit4]
[smoker] [junit4] Suite: org.apache.solr.spelling.suggest.TestFreeTextSuggestions
[smoker] [junit4] Completed on J1 in 0.89s, 1 test
[smoker] [junit4]
[smoker] [junit4] Suite: org.apache.solr.search.TestSolr4Spatial2
[smoker] [junit4] Completed on J1 in 1.16s, 1 test
[smoker] [junit4]
[smoker] [junit4] Suite: org.apache.solr.TestSolrCoreProperties
[smoker] [junit4] Completed on J2 in 5.76s, 1 test
[smoker] [junit4]
[smoker] [junit4] Suite: org.apache.solr.search.TestRangeQuery
[smoker] [junit4] Completed on J0 in 6.40s, 2 tests
[smoker] [junit4]
[smoker] [junit4] Suite: org.apache.solr.search.similarities.TestPerFieldSimilarity
[smoker] [junit4] Completed on J2 in 0.55s, 7 tests
[smoker] [junit4]
[smoker] [junit4] Suite: org.apache.solr.search.similarities.TestDFRSimilarityFactory
[smoker] [junit4] Completed on J2 in 0.83s, 3 tests
[smoker] [junit4]
[smoker] [junit4] Suite: org.apache.solr.update.TestDocBasedVersionConstraints
[smoker] [junit4] Completed on J1 in 4.12s, 6 tests
[smoker] [junit4]
[smoker] [junit4] Suite: org.apache.solr.schema.TestSchemaManager
[smoker] [junit4] Completed on J2 in 0.75s, 1 test
[smoker] [junit4]
[smoker] [junit4] Suite: org.apache.solr.update.HardAutoCommitTest
[smoker] [junit4] IGNOR/A 0.00s J2 | HardAutoCommitTest.testCommitWithin
[smoker] [junit4] > Assumption #1: 'slow' test group is disabled (@Slow())
[smoker] [junit4] Completed on J2 in 0.01s, 1 test, 1 skipped
[smoker] [junit4]
[smoker] [junit4] Suite: org.apache.solr.util.TestSystemIdResolver
[smoker] [junit4] Completed on J1 in 0.13s, 1 test
[smoker] [junit4]
[smoker] [junit4] Suite: org.apache.solr.rest.schema.TestFieldTypeCollectionResource
[smoker] [junit4] Completed on J3 in 6.47s, 2 tests
[smoker] [junit4]
[smoker] [junit4] Suite: org.apache.solr.util.DateMathParserTest
[smoker] [junit4] Completed on J2 in 0.13s, 8 tests
[smoker] [junit4]
[smoker] [junit4] Suite: org.apache.solr.handler.component.DistributedSuggestComponentTest
[smoker] [junit4] IGNOR/A 0.00s J3 | DistributedSuggestComponentTest.testDistribSearch
[smoker] [junit4] > Assumption #1: 'slow' test group is disabled (@Slow())
[smoker] [junit4] Completed on J3 in 0.01s, 1 test, 1 skipped
[smoker] [junit4]
[smoker] [junit4] Suite: org.apache.solr.search.TestFoldingMultitermQuery
[smoker] [junit4] Completed on J0 in 2.78s, 19 tests
[smoker] [junit4]
[smoker] [junit4] Suite: org.apache.solr.util.TestRandomMergePolicy
[smoker] [junit4] Completed on J0 in 0.03s, 2 tests
[smoker] [junit4]
[smoker] [junit4] Suite: org.apache.solr.schema.ModifyConfFileTest
[smoker] [junit4] Completed on J1 in 1.66s, 1 test
[smoker] [junit4]
[smoker] [junit4] Suite: org.apache.solr.rest.schema.TestCopyFieldCollectionResource
[smoker] [junit4] Completed on J2 in 6.56s, 5 tests
[smoker] [junit4]
[smoker] [junit4] Suite: org.apache.solr.core.TestNRTOpen
[smoker] [junit4] Completed on J2 in 2.62s, 2 tests
[smoker] [junit4]
[smoker] [junit4] Suite: org.apache.solr.schema.OpenExchangeRatesOrgProviderTest
[smoker] [junit4] Completed on J2 in 0.18s, 5 tests
[smoker] [junit4]
[smoker] [junit4] Suite: org.apache.solr.TestJoin
[smoker] [junit4] Completed on J3 in 9.88s, 2 tests
[smoker] [junit4]
[smoker] [junit4] Suite: org.apache.solr.search.TestSurroundQueryParser
[smoker] [junit4] Completed on J2 in 3.44s, 1 test
[smoker] [junit4]
[smoker] [junit4] Suite: org.apache.solr.spelling.suggest.TestPhraseSuggestions
[smoker] [junit4] Completed on J3 in 3.13s, 1 test
[smoker] [junit4]
[smoker] [junit4] Suite: org.apache.solr.search.TestPseudoReturnFields
[smoker] [junit4] Completed on J2 in 1.83s, 14 tests
[smoker] [junit4]
[smoker] [junit4] Suite: org.apache.solr.core.TestQuerySenderListener
[smoker] [junit4] Completed on J2 in 1.71s, 3 tests
[smoker] [junit4]
[smoker] [junit4] Suite: org.apache.solr.spelling.suggest.SuggesterTSTTest
[smoker] [junit4] Completed on J3 in 3.30s, 4 tests
[smoker] [junit4]
[smoker] [junit4] Suite: org.apache.solr.handler.TestReplicationHandler
[smoker] [junit4] IGNOR/A 0.00s J2 | TestReplicationHandler.doTestIndexAndConfigReplication
[smoker] [junit4] > Assumption #1: 'slow' test group is disabled (@Slow())
[smoker] [junit4] IGNOR/A 0.00s J2 | TestReplicationHandler.testNoWriter
[smoker] [junit4] > Assumption #1: 'slow' test group is disabled (@Slow())
[smoker] [junit4] IGNOR/A 0.00s J2 | TestReplicationHandler.testEmptyCommits
[smoker] [junit4] > Assumption #1: 'slow' test group is disabled (@Slow())
[smoker] [junit4] IGNOR/A 0.00s J2 | TestReplicationHandler.doTestReplicateAfterStartupWithNoActivity
[smoker] [junit4] > Assumption #1: 'slow' test group is disabled (@Slow())
[smoker] [junit4] IGNOR/A 0.00s J2 | TestReplicationHandler.doTestSnapPullWithMasterUrl
[smoker] [junit4] > Assumption #1: 'slow' test group is disabled (@Slow())
[smoker] [junit4] IGNOR/A 0.00s J2 | TestReplicationHandler.doTestRepeater
[smoker] [junit4] > Assumption #1: 'slow' test group is disabled (@Slow())
[smoker] [junit4] IGNOR/A 0.00s J2 | TestReplicationHandler.doTestIndexAndConfigAliasReplication
[smoker] [junit4] > Assumption #1: 'slow' test group is disabled (@Slow())
[smoker] [junit4] IGNOR/A 0.00s J2 | TestReplicationHandler.doTestStressReplication
[smoker] [junit4] > Assumption #1: 'slow' test group is disabled (@Slow())
[smoker] [junit4] IGNOR/A 0.00s J2 | TestReplicationHandler.doTestReplicateAfterStartup
[smoker] [junit4] > Assumption #1: 'slow' test group is disabled (@Slow())
[smoker] [junit4] IGNOR/A 0.00s J2 | TestReplicationHandler.testRateLimitedReplication
[smoker] [junit4] > Assumption #1: 'slow' test group is disabled (@Slow())
[smoker] [junit4] IGNOR/A 0.00s J2 | TestReplicationHandler.doTestStopPoll
[smoker] [junit4] > Assumption #1: 'slow' test group is disabled (@Slow())
[smoker] [junit4] IGNOR/A 0.00s J2 | TestReplicationHandler.doTestReplicateAfterWrite2Slave
[smoker] [junit4] > Assumption #1: 'slow' test group is disabled (@Slow())
[smoker] [junit4] IGNOR/A 0.00s J2 | TestReplicationHandler.doTestReplicateAfterCoreReload
[smoker] [junit4] > Assumption #1: 'slow' test group is disabled (@Slow())
[smoker] [junit4] IGNOR/A 0.00s J2 | TestReplicationHandler.doTestDetails
[smoker] [junit4] > Assumption #1: 'slow' test group is disabled (@Slow())
[smoker] [junit4] Completed on J2 in 0.03s, 14 tests, 14 skipped
[smoker] [junit4]
[smoker] [junit4] Suite: org.apache.solr.search.TestCustomSort
[smoker] [junit4] Completed on J3 in 1.01s, 1 test
[smoker] [junit4]
[smoker] [junit4] Suite: org.apache.solr.request.TestRemoteStreaming
[smoker] [junit4] Completed on J2 in 6.51s, 4 tests
[smoker] [junit4]
[smoker] [junit4] Suite: org.apache.solr.TestHighlightDedupGrouping
[smoker] [junit4] Completed on J0 in 23.73s, 1 test
[smoker] [junit4]
[smoker] [junit4] Suite: org.apache.solr.schema.PolyFieldTest
[smoker] [junit4] Completed on J2 in 2.12s, 4 tests
[smoker] [junit4]
[smoker] [junit4] Suite: org.apache.solr.cloud.CustomCollectionTest
[smoker] [junit4] IGNOR/A 0.00s J2 | CustomCollectionTest.testDistribSearch
[smoker] [junit4] > Assumption #1: 'slow' test group is disabled (@Slow())
[smoker] [junit4] Completed on J2 in 0.01s, 1 test, 1 skipped
[smoker] [junit4]
[smoker] [junit4] Suite: org.apache.solr.update.processor.DocExpirationUpdateProcessorFactoryTest
[smoker] [junit4] Completed on J3 in 7.90s, 5 tests
[smoker] [junit4]
[smoker] [junit4] Suite: org.apache.solr.util.TimeZoneUtilsTest
[smoker] [junit4] Completed on J3 in 0.21s, 5 tests
[smoker] [junit4]
[smoker] [junit4] Suite: org.apache.solr.internal.csv.CSVUtilsTest
[smoker] [junit4] Completed on J3 in 0.14s, 14 tests
[smoker] [junit4]
[smoker] [junit4] Suite: org.apache.solr.core.TestSolrXmlPersistor
[smoker] [junit4] Completed on J3 in 0.36s, 7 tests
[smoker] [junit4]
[smoker] [junit4] Suite: org.apache.solr.schema.TestBulkSchemaConcurrent
[smoker] [junit4] IGNOR/A 0.00s J3 | TestBulkSchemaConcurrent.testDistribSearch
[smoker] [junit4] > Assumption #1: 'slow' test group is disabled (@Slow())
[smoker] [junit4] Completed on J3 in 0.01s, 1 test, 1 skipped
[smoker] [junit4]
[smoker] [junit4] Suite: org.apache.solr.update.processor.PreAnalyzedUpdateProcessorTest
[smoker] [junit4] Completed on J0 in 4.55s, 2 tests
[smoker] [junit4]
[smoker] [junit4] Suite: org.apache.solr.spelling.WordBreakSolrSpellCheckerTest
[smoker] [junit4] Completed on J3 in 3.65s, 3 tests
[smoker] [junit4]
[smoker] [junit4] Suite: org.apache.solr.search.TestSearchPerf
[smoker] [junit4] Completed on J3 in 1.33s, 1 test
[smoker] [junit4]
[smoker] [junit4] Suite: org.apache.solr.handler.DocumentAnalysisRequestHandlerTest
[smoker] [junit4] Completed on J3 in 2.20s, 4 tests
[smoker] [junit4]
[smoker] [junit4] Suite: org.apache.solr.handler.TestCSVLoader
[smoker] [junit4] Completed on J3 in 2.38s, 6 tests
[smoker] [junit4]
[smoker] [junit4] Suite: org.apache.solr.internal.csv.CSVParserTest
[smoker] [junit4] Completed on J3 in 0.02s, 23 tests
[smoker] [junit4]
[smoker] [junit4] Suite: org.apache.solr.schema.TestCloudManagedSchema
[smoker] [junit4] IGNOR/A 0.00s J3 | TestCloudManagedSchema.testDistribSearch
[smoker] [junit4] > Assumption #1: 'slow' test group is disabled (@Slow())
[smoker] [junit4] Completed on J3 in 0.00s, 1 test, 1 skipped
[smoker] [junit4]
[smoker] [junit4] Suite: org.apache.solr.cloud.MigrateRouteKeyTest
[smoker] [junit4] IGNOR/A 0.00s J3 | MigrateRouteKeyTest.testDistribSearch
[smoker] [junit4] > Assumption #1: 'slow' test group is disabled (@Slow())
[smoker] [junit4] Completed on J3 in 0.01s, 1 test, 1 skipped
[smoker] [junit4]
[smoker] [junit4] Suite: org.apache.solr.cloud.hdfs.HdfsBasicDistributedZkTest
[smoker] [junit4] IGNOR/A 0.00s J3 | HdfsBasicDistributedZkTest.testDistribSearch
[smoker] [junit4] > Assumption #1: 'nightly' test group is disabled (@Nightly(value=))
[smoker] [junit4] Completed on J3 in 0.00s, 1 test, 1 skipped
[smoker] [junit4]
[smoker] [junit4] Suite: org.apache.solr.handler.component.DistributedFacetPivotLongTailTest
[smoker] [junit4] Completed on J1 in 38.63s, 1 test
[smoker] [junit4]
[smoker] [junit4] Suite: org.apache.solr.core.TestBadConfig
[smoker] [junit4] IGNOR/A 0.16s J3 | TestBadConfig.testMissingScriptFile
[smoker] [junit4] > Assumption #1: got: <[null]>, expected: each not null
[smoker] [junit4] IGNOR/A 0.02s J3 | TestBadConfig.testInvalidScriptFile
[smoker] [junit4] > Assumption #1: got: <[null]>, expected: each not null
[smoker] [junit4] Completed on J3 in 5.44s, 13 tests, 2 skipped
[smoker] [junit4]
[smoker] [junit4] Suite: org.apache.solr.search.TestLFUCache
[smoker] [junit4] Completed on J1 in 1.66s, 5 tests
[smoker] [junit4]
[smoker] [junit4] Suite: org.apache.solr.spelling.suggest.TestBlendedInfixSuggestions
[smoker] [junit4] Completed on J1 in 1.25s, 3 tests
[smoker] [junit4]
[smoker] [junit4] Suite: org.apache.solr.search.similarities.TestBM25SimilarityFactory
[smoker] [junit4] Completed on J1 in 0.57s, 2 tests
[smoker] [junit4]
[smoker] [junit4] Suite: org.apache.solr.core.TestCoreContainer
[smoker] [junit4] Completed on J0 in 20.05s, 9 tests
[smoker] [junit4]
[smoker] [junit4] Suite: org.apache.solr.cloud.hdfs.HdfsWriteToMultipleCollectionsTest
[smoker] [junit4] IGNOR/A 0.00s J0 | HdfsWriteToMultipleCollectionsTest.testDistribSearch
[smoker] [junit4] > Assumption #1: 'nightly' test group is disabled (@Nightly())
[smoker] [junit4] Completed on J0 in 0.01s, 1 test, 1 skipped
[smoker] [junit4]
[smoker] [junit4] Suite: org.apache.solr.core.TestSolrXmlPersistence
[smoker] [junit4] Completed on J0 in 7.68s, 8 tests
[smoker] [junit4]
[smoker] [junit4] Suite: org.apache.solr.cloud.VMParamsZkACLAndCredentialsProvidersTest
[smoker] [junit4] Completed on J0 in 4.23s, 4 tests
[smoker] [junit4]
[smoker] [junit4] Suite: org.apache.solr.handler.component.DistributedQueryComponentCustomSortTest
[smoker] [junit4] Completed on J1 in 23.32s, 1 test
[smoker] [junit4]
[smoker] [junit4] Suite: org.apache.solr.internal.csv.writer.CSVWriterTest
[smoker] [junit4] Completed on J1 in 0.08s, 2 tests
[smoker] [junit4]
[smoker] [junit4] Suite: org.apache.solr.schema.DateFieldTest
[smoker] [junit4] Completed on J1 in 3.34s, 7 tests, 1 skipped
[smoker] [junit4]
[smoker] [junit4] Suite: org.apache.solr.search.TestOverriddenPrefixQueryForCustomFieldType
[smoker] [junit4] Completed on J1 in 0.64s, 2 tests
[smoker] [junit4]
[smoker] [junit4] Suite: org.apache.solr.cloud.FullSolrCloudDistribCmdsTest
[smoker] [junit4] IGNOR/A 0.00s J1 | FullSolrCloudDistribCmdsTest.testDistribSearch
[smoker] [junit4] > Assumption #1: 'slow' test group is disabled (@Slow())
[smoker] [junit4] Completed on J1 in 0.01s, 1 test, 1 skipped
[smoker] [junit4]
[smoker] [junit4] Suite: org.apache.solr.rest.schema.TestManagedSchemaFieldTypeResource
[smoker] [junit4] Completed on J0 in 10.34s, 1 test
[smoker] [junit4]
[smoker] [junit4] Suite: org.apache.solr.cloud.TestMiniSolrCloudCluster
[smoker] [junit4] Completed on J2 in 46.95s, 1 test
[smoker] [junit4]
[smoker] [junit4] Suite: org.apache.solr.cloud.hdfs.HdfsRecoveryZkTest
[smoker] [junit4] IGNOR/A 0.00s J2 | HdfsRecoveryZkTest.testDistribSearch
[smoker] [junit4] > Assumption #1: 'slow' test group is disabled (@Slow())
[smoker] [junit4] Completed on J2 in 0.01s, 1 test, 1 skipped
[smoker] [junit4]
[smoker] [junit4] Suite: org.apache.solr.handler.component.BadComponentTest
[smoker] [junit4] Completed on J0 in 1.80s, 1 test
[smoker] [junit4]
[smoker] [junit4] Suite: org.apache.solr.schema.CurrencyFieldXmlFileTest
[smoker] [junit4] Completed on J2 in 3.49s, 11 tests, 1 skipped
[smoker] [junit4]
[smoker] [junit4] Suite: org.apache.solr.search.function.distance.DistanceFunctionTest
[smoker] [junit4] Completed on J0 in 2.33s, 3 tests
[smoker] [junit4]
[smoker] [junit4] Suite: org.apache.solr.cloud.ChaosMonkeyNothingIsSafeTest
[smoker] [junit4] IGNOR/A 0.00s J0 | ChaosMonkeyNothingIsSafeTest.testDistribSearch
[smoker] [junit4] > Assumption #1: 'slow' test group is disabled (@Slow())
[smoker] [junit4] Completed on J0 in 0.01s, 1 test, 1 skipped
[smoker] [junit4]
[smoker] [junit4] Suite: org.apache.solr.handler.MoreLikeThisHandlerTest
[smoker] [junit4] Completed on J0 in 2.19s, 1 test
[smoker] [junit4]
[smoker] [junit4] Suite: org.apache.solr.cloud.AssignTest
[smoker] [junit4] Completed on J0 in 0.15s, 1 test
[smoker] [junit4]
[smoker] [junit4] Suite: org.apache.solr.handler.XsltUpdateRequestHandlerTest
[smoker] [junit4] Completed on J2 in 2.52s, 2 tests
[smoker] [junit4]
[smoker] [junit4] Suite: org.apache.solr.schema.TestCollationFieldDocValues
[smoker] [junit4] Completed on J0 in 1.51s, 8 tests
[smoker] [junit4]
[smoker] [junit4] Suite: org.apache.solr.TestRandomFaceting
[smoker] [junit4] IGNOR/A 0.00s J0 | TestRandomFaceting.testRandomFaceting
[smoker] [junit4] > Assumption #1: 'slow' test group is disabled (@Slow())
[smoker] [junit4] Completed on J0 in 0.01s, 1 test, 1 skipped
[smoker] [junit4]
[smoker] [junit4] Suite: org.apache.solr.core.TestShardHandlerFactory
[smoker] [junit4] Completed on J0 in 0.79s, 2 tests
[smoker] [junit4]
[smoker] [junit4] Suite: org.apache.solr.cloud.DeleteShardTest
[smoker] [junit4] IGNOR/A 0.00s J0 | DeleteShardTest.testDistribSearch
[smoker] [junit4] > Assumption #1: 'slow' test group is disabled (@Slow())
[smoker] [junit4] Completed on J0 in 0.00s, 1 test, 1 skipped
[smoker] [junit4]
[smoker] [junit4] Suite: org.apache.solr.request.TestBinaryResponseWriter
[smoker] [junit4] Completed on J0 in 1.29s, 2 tests
[smoker] [junit4]
[smoker] [junit4] Suite: org.apache.solr.core.OpenCloseCoreStressTest
[smoker] [junit4] IGNOR/A 0.00s J1 | OpenCloseCoreStressTest.test15SecondsOld
[smoker] [junit4] > Assumption #1: 'nightly' test group is disabled (@Nightly())
[smoker] [junit4] IGNOR/A 0.01s J1 | OpenCloseCoreStressTest.test1HourNew
[smoker] [junit4] > Assumption #1: 'weekly' test group is disabled (@Weekly())
[smoker] [junit4] IGNOR/A 0.01s J1 | OpenCloseCoreStressTest.test1HourOld
[smoker] [junit4] > Assumption #1: 'weekly' test group is disabled (@Weekly())
[smoker] [junit4] IGNOR/A 0.00s J1 | OpenCloseCoreStressTest.test10MinutesOld
[smoker] [junit4] > Assumption #1: 'nightly' test group is disabled (@Nightly())
[smoker] [junit4] IGNOR/A 0.00s J1 | OpenCloseCoreStressTest.test15SecondsNew
[smoker] [junit4] > Assumption #1: 'nightly' test group is disabled (@Nightly())
[smoker] [junit4] IGNOR/A 0.00s J1 | OpenCloseCoreStressTest.test10MinutesNew
[smoker] [junit4] > Assumption #1: 'nightly' test group is disabled (@Nightly())
[smoker] [junit4] Completed on J1 in 10.83s, 7 tests, 6 skipped
[smoker] [junit4]
[smoker] [junit4] Suite: org.apache.solr.request.TestWriterPerf
[smoker] [junit4] Completed on J0 in 1.88s, 1 test
[smoker] [junit4]
[smoker] [junit4] Suite: org.apache.solr.core.TestInfoStreamLogging
[smoker] [junit4] Completed on J1 in 1.57s, 1 test
[smoker] [junit4]
[smoker] [junit4] Suite: org.apache.solr.cloud.SharedFSAutoReplicaFailoverUtilsTest
[smoker] [junit4] Completed on J0 in 0.13s, 8 tests
[smoker] [junit4]
[smoker] [junit4] Suite: org.apache.solr.rest.schema.TestSchemaNameResource
[smoker] [junit4] Completed on J2 in 6.65s, 1 test
[smoker] [junit4]
[smoker] [junit4] Suite: org.apache.solr.cloud.BasicDistributedZk2Test
[smoker] [junit4] IGNOR/A 0.00s J2 | BasicDistributedZk2Test.testDistribSearch
[smoker] [junit4] > Assumption #1: 'slow' test group is disabled (@Slow())
[smoker] [junit4] Completed on J2 in 0.01s, 1 test, 1 skipped
[smoker] [junit4]
[smoker] [junit4] Suite: org.apache.solr.cloud.ZkNodePropsTest
[smoker] [junit4] Completed on J2 in 0.03s, 1 test
[smoker] [junit4]
[smoker] [junit4] Suite: org.apache.solr.search.AnalyticsQueryTest
[smoker] [junit4] Completed on J1 in 1.69s, 1 test
[smoker] [junit4]
[smoker] [junit4] Suite: org.apache.solr.request.JSONWriterTest
[smoker] [junit4] Completed on J1 in 1.29s, 3 tests
[smoker] [junit4]
[smoker] [junit4] Suite: org.apache.solr.ConvertedLegacyTest
[smoker] [junit4] Completed on J0 in 3.20s, 1 test
[smoker] [junit4]
[smoker] [junit4] Suite: org.apache.solr.cloud.CloudExitableDirectoryReaderTest
[smoker] [junit4] IGNOR/A 0.00s J0 | CloudExitableDirectoryReaderTest.testDistribSearch
[smoker] [junit4] > Assumption #1: 'slow' test group is disabled (@Slow())
[smoker] [junit4] Completed on J0 in 0.01s, 1 test, 1 skipped
[smoker] [junit4]
[smoker] [junit4] Suite: org.apache.solr.schema.PrimitiveFieldTypeTest
[smoker] [junit4] Completed on J1 in 0.95s, 1 test
[smoker] [junit4]
[smoker] [junit4] Suite: org.apache.solr.cloud.DeleteReplicaTest
[smoker] [junit4] IGNOR/A 0.00s J1 | DeleteReplicaTest.testDistribSearch
[smoker] [junit4] > Assumption #1: 'slow' test group is disabled (@Slow())
[smoker] [junit4] Completed on J1 in 0.00s, 1 test, 1 skipped
[smoker] [junit4]
[smoker] [junit4] Suite: org.apache.solr.core.TestCodecSupport
[smoker] [junit4] Completed on J1 in 0.79s, 4 tests
[smoker] [junit4]
[smoker] [junit4] Suite: org.apache.solr.analysis.TestWordDelimiterFilterFactory
[smoker] [junit4] Completed on J0 in 1.97s, 7 tests
[smoker] [junit4]
[smoker] [junit4] Suite: org.apache.solr.update.processor.DefaultValueUpdateProcessorTest
[smoker] [junit4] Completed on J2 in 4.20s, 1 test
[smoker] [junit4]
[smoker] [junit4] Suite: org.apache.solr.core.QueryResultKeyTest
[smoker] [junit4] Completed on J2 in 0.65s, 4 tests
[smoker] [junit4]
[smoker] [junit4] Suite: org.apache.solr.update.processor.SignatureUpdateProcessorFactoryTest
[smoker] [junit4] Completed on J1 in 2.37s, 6 tests
[smoker] [junit4]
[smoker] [junit4] Suite: org.apache.solr.update.processor.UpdateRequestProcessorFactoryTest
[smoker] [junit4] Completed on J2 in 1.93s, 2 tests
[smoker] [junit4]
[smoker] [junit4] Suite: org.apache.solr.handler.admin.MBeansHandlerTest
[smoker] [junit4] Completed on J1 in 1.69s, 1 test
[smoker] [junit4]
[smoker] [junit4] Suite: org.apache.solr.update.processor.URLClassifyProcessorTest
[smoker] [junit4] Completed on J1 in 0.53s, 7 tests
[smoker] [junit4]
[smoker] [junit4] Suite: org.apache.solr.search.TestElisionMultitermQuery
[smoker] [junit4] Completed on J2 in 1.33s, 1 test
[smoker] [junit4]
[smoker] [junit4] Suite: org.apache.solr.core.TestConfigSets
[smoker] [junit4] Completed on J2 in 1.33s, 4 tests
[smoker] [junit4]
[smoker] [junit4] Suite: org.apache.solr.store.hdfs.HdfsLockFactoryTest
[smoker] [junit4] Completed on J2 in 0.05s, 1 test, 1 skipped
[smoker] [junit4]
[smoker] [junit4] Suite: org.apache.solr.handler.component.SuggestComponentTest
[smoker] [junit4] Completed on J0 in 5.48s, 7 tests
[smoker] [junit4]
[smoker] [junit4] Suite: org.apache.solr.search.ReturnFieldsTest
[smoker] [junit4] Completed on J0 in 1.66s, 12 tests
[smoker] [junit4]
[smoker] [junit4] Suite: org.apache.solr.search.function.TestFunctionQuery
[smoker] [junit4] Completed on J1 in 3.76s, 15 tests
[smoker] [junit4]
[smoker] [junit4] Suite: org.apache.solr.handler.admin.SystemInfoHandlerTest
[smoker] [junit4] Completed on J1 in 0.02s, 1 test
[smoker] [junit4]
[smoker] [junit4] Suite: org.apache.solr.AnalysisAfterCoreReloadTest
[smoker] [junit4] Completed on J2 in 3.25s, 1 test
[smoker] [junit4]
[smoker] [junit4] Suite: org.apache.solr.core.TestJmxIntegration
[smoker] [junit4] Completed on J0 in 2.23s, 3 tests, 1 skipped
[smoker] [junit4]
[smoker] [junit4] Suite: org.apache.solr.update.processor.UUIDUpdateProcessorFallbackTest
[smoker] [junit4] Completed on J0 in 1.32s, 1 test
[smoker] [junit4]
[smoker] [junit4] Suite: org.apache.solr.update.TestAtomicUpdateErrorCases
[smoker] [junit4] Completed on J1 in 2.89s, 2 tests
[smoker] [junit4]
[smoker] [junit4] Suite: org.apache.solr.util.TestUtils
[smoker] [junit4] Completed on J0 in 0.03s, 5 tests
[smoker] [junit4]
[smoker] [junit4] Suite: org.apache.solr.schema.SynonymTokenizerTest
[smoker] [junit4] Completed on J0 in 0.68s, 1 test
[smoker] [junit4]
[smoker] [junit4] Suite: org.apache.solr.update.TestExceedMaxTermLength
[smoker] [junit4] Completed on J0 in 1.10s, 2 tests
[smoker] [junit4]
[smoker] [jun
[...truncated too long message...]
unit4] Completed on J0 in 6.52s, 7 tests
[smoker] [junit4]
[smoker] [junit4] Suite: org.apache.solr.handler.component.DistributedFacetPivotLargeTest
[smoker] [junit4] Completed on J1 in 39.67s, 1 test
[smoker] [junit4]
[smoker] [junit4] Suite: org.apache.solr.rest.schema.TestSerializedLuceneMatchVersion
[smoker] [junit4] Completed on J0 in 5.85s, 2 tests
[smoker] [junit4]
[smoker] [junit4] Suite: org.apache.solr.rest.schema.TestSchemaResource
[smoker] [junit4] Completed on J2 in 6.63s, 3 tests
[smoker] [junit4]
[smoker] [junit4] Suite: org.apache.solr.rest.schema.TestUniqueKeyFieldResource
[smoker] [junit4] Completed on J1 in 5.97s, 1 test
[smoker] [junit4]
[smoker] [junit4] Suite: org.apache.solr.schema.BadCopyFieldTest
[smoker] [junit4] Completed on J2 in 0.90s, 5 tests
[smoker] [junit4]
[smoker] [junit4] Suite: org.apache.solr.schema.EnumFieldTest
[smoker] [junit4] Completed on J2 in 0.60s, 6 tests
[smoker] [junit4]
[smoker] [junit4] Suite: org.apache.solr.schema.DocValuesMissingTest
[smoker] [junit4] Completed on J1 in 2.40s, 58 tests
[smoker] [junit4]
[smoker] [junit4] Suite: org.apache.solr.rest.schema.analysis.TestManagedSynonymFilterFactory
[smoker] [junit4] Completed on J0 in 14.95s, 2 tests
[smoker] [junit4]
[smoker] [junit4] Suite: org.apache.solr.schema.TestManagedSchema
[smoker] [junit4] Completed on J2 in 17.20s, 14 tests
[smoker] [junit4]
[smoker] [junit4] Suite: org.apache.solr.search.CursorMarkTest
[smoker] [junit4] Completed on J0 in 5.03s, 4 tests
[smoker] [junit4]
[smoker] [junit4] Suite: org.apache.solr.search.TestAddFieldRealTimeGet
[smoker] [junit4] Completed on J0 in 0.89s, 1 test
[smoker] [junit4]
[smoker] [junit4] Suite: org.apache.solr.search.RankQueryTest
[smoker] [junit4] Completed on J2 in 1.77s, 1 test
[smoker] [junit4]
[smoker] [junit4] Suite: org.apache.solr.search.TestFieldSortValues
[smoker] [junit4] Completed on J2 in 2.14s, 1 test
[smoker] [junit4]
[smoker] [junit4] Suite: org.apache.solr.search.TestComplexPhraseQParserPlugin
[smoker] [junit4] Completed on J0 in 2.49s, 6 tests
[smoker] [junit4]
[smoker] [junit4] Suite: org.apache.solr.search.TestInitQParser
[smoker] [junit4] Completed on J2 in 1.45s, 1 test
[smoker] [junit4]
[smoker] [junit4] Suite: org.apache.solr.search.TestMaxScoreQueryParser
[smoker] [junit4] Completed on J0 in 1.74s, 6 tests
[smoker] [junit4]
[smoker] [junit4] Suite: org.apache.solr.search.TestNoOpRegenerator
[smoker] [junit4] Completed on J0 in 0.71s, 1 test
[smoker] [junit4]
[smoker] [junit4] Suite: org.apache.solr.search.TestReRankQParserPlugin
[smoker] [junit4] Completed on J0 in 1.86s, 2 tests
[smoker] [junit4]
[smoker] [junit4] Suite: org.apache.solr.search.AnalyticsMergeStrategyTest
[smoker] [junit4] Completed on J1 in 25.34s, 1 test
[smoker] [junit4]
[smoker] [junit4] Suite: org.apache.solr.search.TestRecoveryHdfs
[smoker] [junit4] Completed on J0 in 0.05s, 10 tests, 10 skipped
[smoker] [junit4]
[smoker] [junit4] Suite: org.apache.solr.search.TestStandardQParsers
[smoker] [junit4] Completed on J0 in 0.01s, 1 test
[smoker] [junit4]
[smoker] [junit4] Suite: org.apache.solr.search.TestMissingGroups
[smoker] [junit4] Completed on J2 in 3.61s, 1 test
[smoker] [junit4]
[smoker] [junit4] Suite: org.apache.solr.search.function.TestOrdValues
[smoker] [junit4] Completed on J0 in 0.52s, 5 tests
[smoker] [junit4]
[smoker] [junit4] Suite: org.apache.solr.search.TestSearcherReuse
[smoker] [junit4] Completed on J1 in 1.07s, 1 test
[smoker] [junit4]
[smoker] [junit4] Suite: org.apache.solr.search.similarities.TestNonDefinedSimilarityFactory
[smoker] [junit4] Completed on J0 in 1.27s, 3 tests
[smoker] [junit4]
[smoker] [junit4] Suite: org.apache.solr.search.join.BJQParserTest
[smoker] [junit4] Completed on J2 in 2.08s, 9 tests
[smoker] [junit4]
[smoker] [junit4] Suite: org.apache.solr.store.blockcache.BlockCacheTest
[smoker] [junit4] Completed on J2 in 1.20s, 2 tests
[smoker] [junit4]
[smoker] [junit4] Suite: org.apache.solr.spelling.suggest.TestHighFrequencyDictionaryFactory
[smoker] [junit4] Completed on J0 in 1.86s, 1 test
[smoker] [junit4]
[smoker] [junit4] Suite: org.apache.solr.store.hdfs.HdfsDirectoryTest
[smoker] [junit4] Completed on J0 in 0.03s, 4 tests, 4 skipped
[smoker] [junit4]
[smoker] [junit4] Suite: org.apache.solr.update.AddBlockUpdateTest
[smoker] [junit4] Completed on J0 in 1.93s, 6 tests
[smoker] [junit4]
[smoker] [junit4] Suite: org.apache.solr.servlet.ResponseHeaderTest
[smoker] [junit4] Completed on J1 in 6.17s, 5 tests
[smoker] [junit4]
[smoker] [junit4] Suite: org.apache.solr.update.processor.ParsingFieldUpdateProcessorsTest
[smoker] [junit4] Completed on J1 in 5.15s, 33 tests
[smoker] [junit4]
[smoker] [junit4] Suite: org.apache.solr.update.processor.AddSchemaFieldsUpdateProcessorFactoryTest
[smoker] [junit4] Completed on J0 in 6.28s, 6 tests
[smoker] [junit4]
[smoker] [junit4] Suite: org.apache.solr.store.blockcache.BlockDirectoryTest
[smoker] [junit4] Completed on J2 in 10.04s, 4 tests
[smoker] [junit4]
[smoker] [junit4] Suite: org.apache.solr.rest.schema.TestManagedSchemaFieldResource
[smoker] [junit4] Completed on J3 in 70.72s, 10 tests
[smoker] [junit4]
[smoker] [junit4]
[smoker] [junit4] Tests with failures:
[smoker] [junit4] - org.apache.solr.SolrInfoMBeanTest.testCallMBeanInfo
[smoker] [junit4]
[smoker] [junit4]
[smoker] [junit4] JVM J0: 2.10 .. 526.06 = 523.96s
[smoker] [junit4] JVM J1: 2.10 .. 525.69 = 523.60s
[smoker] [junit4] JVM J2: 2.10 .. 527.06 = 524.97s
[smoker] [junit4] JVM J3: 1.89 .. 548.32 = 546.43s
[smoker] [junit4] Execution time total: 9 minutes 8 seconds
[smoker] [junit4] Tests summary: 435 suites, 1782 tests, 1 failure, 171 ignored (137 assumptions)
[smoker]
[smoker] BUILD FAILED
[smoker] /usr/home/jenkins/jenkins-slave/workspace/Lucene-Solr-SmokeRelease-trunk/lucene/build/smokeTestRelease/tmp/unpack/solr-6.0.0/solr/build.xml:189: The following error occurred while executing this line:
[smoker] /usr/home/jenkins/jenkins-slave/workspace/Lucene-Solr-SmokeRelease-trunk/lucene/build/smokeTestRelease/tmp/unpack/solr-6.0.0/solr/common-build.xml:496: The following error occurred while executing this line:
[smoker] /usr/home/jenkins/jenkins-slave/workspace/Lucene-Solr-SmokeRelease-trunk/lucene/build/smokeTestRelease/tmp/unpack/solr-6.0.0/lucene/common-build.xml:1359: The following error occurred while executing this line:
[smoker] /usr/home/jenkins/jenkins-slave/workspace/Lucene-Solr-SmokeRelease-trunk/lucene/build/smokeTestRelease/tmp/unpack/solr-6.0.0/lucene/common-build.xml:961: There were test failures: 435 suites, 1782 tests, 1 failure, 171 ignored (137 assumptions)
[smoker]
[smoker] Total time: 9 minutes 40 seconds
[smoker]
[smoker]
[smoker] Traceback (most recent call last):
[smoker] File "/usr/home/jenkins/jenkins-slave/workspace/Lucene-Solr-SmokeRelease-trunk/dev-tools/scripts/smokeTestRelease.py", line 1505, in <module>
[smoker] main()
[smoker] File "/usr/home/jenkins/jenkins-slave/workspace/Lucene-Solr-SmokeRelease-trunk/dev-tools/scripts/smokeTestRelease.py", line 1450, in main
[smoker] smokeTest(c.java, c.url, c.revision, c.version, c.tmp_dir, c.is_signed, ' '.join(c.test_args))
[smoker] File "/usr/home/jenkins/jenkins-slave/workspace/Lucene-Solr-SmokeRelease-trunk/dev-tools/scripts/smokeTestRelease.py", line 1495, in smokeTest
[smoker] unpackAndVerify(java, 'solr', tmpDir, 'solr-%s-src.tgz' % version, svnRevision, version, testArgs, baseURL)
[smoker] File "/usr/home/jenkins/jenkins-slave/workspace/Lucene-Solr-SmokeRelease-trunk/dev-tools/scripts/smokeTestRelease.py", line 616, in unpackAndVerify
[smoker] verifyUnpacked(java, project, artifact, unpackPath, svnRevision, version, testArgs, tmpDir, baseURL)
[smoker] File "/usr/home/jenkins/jenkins-slave/workspace/Lucene-Solr-SmokeRelease-trunk/dev-tools/scripts/smokeTestRelease.py", line 734, in verifyUnpacked
[smoker] java.run_java7('ant clean test -Dtests.slow=false %s' % testArgs, '%s/test.log' % unpackPath)
[smoker] File "/usr/home/jenkins/jenkins-slave/workspace/Lucene-Solr-SmokeRelease-trunk/dev-tools/scripts/smokeTestRelease.py", line 1281, in run_java
[smoker] run('%s; %s' % (cmd_prefix, cmd), logfile)
[smoker] File "/usr/home/jenkins/jenkins-slave/workspace/Lucene-Solr-SmokeRelease-trunk/dev-tools/scripts/smokeTestRelease.py", line 541, in run
[smoker] raise RuntimeError('command "%s" failed; see log file %s' % (command, logPath))
[smoker] RuntimeError: command "export JAVA_HOME="/home/jenkins/tools/java/latest1.7" PATH="/home/jenkins/tools/java/latest1.7/bin:$PATH" JAVACMD="/home/jenkins/tools/java/latest1.7/bin/java"; ant clean test -Dtests.slow=false -Dtests.jettyConnector=Socket -Dtests.disableHdfs=true -Dtests.multiplier=1 -Dtests.slow=false" failed; see log file /usr/home/jenkins/jenkins-slave/workspace/Lucene-Solr-SmokeRelease-trunk/lucene/build/smokeTestRelease/tmp/unpack/solr-6.0.0/test.log
BUILD FAILED
/usr/home/jenkins/jenkins-slave/workspace/Lucene-Solr-SmokeRelease-trunk/build.xml:409: exec returned: 1
Total time: 63 minutes 14 seconds
Build step 'Invoke Ant' marked build as failure
Email was triggered for: Failure
Sending email for trigger: Failure
[JENKINS] Lucene-Solr-SmokeRelease-trunk - Build # 208 - Still
Failing
Posted by Apache Jenkins Server <je...@builds.apache.org>.
Build: https://builds.apache.org/job/Lucene-Solr-SmokeRelease-trunk/208/
No tests ran.
Build Log:
[...truncated 50832 lines...]
prepare-release-no-sign:
[mkdir] Created dir: /usr/home/jenkins/jenkins-slave/workspace/Lucene-Solr-SmokeRelease-trunk/lucene/build/smokeTestRelease/dist
[copy] Copying 446 files to /usr/home/jenkins/jenkins-slave/workspace/Lucene-Solr-SmokeRelease-trunk/lucene/build/smokeTestRelease/dist/lucene
[copy] Copying 245 files to /usr/home/jenkins/jenkins-slave/workspace/Lucene-Solr-SmokeRelease-trunk/lucene/build/smokeTestRelease/dist/solr
[smoker] Java 1.7 JAVA_HOME=/home/jenkins/tools/java/latest1.7
[smoker] NOTE: output encoding is US-ASCII
[smoker]
[smoker] Load release URL "file:/usr/home/jenkins/jenkins-slave/workspace/Lucene-Solr-SmokeRelease-trunk/lucene/build/smokeTestRelease/dist/"...
[smoker]
[smoker] Test Lucene...
[smoker] test basics...
[smoker] get KEYS
[smoker] 0.1 MB in 0.01 sec (11.6 MB/sec)
[smoker] check changes HTML...
[smoker] download lucene-6.0.0-src.tgz...
[smoker] 27.6 MB in 0.04 sec (652.2 MB/sec)
[smoker] verify md5/sha1 digests
[smoker] download lucene-6.0.0.tgz...
[smoker] 61.0 MB in 0.14 sec (427.9 MB/sec)
[smoker] verify md5/sha1 digests
[smoker] download lucene-6.0.0.zip...
[smoker] 70.5 MB in 0.11 sec (663.4 MB/sec)
[smoker] verify md5/sha1 digests
[smoker] unpack lucene-6.0.0.tgz...
[smoker] verify JAR metadata/identity/no javax.* or java.* classes...
[smoker] test demo with 1.7...
[smoker] got 5571 hits for query "lucene"
[smoker] checkindex with 1.7...
[smoker] check Lucene's javadoc JAR
[smoker] unpack lucene-6.0.0.zip...
[smoker] verify JAR metadata/identity/no javax.* or java.* classes...
[smoker] test demo with 1.7...
[smoker] got 5571 hits for query "lucene"
[smoker] checkindex with 1.7...
[smoker] check Lucene's javadoc JAR
[smoker] unpack lucene-6.0.0-src.tgz...
[smoker] make sure no JARs/WARs in src dist...
[smoker] run "ant validate"
[smoker] run tests w/ Java 7 and testArgs='-Dtests.jettyConnector=Socket -Dtests.disableHdfs=true -Dtests.multiplier=1 -Dtests.slow=false'...
[smoker] test demo with 1.7...
[smoker] got 217 hits for query "lucene"
[smoker] checkindex with 1.7...
[smoker] generate javadocs w/ Java 7...
[smoker]
[smoker] Crawl/parse...
[smoker]
[smoker] Verify...
[smoker] confirm all releases have coverage in TestBackwardsCompatibility
[smoker] find all past Lucene releases...
[smoker] run TestBackwardsCompatibility..
[smoker] success!
[smoker]
[smoker] Test Solr...
[smoker] test basics...
[smoker] get KEYS
[smoker] 0.1 MB in 0.00 sec (82.0 MB/sec)
[smoker] check changes HTML...
[smoker] download solr-6.0.0-src.tgz...
[smoker] 33.8 MB in 0.04 sec (884.6 MB/sec)
[smoker] verify md5/sha1 digests
[smoker] download solr-6.0.0.tgz...
[smoker] 115.8 MB in 0.59 sec (195.3 MB/sec)
[smoker] verify md5/sha1 digests
[smoker] download solr-6.0.0.zip...
[smoker] 121.9 MB in 0.18 sec (683.8 MB/sec)
[smoker] verify md5/sha1 digests
[smoker] unpack solr-6.0.0.tgz...
[smoker] verify JAR metadata/identity/no javax.* or java.* classes...
[smoker] unpack lucene-6.0.0.tgz...
[smoker] **WARNING**: skipping check of /usr/home/jenkins/jenkins-slave/workspace/Lucene-Solr-SmokeRelease-trunk/lucene/build/smokeTestRelease/tmp/unpack/solr-6.0.0/contrib/dataimporthandler-extras/lib/javax.mail-1.5.1.jar: it has javax.* classes
[smoker] **WARNING**: skipping check of /usr/home/jenkins/jenkins-slave/workspace/Lucene-Solr-SmokeRelease-trunk/lucene/build/smokeTestRelease/tmp/unpack/solr-6.0.0/contrib/dataimporthandler-extras/lib/activation-1.1.1.jar: it has javax.* classes
[smoker] verify WAR metadata/contained JAR identity/no javax.* or java.* classes...
[smoker] unpack lucene-6.0.0.tgz...
[smoker] copying unpacked distribution for Java 7 ...
[smoker] test solr example w/ Java 7...
[smoker] start Solr instance (log=/usr/home/jenkins/jenkins-slave/workspace/Lucene-Solr-SmokeRelease-trunk/lucene/build/smokeTestRelease/tmp/unpack/solr-6.0.0-java7/solr-example.log)...
[smoker] startup done
[smoker] test utf8...
[smoker] index example docs...
[smoker] run query...
[smoker] stop server (SIGINT)...
[smoker] unpack solr-6.0.0.zip...
[smoker] verify JAR metadata/identity/no javax.* or java.* classes...
[smoker] unpack lucene-6.0.0.tgz...
[smoker] **WARNING**: skipping check of /usr/home/jenkins/jenkins-slave/workspace/Lucene-Solr-SmokeRelease-trunk/lucene/build/smokeTestRelease/tmp/unpack/solr-6.0.0/contrib/dataimporthandler-extras/lib/activation-1.1.1.jar: it has javax.* classes
[smoker] **WARNING**: skipping check of /usr/home/jenkins/jenkins-slave/workspace/Lucene-Solr-SmokeRelease-trunk/lucene/build/smokeTestRelease/tmp/unpack/solr-6.0.0/contrib/dataimporthandler-extras/lib/javax.mail-1.5.1.jar: it has javax.* classes
[smoker] verify WAR metadata/contained JAR identity/no javax.* or java.* classes...
[smoker] unpack lucene-6.0.0.tgz...
[smoker] copying unpacked distribution for Java 7 ...
[smoker] test solr example w/ Java 7...
[smoker] start Solr instance (log=/usr/home/jenkins/jenkins-slave/workspace/Lucene-Solr-SmokeRelease-trunk/lucene/build/smokeTestRelease/tmp/unpack/solr-6.0.0-java7/solr-example.log)...
[smoker] startup done
[smoker] test utf8...
[smoker] index example docs...
[smoker] run query...
[smoker] stop server (SIGINT)...
[smoker] unpack solr-6.0.0-src.tgz...
[smoker] make sure no JARs/WARs in src dist...
[smoker] run "ant validate"
[smoker] run tests w/ Java 7 and testArgs='-Dtests.jettyConnector=Socket -Dtests.disableHdfs=true -Dtests.multiplier=1 -Dtests.slow=false'...
[smoker]
[smoker] command "export JAVA_HOME="/home/jenkins/tools/java/latest1.7" PATH="/home/jenkins/tools/java/latest1.7/bin:$PATH" JAVACMD="/home/jenkins/tools/java/latest1.7/bin/java"; ant clean test -Dtests.slow=false -Dtests.jettyConnector=Socket -Dtests.disableHdfs=true -Dtests.multiplier=1 -Dtests.slow=false" failed:
[smoker] Buildfile: /usr/home/jenkins/jenkins-slave/workspace/Lucene-Solr-SmokeRelease-trunk/lucene/build/smokeTestRelease/tmp/unpack/solr-6.0.0/solr/build.xml
[smoker]
[smoker] clean:
[smoker] [delete] Deleting directory /usr/home/jenkins/jenkins-slave/workspace/Lucene-Solr-SmokeRelease-trunk/lucene/build/smokeTestRelease/tmp/unpack/solr-6.0.0/solr/build
[smoker]
[smoker] ivy-availability-check:
[smoker]
[smoker] ivy-fail:
[smoker]
[smoker] ivy-configure:
[smoker] [ivy:configure] :: Apache Ivy 2.3.0 - 20130110142753 :: http://ant.apache.org/ivy/ ::
[smoker] [ivy:configure] :: loading settings :: file = /usr/home/jenkins/jenkins-slave/workspace/Lucene-Solr-SmokeRelease-trunk/lucene/build/smokeTestRelease/tmp/unpack/solr-6.0.0/lucene/ivy-settings.xml
[smoker]
[smoker] resolve-groovy:
[smoker] [ivy:cachepath] :: resolving dependencies :: org.codehaus.groovy#groovy-all-caller;working
[smoker] [ivy:cachepath] confs: [default]
[smoker] [ivy:cachepath] found org.codehaus.groovy#groovy-all;2.3.6 in public
[smoker] [ivy:cachepath] :: resolution report :: resolve 162ms :: artifacts dl 4ms
[smoker] ---------------------------------------------------------------------
[smoker] | | modules || artifacts |
[smoker] | conf | number| search|dwnlded|evicted|| number|dwnlded|
[smoker] ---------------------------------------------------------------------
[smoker] | default | 1 | 0 | 0 | 0 || 1 | 0 |
[smoker] ---------------------------------------------------------------------
[smoker]
[smoker] -init-totals:
[smoker] [mkdir] Created dir: /usr/home/jenkins/jenkins-slave/workspace/Lucene-Solr-SmokeRelease-trunk/lucene/build/smokeTestRelease/tmp/unpack/solr-6.0.0/solr/build/solr
[smoker]
[smoker] -clover.load:
[smoker]
[smoker] test-solr-core:
[smoker]
[smoker] test:
[smoker]
[smoker] -clover.disable:
[smoker]
[smoker] ivy-availability-check:
[smoker]
[smoker] ivy-fail:
[smoker]
[smoker] ivy-configure:
[smoker] [ivy:configure] :: loading settings :: file = /usr/home/jenkins/jenkins-slave/workspace/Lucene-Solr-SmokeRelease-trunk/lucene/build/smokeTestRelease/tmp/unpack/solr-6.0.0/lucene/ivy-settings.xml
[smoker]
[smoker] -clover.load:
[smoker]
[smoker] -clover.classpath:
[smoker]
[smoker] -clover.setup:
[smoker]
[smoker] clover:
[smoker]
[smoker] check-analyzers-icu-uptodate:
[smoker]
[smoker] jar-analyzers-icu:
[smoker]
[smoker] -compile-analysis-extras:
[smoker]
[smoker] check-analyzers-icu-uptodate:
[smoker]
[smoker] jar-analyzers-icu:
[smoker]
[smoker] compile-solr-core:
[smoker]
[smoker] compile-solrj:
[smoker]
[smoker] check-lucene-core-uptodate:
[smoker]
[smoker] jar-lucene-core:
[smoker]
[smoker] check-backward-codecs-uptodate:
[smoker]
[smoker] jar-backward-codecs:
[smoker]
[smoker] check-analyzers-phonetic-uptodate:
[smoker]
[smoker] jar-analyzers-phonetic:
[smoker]
[smoker] check-analyzers-kuromoji-uptodate:
[smoker]
[smoker] jar-analyzers-kuromoji:
[smoker]
[smoker] check-codecs-uptodate:
[smoker]
[smoker] jar-codecs:
[smoker]
[smoker] check-expressions-uptodate:
[smoker]
[smoker] jar-expressions:
[smoker]
[smoker] check-suggest-uptodate:
[smoker]
[smoker] jar-suggest:
[smoker]
[smoker] check-highlighter-uptodate:
[smoker]
[smoker] jar-highlighter:
[smoker]
[smoker] check-memory-uptodate:
[smoker]
[smoker] jar-memory:
[smoker]
[smoker] check-misc-uptodate:
[smoker]
[smoker] jar-misc:
[smoker]
[smoker] check-spatial-uptodate:
[smoker]
[smoker] jar-spatial:
[smoker]
[smoker] check-grouping-uptodate:
[smoker]
[smoker] jar-grouping:
[smoker]
[smoker] check-queries-uptodate:
[smoker]
[smoker] jar-queries:
[smoker]
[smoker] check-queryparser-uptodate:
[smoker]
[smoker] jar-queryparser:
[smoker]
[smoker] check-join-uptodate:
[smoker]
[smoker] jar-join:
[smoker]
[smoker] prep-lucene-jars:
[smoker]
[smoker] resolve-example:
[smoker]
[smoker] ivy-availability-check:
[smoker]
[smoker] ivy-fail:
[smoker]
[smoker] ivy-fail:
[smoker]
[smoker] ivy-configure:
[smoker] [ivy:configure] :: loading settings :: file = /usr/home/jenkins/jenkins-slave/workspace/Lucene-Solr-SmokeRelease-trunk/lucene/build/smokeTestRelease/tmp/unpack/solr-6.0.0/lucene/ivy-settings.xml
[smoker]
[smoker] sync-hack:
[smoker]
[smoker] resolve:
[smoker]
[smoker] ivy-availability-check:
[smoker]
[smoker] ivy-fail:
[smoker]
[smoker] ivy-configure:
[smoker] [ivy:configure] :: loading settings :: file = /usr/home/jenkins/jenkins-slave/workspace/Lucene-Solr-SmokeRelease-trunk/lucene/build/smokeTestRelease/tmp/unpack/solr-6.0.0/lucene/ivy-settings.xml
[smoker]
[smoker] resolve:
[smoker]
[smoker] ivy-availability-check:
[smoker]
[smoker] ivy-fail:
[smoker]
[smoker] ivy-fail:
[smoker]
[smoker] ivy-configure:
[smoker] [ivy:configure] :: loading settings :: file = /usr/home/jenkins/jenkins-slave/workspace/Lucene-Solr-SmokeRelease-trunk/lucene/build/smokeTestRelease/tmp/unpack/solr-6.0.0/lucene/ivy-settings.xml
[smoker]
[smoker] resolve:
[smoker]
[smoker] common.init:
[smoker]
[smoker] compile-lucene-core:
[smoker]
[smoker] ivy-availability-check:
[smoker]
[smoker] ivy-fail:
[smoker]
[smoker] ivy-configure:
[smoker] [ivy:configure] :: loading settings :: file = /usr/home/jenkins/jenkins-slave/workspace/Lucene-Solr-SmokeRelease-trunk/lucene/build/smokeTestRelease/tmp/unpack/solr-6.0.0/lucene/ivy-settings.xml
[smoker]
[smoker] resolve:
[smoker]
[smoker] init:
[smoker]
[smoker] -clover.disable:
[smoker]
[smoker] -clover.load:
[smoker]
[smoker] -clover.classpath:
[smoker]
[smoker] -clover.setup:
[smoker]
[smoker] clover:
[smoker]
[smoker] compile-core:
[smoker]
[smoker] init:
[smoker]
[smoker] -clover.disable:
[smoker]
[smoker] -clover.load:
[smoker]
[smoker] -clover.classpath:
[smoker]
[smoker] -clover.setup:
[smoker]
[smoker] clover:
[smoker]
[smoker] common.compile-core:
[smoker] [mkdir] Created dir: /usr/home/jenkins/jenkins-slave/workspace/Lucene-Solr-SmokeRelease-trunk/lucene/build/smokeTestRelease/tmp/unpack/solr-6.0.0/solr/build/solr-solrj/classes/java
[smoker] [javac] Compiling 145 source files to /usr/home/jenkins/jenkins-slave/workspace/Lucene-Solr-SmokeRelease-trunk/lucene/build/smokeTestRelease/tmp/unpack/solr-6.0.0/solr/build/solr-solrj/classes/java
[smoker] [javac] Note: Some input files use or override a deprecated API.
[smoker] [javac] Note: Recompile with -Xlint:deprecation for details.
[smoker] [javac] Note: Some input files use unchecked or unsafe operations.
[smoker] [javac] Note: Recompile with -Xlint:unchecked for details.
[smoker]
[smoker] compile-core:
[smoker]
[smoker] check-lucene-core-uptodate:
[smoker]
[smoker] jar-lucene-core:
[smoker]
[smoker] check-backward-codecs-uptodate:
[smoker]
[smoker] jar-backward-codecs:
[smoker]
[smoker] check-analyzers-phonetic-uptodate:
[smoker]
[smoker] jar-analyzers-phonetic:
[smoker]
[smoker] check-analyzers-kuromoji-uptodate:
[smoker]
[smoker] jar-analyzers-kuromoji:
[smoker]
[smoker] check-codecs-uptodate:
[smoker]
[smoker] jar-codecs:
[smoker]
[smoker] check-expressions-uptodate:
[smoker]
[smoker] jar-expressions:
[smoker]
[smoker] check-suggest-uptodate:
[smoker]
[smoker] jar-suggest:
[smoker]
[smoker] check-highlighter-uptodate:
[smoker]
[smoker] jar-highlighter:
[smoker]
[smoker] check-memory-uptodate:
[smoker]
[smoker] jar-memory:
[smoker]
[smoker] check-misc-uptodate:
[smoker]
[smoker] jar-misc:
[smoker]
[smoker] check-spatial-uptodate:
[smoker]
[smoker] jar-spatial:
[smoker]
[smoker] check-grouping-uptodate:
[smoker]
[smoker] jar-grouping:
[smoker]
[smoker] check-queries-uptodate:
[smoker]
[smoker] jar-queries:
[smoker]
[smoker] check-queryparser-uptodate:
[smoker]
[smoker] jar-queryparser:
[smoker]
[smoker] check-join-uptodate:
[smoker]
[smoker] jar-join:
[smoker]
[smoker] prep-lucene-jars:
[smoker]
[smoker] resolve-example:
[smoker]
[smoker] ivy-availability-check:
[smoker]
[smoker] ivy-fail:
[smoker]
[smoker] ivy-fail:
[smoker]
[smoker] ivy-configure:
[smoker] [ivy:configure] :: loading settings :: file = /usr/home/jenkins/jenkins-slave/workspace/Lucene-Solr-SmokeRelease-trunk/lucene/build/smokeTestRelease/tmp/unpack/solr-6.0.0/lucene/ivy-settings.xml
[smoker]
[smoker] sync-hack:
[smoker]
[smoker] resolve:
[smoker]
[smoker] ivy-availability-check:
[smoker]
[smoker] ivy-fail:
[smoker]
[smoker] ivy-configure:
[smoker] [ivy:configure] :: loading settings :: file = /usr/home/jenkins/jenkins-slave/workspace/Lucene-Solr-SmokeRelease-trunk/lucene/build/smokeTestRelease/tmp/unpack/solr-6.0.0/lucene/ivy-settings.xml
[smoker]
[smoker] resolve:
[smoker]
[smoker] ivy-availability-check:
[smoker]
[smoker] ivy-fail:
[smoker]
[smoker] ivy-fail:
[smoker]
[smoker] ivy-configure:
[smoker] [ivy:configure] :: loading settings :: file = /usr/home/jenkins/jenkins-slave/workspace/Lucene-Solr-SmokeRelease-trunk/lucene/build/smokeTestRelease/tmp/unpack/solr-6.0.0/lucene/ivy-settings.xml
[smoker]
[smoker] resolve:
[smoker]
[smoker] common.init:
[smoker]
[smoker] compile-lucene-core:
[smoker]
[smoker] ivy-availability-check:
[smoker]
[smoker] ivy-fail:
[smoker]
[smoker] ivy-configure:
[smoker] [ivy:configure] :: loading settings :: file = /usr/home/jenkins/jenkins-slave/workspace/Lucene-Solr-SmokeRelease-trunk/lucene/build/smokeTestRelease/tmp/unpack/solr-6.0.0/lucene/ivy-settings.xml
[smoker]
[smoker] resolve:
[smoker]
[smoker] init:
[smoker]
[smoker] -clover.disable:
[smoker]
[smoker] -clover.load:
[smoker]
[smoker] -clover.classpath:
[smoker]
[smoker] -clover.setup:
[smoker]
[smoker] clover:
[smoker]
[smoker] compile-core:
[smoker]
[smoker] init:
[smoker]
[smoker] -clover.disable:
[smoker]
[smoker] -clover.load:
[smoker]
[smoker] -clover.classpath:
[smoker]
[smoker] -clover.setup:
[smoker]
[smoker] clover:
[smoker]
[smoker] common.compile-core:
[smoker] [mkdir] Created dir: /usr/home/jenkins/jenkins-slave/workspace/Lucene-Solr-SmokeRelease-trunk/lucene/build/smokeTestRelease/tmp/unpack/solr-6.0.0/solr/build/solr-core/classes/java
[smoker] [javac] Compiling 678 source files to /usr/home/jenkins/jenkins-slave/workspace/Lucene-Solr-SmokeRelease-trunk/lucene/build/smokeTestRelease/tmp/unpack/solr-6.0.0/solr/build/solr-core/classes/java
[smoker] [javac] Note: Some input files use or override a deprecated API.
[smoker] [javac] Note: Recompile with -Xlint:deprecation for details.
[smoker] [javac] Note: Some input files use unchecked or unsafe operations.
[smoker] [javac] Note: Recompile with -Xlint:unchecked for details.
[smoker]
[smoker] common-solr.compile-core:
[smoker]
[smoker] compile-core:
[smoker]
[smoker] compile-solrj:
[smoker]
[smoker] check-lucene-core-uptodate:
[smoker]
[smoker] jar-lucene-core:
[smoker]
[smoker] check-backward-codecs-uptodate:
[smoker]
[smoker] jar-backward-codecs:
[smoker]
[smoker] check-analyzers-phonetic-uptodate:
[smoker]
[smoker] jar-analyzers-phonetic:
[smoker]
[smoker] check-analyzers-kuromoji-uptodate:
[smoker]
[smoker] jar-analyzers-kuromoji:
[smoker]
[smoker] check-codecs-uptodate:
[smoker]
[smoker] jar-codecs:
[smoker]
[smoker] check-expressions-uptodate:
[smoker]
[smoker] jar-expressions:
[smoker]
[smoker] check-suggest-uptodate:
[smoker]
[smoker] jar-suggest:
[smoker]
[smoker] check-highlighter-uptodate:
[smoker]
[smoker] jar-highlighter:
[smoker]
[smoker] check-memory-uptodate:
[smoker]
[smoker] jar-memory:
[smoker]
[smoker] check-misc-uptodate:
[smoker]
[smoker] jar-misc:
[smoker]
[smoker] check-spatial-uptodate:
[smoker]
[smoker] jar-spatial:
[smoker]
[smoker] check-grouping-uptodate:
[smoker]
[smoker] jar-grouping:
[smoker]
[smoker] check-queries-uptodate:
[smoker]
[smoker] jar-queries:
[smoker]
[smoker] check-queryparser-uptodate:
[smoker]
[smoker] jar-queryparser:
[smoker]
[smoker] check-join-uptodate:
[smoker]
[smoker] jar-join:
[smoker]
[smoker] prep-lucene-jars:
[smoker]
[smoker] resolve-example:
[smoker]
[smoker] ivy-availability-check:
[smoker]
[smoker] ivy-fail:
[smoker]
[smoker] ivy-fail:
[smoker]
[smoker] ivy-configure:
[smoker] [ivy:configure] :: loading settings :: file = /usr/home/jenkins/jenkins-slave/workspace/Lucene-Solr-SmokeRelease-trunk/lucene/build/smokeTestRelease/tmp/unpack/solr-6.0.0/lucene/ivy-settings.xml
[smoker]
[smoker] sync-hack:
[smoker]
[smoker] resolve:
[smoker]
[smoker] ivy-availability-check:
[smoker]
[smoker] ivy-fail:
[smoker]
[smoker] ivy-configure:
[smoker] [ivy:configure] :: loading settings :: file = /usr/home/jenkins/jenkins-slave/workspace/Lucene-Solr-SmokeRelease-trunk/lucene/build/smokeTestRelease/tmp/unpack/solr-6.0.0/lucene/ivy-settings.xml
[smoker]
[smoker] resolve:
[smoker]
[smoker] ivy-availability-check:
[smoker]
[smoker] ivy-fail:
[smoker]
[smoker] ivy-fail:
[smoker]
[smoker] ivy-configure:
[smoker] [ivy:configure] :: loading settings :: file = /usr/home/jenkins/jenkins-slave/workspace/Lucene-Solr-SmokeRelease-trunk/lucene/build/smokeTestRelease/tmp/unpack/solr-6.0.0/lucene/ivy-settings.xml
[smoker]
[smoker] resolve:
[smoker]
[smoker] common.init:
[smoker]
[smoker] compile-lucene-core:
[smoker]
[smoker] ivy-availability-check:
[smoker]
[smoker] ivy-fail:
[smoker]
[smoker] ivy-configure:
[smoker] [ivy:configure] :: loading settings :: file = /usr/home/jenkins/jenkins-slave/workspace/Lucene-Solr-SmokeRelease-trunk/lucene/build/smokeTestRelease/tmp/unpack/solr-6.0.0/lucene/ivy-settings.xml
[smoker]
[smoker] resolve:
[smoker]
[smoker] init:
[smoker]
[smoker] -clover.disable:
[smoker]
[smoker] -clover.load:
[smoker]
[smoker] -clover.classpath:
[smoker]
[smoker] -clover.setup:
[smoker]
[smoker] clover:
[smoker]
[smoker] compile-core:
[smoker]
[smoker] init:
[smoker]
[smoker] -clover.disable:
[smoker]
[smoker] -clover.load:
[smoker]
[smoker] -clover.classpath:
[smoker]
[smoker] -clover.setup:
[smoker]
[smoker] clover:
[smoker]
[smoker] common.compile-core:
[smoker]
[smoker] compile-core:
[smoker]
[smoker] check-lucene-core-uptodate:
[smoker]
[smoker] jar-lucene-core:
[smoker]
[smoker] check-backward-codecs-uptodate:
[smoker]
[smoker] jar-backward-codecs:
[smoker]
[smoker] check-analyzers-phonetic-uptodate:
[smoker]
[smoker] jar-analyzers-phonetic:
[smoker]
[smoker] check-analyzers-kuromoji-uptodate:
[smoker]
[smoker] jar-analyzers-kuromoji:
[smoker]
[smoker] check-codecs-uptodate:
[smoker]
[smoker] jar-codecs:
[smoker]
[smoker] check-expressions-uptodate:
[smoker]
[smoker] jar-expressions:
[smoker]
[smoker] check-suggest-uptodate:
[smoker]
[smoker] jar-suggest:
[smoker]
[smoker] check-highlighter-uptodate:
[smoker]
[smoker] jar-highlighter:
[smoker]
[smoker] check-memory-uptodate:
[smoker]
[smoker] jar-memory:
[smoker]
[smoker] check-misc-uptodate:
[smoker]
[smoker] jar-misc:
[smoker]
[smoker] check-spatial-uptodate:
[smoker]
[smoker] jar-spatial:
[smoker]
[smoker] check-grouping-uptodate:
[smoker]
[smoker] jar-grouping:
[smoker]
[smoker] check-queries-uptodate:
[smoker]
[smoker] jar-queries:
[smoker]
[smoker] check-queryparser-uptodate:
[smoker]
[smoker] jar-queryparser:
[smoker]
[smoker] check-join-uptodate:
[smoker]
[smoker] jar-join:
[smoker]
[smoker] prep-lucene-jars:
[smoker]
[smoker] resolve-example:
[smoker]
[smoker] ivy-availability-check:
[smoker]
[smoker] ivy-fail:
[smoker]
[smoker] ivy-fail:
[smoker]
[smoker] ivy-configure:
[smoker] [ivy:configure] :: loading settings :: file = /usr/home/jenkins/jenkins-slave/workspace/Lucene-Solr-SmokeRelease-trunk/lucene/build/smokeTestRelease/tmp/unpack/solr-6.0.0/lucene/ivy-settings.xml
[smoker]
[smoker] sync-hack:
[smoker]
[smoker] resolve:
[smoker]
[smoker] ivy-availability-check:
[smoker]
[smoker] ivy-fail:
[smoker]
[smoker] ivy-configure:
[smoker] [ivy:configure] :: loading settings :: file = /usr/home/jenkins/jenkins-slave/workspace/Lucene-Solr-SmokeRelease-trunk/lucene/build/smokeTestRelease/tmp/unpack/solr-6.0.0/lucene/ivy-settings.xml
[smoker]
[smoker] resolve:
[smoker]
[smoker] ivy-availability-check:
[smoker]
[smoker] ivy-fail:
[smoker]
[smoker] ivy-fail:
[smoker]
[smoker] ivy-configure:
[smoker] [ivy:configure] :: loading settings :: file = /usr/home/jenkins/jenkins-slave/workspace/Lucene-Solr-SmokeRelease-trunk/lucene/build/smokeTestRelease/tmp/unpack/solr-6.0.0/lucene/ivy-settings.xml
[smoker]
[smoker] resolve:
[smoker]
[smoker] common.init:
[smoker]
[smoker] compile-lucene-core:
[smoker]
[smoker] ivy-availability-check:
[smoker]
[smoker] ivy-fail:
[smoker]
[smoker] ivy-configure:
[smoker] [ivy:configure] :: loading settings :: file = /usr/home/jenkins/jenkins-slave/workspace/Lucene-Solr-SmokeRelease-trunk/lucene/build/smokeTestRelease/tmp/unpack/solr-6.0.0/lucene/ivy-settings.xml
[smoker]
[smoker] resolve:
[smoker]
[smoker] init:
[smoker]
[smoker] -clover.disable:
[smoker]
[smoker] -clover.load:
[smoker]
[smoker] -clover.classpath:
[smoker]
[smoker] -clover.setup:
[smoker]
[smoker] clover:
[smoker]
[smoker] compile-core:
[smoker]
[smoker] init:
[smoker]
[smoker] -clover.disable:
[smoker]
[smoker] -clover.load:
[smoker]
[smoker] -clover.classpath:
[smoker]
[smoker] -clover.setup:
[smoker]
[smoker] clover:
[smoker]
[smoker] common.compile-core:
[smoker] [mkdir] Created dir: /usr/home/jenkins/jenkins-slave/workspace/Lucene-Solr-SmokeRelease-trunk/lucene/build/smokeTestRelease/tmp/unpack/solr-6.0.0/solr/build/contrib/solr-analysis-extras/classes/java
[smoker] [javac] Compiling 1 source file to /usr/home/jenkins/jenkins-slave/workspace/Lucene-Solr-SmokeRelease-trunk/lucene/build/smokeTestRelease/tmp/unpack/solr-6.0.0/solr/build/contrib/solr-analysis-extras/classes/java
[smoker] [javac] Note: /usr/home/jenkins/jenkins-slave/workspace/Lucene-Solr-SmokeRelease-trunk/lucene/build/smokeTestRelease/tmp/unpack/solr-6.0.0/solr/contrib/analysis-extras/src/java/org/apache/solr/schema/ICUCollationField.java uses or overrides a deprecated API.
[smoker] [javac] Note: Recompile with -Xlint:deprecation for details.
[smoker]
[smoker] common-solr.compile-core:
[smoker]
[smoker] solr-contrib-build.compile-core:
[smoker]
[smoker] compile-core:
[smoker]
[smoker] compile:
[smoker]
[smoker] compile-solr-test-framework:
[smoker]
[smoker] ivy-availability-check:
[smoker]
[smoker] ivy-fail:
[smoker]
[smoker] ivy-configure:
[smoker] [ivy:configure] :: loading settings :: file = /usr/home/jenkins/jenkins-slave/workspace/Lucene-Solr-SmokeRelease-trunk/lucene/build/smokeTestRelease/tmp/unpack/solr-6.0.0/lucene/ivy-settings.xml
[smoker]
[smoker] resolve:
[smoker]
[smoker] compile-solr-core:
[smoker]
[smoker] compile-solrj:
[smoker]
[smoker] check-lucene-core-uptodate:
[smoker]
[smoker] jar-lucene-core:
[smoker]
[smoker] check-backward-codecs-uptodate:
[smoker]
[smoker] jar-backward-codecs:
[smoker]
[smoker] check-analyzers-phonetic-uptodate:
[smoker]
[smoker] jar-analyzers-phonetic:
[smoker]
[smoker] check-analyzers-kuromoji-uptodate:
[smoker]
[smoker] jar-analyzers-kuromoji:
[smoker]
[smoker] check-codecs-uptodate:
[smoker]
[smoker] jar-codecs:
[smoker]
[smoker] check-expressions-uptodate:
[smoker]
[smoker] jar-expressions:
[smoker]
[smoker] check-suggest-uptodate:
[smoker]
[smoker] jar-suggest:
[smoker]
[smoker] check-highlighter-uptodate:
[smoker]
[smoker] jar-highlighter:
[smoker]
[smoker] check-memory-uptodate:
[smoker]
[smoker] jar-memory:
[smoker]
[smoker] check-misc-uptodate:
[smoker]
[smoker] jar-misc:
[smoker]
[smoker] check-spatial-uptodate:
[smoker]
[smoker] jar-spatial:
[smoker]
[smoker] check-grouping-uptodate:
[smoker]
[smoker] jar-grouping:
[smoker]
[smoker] check-queries-uptodate:
[smoker]
[smoker] jar-queries:
[smoker]
[smoker] check-queryparser-uptodate:
[smoker]
[smoker] jar-queryparser:
[smoker]
[smoker] check-join-uptodate:
[smoker]
[smoker] jar-join:
[smoker]
[smoker] prep-lucene-jars:
[smoker]
[smoker] resolve-example:
[smoker]
[smoker] ivy-availability-check:
[smoker]
[smoker] ivy-fail:
[smoker]
[smoker] ivy-fail:
[smoker]
[smoker] ivy-configure:
[smoker] [ivy:configure] :: loading settings :: file = /usr/home/jenkins/jenkins-slave/workspace/Lucene-Solr-SmokeRelease-trunk/lucene/build/smokeTestRelease/tmp/unpack/solr-6.0.0/lucene/ivy-settings.xml
[smoker]
[smoker] sync-hack:
[smoker]
[smoker] resolve:
[smoker]
[smoker] ivy-availability-check:
[smoker]
[smoker] ivy-fail:
[smoker]
[smoker] ivy-configure:
[smoker] [ivy:configure] :: loading settings :: file = /usr/home/jenkins/jenkins-slave/workspace/Lucene-Solr-SmokeRelease-trunk/lucene/build/smokeTestRelease/tmp/unpack/solr-6.0.0/lucene/ivy-settings.xml
[smoker]
[smoker] resolve:
[smoker]
[smoker] ivy-availability-check:
[smoker]
[smoker] ivy-fail:
[smoker]
[smoker] ivy-fail:
[smoker]
[smoker] ivy-configure:
[smoker] [ivy:configure] :: loading settings :: file = /usr/home/jenkins/jenkins-slave/workspace/Lucene-Solr-SmokeRelease-trunk/lucene/build/smokeTestRelease/tmp/unpack/solr-6.0.0/lucene/ivy-settings.xml
[smoker]
[smoker] resolve:
[smoker]
[smoker] common.init:
[smoker]
[smoker] compile-lucene-core:
[smoker]
[smoker] ivy-availability-check:
[smoker]
[smoker] ivy-fail:
[smoker]
[smoker] ivy-configure:
[smoker] [ivy:configure] :: loading settings :: file = /usr/home/jenkins/jenkins-slave/workspace/Lucene-Solr-SmokeRelease-trunk/lucene/build/smokeTestRelease/tmp/unpack/solr-6.0.0/lucene/ivy-settings.xml
[smoker]
[smoker] resolve:
[smoker]
[smoker] init:
[smoker]
[smoker] -clover.disable:
[smoker]
[smoker] -clover.load:
[smoker]
[smoker] -clover.classpath:
[smoker]
[smoker] -clover.setup:
[smoker]
[smoker] clover:
[smoker]
[smoker] compile-core:
[smoker]
[smoker] init:
[smoker]
[smoker] -clover.disable:
[smoker]
[smoker] -clover.load:
[smoker]
[smoker] -clover.classpath:
[smoker]
[smoker] -clover.setup:
[smoker]
[smoker] clover:
[smoker]
[smoker] common.compile-core:
[smoker]
[smoker] compile-core:
[smoker]
[smoker] check-lucene-core-uptodate:
[smoker]
[smoker] jar-lucene-core:
[smoker]
[smoker] check-backward-codecs-uptodate:
[smoker]
[smoker] jar-backward-codecs:
[smoker]
[smoker] check-analyzers-phonetic-uptodate:
[smoker]
[smoker] jar-analyzers-phonetic:
[smoker]
[smoker] check-analyzers-kuromoji-uptodate:
[smoker]
[smoker] jar-analyzers-kuromoji:
[smoker]
[smoker] check-codecs-uptodate:
[smoker]
[smoker] jar-codecs:
[smoker]
[smoker] check-expressions-uptodate:
[smoker]
[smoker] jar-expressions:
[smoker]
[smoker] check-suggest-uptodate:
[smoker]
[smoker] jar-suggest:
[smoker]
[smoker] check-highlighter-uptodate:
[smoker]
[smoker] jar-highlighter:
[smoker]
[smoker] check-memory-uptodate:
[smoker]
[smoker] jar-memory:
[smoker]
[smoker] check-misc-uptodate:
[smoker]
[smoker] jar-misc:
[smoker]
[smoker] check-spatial-uptodate:
[smoker]
[smoker] jar-spatial:
[smoker]
[smoker] check-grouping-uptodate:
[smoker]
[smoker] jar-grouping:
[smoker]
[smoker] check-queries-uptodate:
[smoker]
[smoker] jar-queries:
[smoker]
[smoker] check-queryparser-uptodate:
[smoker]
[smoker] jar-queryparser:
[smoker]
[smoker] check-join-uptodate:
[smoker]
[smoker] jar-join:
[smoker]
[smoker] prep-lucene-jars:
[smoker]
[smoker] resolve-example:
[smoker]
[smoker] ivy-availability-check:
[smoker]
[smoker] ivy-fail:
[smoker]
[smoker] ivy-fail:
[smoker]
[smoker] ivy-configure:
[smoker] [ivy:configure] :: loading settings :: file = /usr/home/jenkins/jenkins-slave/workspace/Lucene-Solr-SmokeRelease-trunk/lucene/build/smokeTestRelease/tmp/unpack/solr-6.0.0/lucene/ivy-settings.xml
[smoker]
[smoker] sync-hack:
[smoker]
[smoker] resolve:
[smoker]
[smoker] ivy-availability-check:
[smoker]
[smoker] ivy-fail:
[smoker]
[smoker] ivy-configure:
[smoker] [ivy:configure] :: loading settings :: file = /usr/home/jenkins/jenkins-slave/workspace/Lucene-Solr-SmokeRelease-trunk/lucene/build/smokeTestRelease/tmp/unpack/solr-6.0.0/lucene/ivy-settings.xml
[smoker]
[smoker] resolve:
[smoker]
[smoker] ivy-availability-check:
[smoker]
[smoker] ivy-fail:
[smoker]
[smoker] ivy-fail:
[smoker]
[smoker] ivy-configure:
[smoker] [ivy:configure] :: loading settings :: file = /usr/home/jenkins/jenkins-slave/workspace/Lucene-Solr-SmokeRelease-trunk/lucene/build/smokeTestRelease/tmp/unpack/solr-6.0.0/lucene/ivy-settings.xml
[smoker]
[smoker] resolve:
[smoker]
[smoker] common.init:
[smoker]
[smoker] compile-lucene-core:
[smoker]
[smoker] ivy-availability-check:
[smoker]
[smoker] ivy-fail:
[smoker]
[smoker] ivy-configure:
[smoker] [ivy:configure] :: loading settings :: file = /usr/home/jenkins/jenkins-slave/workspace/Lucene-Solr-SmokeRelease-trunk/lucene/build/smokeTestRelease/tmp/unpack/solr-6.0.0/lucene/ivy-settings.xml
[smoker]
[smoker] resolve:
[smoker]
[smoker] init:
[smoker]
[smoker] -clover.disable:
[smoker]
[smoker] -clover.load:
[smoker]
[smoker] -clover.classpath:
[smoker]
[smoker] -clover.setup:
[smoker]
[smoker] clover:
[smoker]
[smoker] compile-core:
[smoker]
[smoker] init:
[smoker]
[smoker] -clover.disable:
[smoker]
[smoker] -clover.load:
[smoker]
[smoker] -clover.classpath:
[smoker]
[smoker] -clover.setup:
[smoker]
[smoker] clover:
[smoker]
[smoker] common.compile-core:
[smoker]
[smoker] common-solr.compile-core:
[smoker]
[smoker] compile-core:
[smoker]
[smoker] compile-test-framework:
[smoker]
[smoker] compile-test-framework:
[smoker]
[smoker] ivy-availability-check:
[smoker]
[smoker] ivy-fail:
[smoker]
[smoker] ivy-configure:
[smoker] [ivy:configure] :: loading settings :: file = /usr/home/jenkins/jenkins-slave/workspace/Lucene-Solr-SmokeRelease-trunk/lucene/build/smokeTestRelease/tmp/unpack/solr-6.0.0/lucene/ivy-settings.xml
[smoker]
[smoker] resolve:
[smoker]
[smoker] init:
[smoker]
[smoker] compile-lucene-core:
[smoker]
[smoker] ivy-availability-check:
[smoker]
[smoker] ivy-fail:
[smoker]
[smoker] ivy-configure:
[smoker] [ivy:configure] :: loading settings :: file = /usr/home/jenkins/jenkins-slave/workspace/Lucene-Solr-SmokeRelease-trunk/lucene/build/smokeTestRelease/tmp/unpack/solr-6.0.0/lucene/ivy-settings.xml
[smoker]
[smoker] resolve:
[smoker]
[smoker] init:
[smoker]
[smoker] -clover.disable:
[smoker]
[smoker] -clover.load:
[smoker]
[smoker] -clover.classpath:
[smoker]
[smoker] -clover.setup:
[smoker]
[smoker] clover:
[smoker]
[smoker] compile-core:
[smoker]
[smoker] compile-codecs:
[smoker]
[smoker] ivy-availability-check:
[smoker]
[smoker] ivy-fail:
[smoker]
[smoker] ivy-configure:
[smoker] [ivy:configure] :: loading settings :: file = /usr/home/jenkins/jenkins-slave/workspace/Lucene-Solr-SmokeRelease-trunk/lucene/build/smokeTestRelease/tmp/unpack/solr-6.0.0/lucene/ivy-settings.xml
[smoker]
[smoker] resolve:
[smoker]
[smoker] common.init:
[smoker]
[smoker] compile-lucene-core:
[smoker]
[smoker] init:
[smoker]
[smoker] -clover.disable:
[smoker]
[smoker] -clover.load:
[smoker]
[smoker] -clover.classpath:
[smoker]
[smoker] -clover.setup:
[smoker]
[smoker] clover:
[smoker]
[smoker] compile-core:
[smoker]
[smoker] -clover.disable:
[smoker]
[smoker] -clover.load:
[smoker]
[smoker] -clover.classpath:
[smoker]
[smoker] -clover.setup:
[smoker]
[smoker] clover:
[smoker]
[smoker] common.compile-core:
[smoker]
[smoker] compile-core:
[smoker]
[smoker] compile-core:
[smoker] [mkdir] Created dir: /usr/home/jenkins/jenkins-slave/workspace/Lucene-Solr-SmokeRelease-trunk/lucene/build/smokeTestRelease/tmp/unpack/solr-6.0.0/solr/build/solr-test-framework/classes/java
[smoker] [javac] Compiling 36 source files to /usr/home/jenkins/jenkins-slave/workspace/Lucene-Solr-SmokeRelease-trunk/lucene/build/smokeTestRelease/tmp/unpack/solr-6.0.0/solr/build/solr-test-framework/classes/java
[smoker] [javac] Note: Some input files use or override a deprecated API.
[smoker] [javac] Note: Recompile with -Xlint:deprecation for details.
[smoker] [javac] Note: Some input files use unchecked or unsafe operations.
[smoker] [javac] Note: Recompile with -Xlint:unchecked for details.
[smoker]
[smoker] compile-solrj:
[smoker]
[smoker] check-lucene-core-uptodate:
[smoker]
[smoker] jar-lucene-core:
[smoker]
[smoker] check-backward-codecs-uptodate:
[smoker]
[smoker] jar-backward-codecs:
[smoker]
[smoker] check-analyzers-phonetic-uptodate:
[smoker]
[smoker] jar-analyzers-phonetic:
[smoker]
[smoker] check-analyzers-kuromoji-uptodate:
[smoker]
[smoker] jar-analyzers-kuromoji:
[smoker]
[smoker] check-codecs-uptodate:
[smoker]
[smoker] jar-codecs:
[smoker]
[smoker] check-expressions-uptodate:
[smoker]
[smoker] jar-expressions:
[smoker]
[smoker] check-suggest-uptodate:
[smoker]
[smoker] jar-suggest:
[smoker]
[smoker] check-highlighter-uptodate:
[smoker]
[smoker] jar-highlighter:
[smoker]
[smoker] check-memory-uptodate:
[smoker]
[smoker] jar-memory:
[smoker]
[smoker] check-misc-uptodate:
[smoker]
[smoker] jar-misc:
[smoker]
[smoker] check-spatial-uptodate:
[smoker]
[smoker] jar-spatial:
[smoker]
[smoker] check-grouping-uptodate:
[smoker]
[smoker] jar-grouping:
[smoker]
[smoker] check-queries-uptodate:
[smoker]
[smoker] jar-queries:
[smoker]
[smoker] check-queryparser-uptodate:
[smoker]
[smoker] jar-queryparser:
[smoker]
[smoker] check-join-uptodate:
[smoker]
[smoker] jar-join:
[smoker]
[smoker] prep-lucene-jars:
[smoker]
[smoker] resolve-example:
[smoker]
[smoker] ivy-availability-check:
[smoker]
[smoker] ivy-fail:
[smoker]
[smoker] ivy-fail:
[smoker]
[smoker] ivy-configure:
[smoker] [ivy:configure] :: loading settings :: file = /usr/home/jenkins/jenkins-slave/workspace/Lucene-Solr-SmokeRelease-trunk/lucene/build/smokeTestRelease/tmp/unpack/solr-6.0.0/lucene/ivy-settings.xml
[smoker]
[smoker] sync-hack:
[smoker]
[smoker] resolve:
[smoker]
[smoker] ivy-availability-check:
[smoker]
[smoker] ivy-fail:
[smoker]
[smoker] ivy-configure:
[smoker] [ivy:configure] :: loading settings :: file = /usr/home/jenkins/jenkins-slave/workspace/Lucene-Solr-SmokeRelease-trunk/lucene/build/smokeTestRelease/tmp/unpack/solr-6.0.0/lucene/ivy-settings.xml
[smoker]
[smoker] resolve:
[smoker]
[smoker] ivy-availability-check:
[smoker]
[smoker] ivy-fail:
[smoker]
[smoker] ivy-fail:
[smoker]
[smoker] ivy-configure:
[smoker] [ivy:configure] :: loading settings :: file = /usr/home/jenkins/jenkins-slave/workspace/Lucene-Solr-SmokeRelease-trunk/lucene/build/smokeTestRelease/tmp/unpack/solr-6.0.0/lucene/ivy-settings.xml
[smoker]
[smoker] resolve:
[smoker]
[smoker] common.init:
[smoker]
[smoker] compile-lucene-core:
[smoker]
[smoker] ivy-availability-check:
[smoker]
[smoker] ivy-fail:
[smoker]
[smoker] ivy-configure:
[smoker] [ivy:configure] :: loading settings :: file = /usr/home/jenkins/jenkins-slave/workspace/Lucene-Solr-SmokeRelease-trunk/lucene/build/smokeTestRelease/tmp/unpack/solr-6.0.0/lucene/ivy-settings.xml
[smoker]
[smoker] resolve:
[smoker]
[smoker] init:
[smoker]
[smoker] -clover.disable:
[smoker]
[smoker] -clover.load:
[smoker]
[smoker] -clover.classpath:
[smoker]
[smoker] -clover.setup:
[smoker]
[smoker] clover:
[smoker]
[smoker] compile-core:
[smoker]
[smoker] init:
[smoker]
[smoker] -clover.disable:
[smoker]
[smoker] -clover.load:
[smoker]
[smoker] -clover.classpath:
[smoker]
[smoker] -clover.setup:
[smoker]
[smoker] clover:
[smoker]
[smoker] common.compile-core:
[smoker]
[smoker] compile-core:
[smoker]
[smoker] check-lucene-core-uptodate:
[smoker]
[smoker] jar-lucene-core:
[smoker]
[smoker] check-backward-codecs-uptodate:
[smoker]
[smoker] jar-backward-codecs:
[smoker]
[smoker] check-analyzers-phonetic-uptodate:
[smoker]
[smoker] jar-analyzers-phonetic:
[smoker]
[smoker] check-analyzers-kuromoji-uptodate:
[smoker]
[smoker] jar-analyzers-kuromoji:
[smoker]
[smoker] check-codecs-uptodate:
[smoker]
[smoker] jar-codecs:
[smoker]
[smoker] check-expressions-uptodate:
[smoker]
[smoker] jar-expressions:
[smoker]
[smoker] check-suggest-uptodate:
[smoker]
[smoker] jar-suggest:
[smoker]
[smoker] check-highlighter-uptodate:
[smoker]
[smoker] jar-highlighter:
[smoker]
[smoker] check-memory-uptodate:
[smoker]
[smoker] jar-memory:
[smoker]
[smoker] check-misc-uptodate:
[smoker]
[smoker] jar-misc:
[smoker]
[smoker] check-spatial-uptodate:
[smoker]
[smoker] jar-spatial:
[smoker]
[smoker] check-grouping-uptodate:
[smoker]
[smoker] jar-grouping:
[smoker]
[smoker] check-queries-uptodate:
[smoker]
[smoker] jar-queries:
[smoker]
[smoker] check-queryparser-uptodate:
[smoker]
[smoker] jar-queryparser:
[smoker]
[smoker] check-join-uptodate:
[smoker]
[smoker] jar-join:
[smoker]
[smoker] prep-lucene-jars:
[smoker]
[smoker] resolve-example:
[smoker]
[smoker] ivy-availability-check:
[smoker]
[smoker] ivy-fail:
[smoker]
[smoker] ivy-fail:
[smoker]
[smoker] ivy-configure:
[smoker] [ivy:configure] :: loading settings :: file = /usr/home/jenkins/jenkins-slave/workspace/Lucene-Solr-SmokeRelease-trunk/lucene/build/smokeTestRelease/tmp/unpack/solr-6.0.0/lucene/ivy-settings.xml
[smoker]
[smoker] sync-hack:
[smoker]
[smoker] resolve:
[smoker]
[smoker] ivy-availability-check:
[smoker]
[smoker] ivy-fail:
[smoker]
[smoker] ivy-configure:
[smoker] [ivy:configure] :: loading settings :: file = /usr/home/jenkins/jenkins-slave/workspace/Lucene-Solr-SmokeRelease-trunk/lucene/build/smokeTestRelease/tmp/unpack/solr-6.0.0/lucene/ivy-settings.xml
[smoker]
[smoker] resolve:
[smoker]
[smoker] ivy-fail:
[smoker]
[smoker] resolve:
[smoker]
[smoker] common.init:
[smoker]
[smoker] compile-lucene-core:
[smoker]
[smoker] ivy-availability-check:
[smoker]
[smoker] ivy-fail:
[smoker]
[smoker] ivy-configure:
[smoker] [ivy:configure] :: loading settings :: file = /usr/home/jenkins/jenkins-slave/workspace/Lucene-Solr-SmokeRelease-trunk/lucene/build/smokeTestRelease/tmp/unpack/solr-6.0.0/lucene/ivy-settings.xml
[smoker]
[smoker] resolve:
[smoker]
[smoker] init:
[smoker]
[smoker] -clover.disable:
[smoker]
[smoker] -clover.load:
[smoker]
[smoker] -clover.classpath:
[smoker]
[smoker] -clover.setup:
[smoker]
[smoker] clover:
[smoker]
[smoker] compile-core:
[smoker]
[smoker] init:
[smoker]
[smoker] common.compile-core:
[smoker]
[smoker] common-solr.compile-core:
[smoker]
[smoker] compile-core:
[smoker]
[smoker] compile-test-framework:
[smoker]
[smoker] ivy-availability-check:
[smoker]
[smoker] ivy-fail:
[smoker]
[smoker] ivy-configure:
[smoker] [ivy:configure] :: loading settings :: file = /usr/home/jenkins/jenkins-slave/workspace/Lucene-Solr-SmokeRelease-trunk/lucene/build/smokeTestRelease/tmp/unpack/solr-6.0.0/lucene/ivy-settings.xml
[smoker]
[smoker] resolve:
[smoker]
[smoker] init:
[smoker]
[smoker] compile-lucene-core:
[smoker]
[smoker] compile-codecs:
[smoker]
[smoker] ivy-availability-check:
[smoker]
[smoker] ivy-fail:
[smoker]
[smoker] ivy-configure:
[smoker] [ivy:configure] :: loading settings :: file = /usr/home/jenkins/jenkins-slave/workspace/Lucene-Solr-SmokeRelease-trunk/lucene/build/smokeTestRelease/tmp/unpack/solr-6.0.0/lucene/ivy-settings.xml
[smoker]
[smoker] resolve:
[smoker]
[smoker] common.init:
[smoker]
[smoker] compile-lucene-core:
[smoker]
[smoker] init:
[smoker]
[smoker] -clover.disable:
[smoker]
[smoker] -clover.load:
[smoker]
[smoker] -clover.classpath:
[smoker]
[smoker] -clover.setup:
[smoker]
[smoker] clover:
[smoker]
[smoker] compile-core:
[smoker]
[smoker] -clover.disable:
[smoker]
[smoker] -clover.load:
[smoker]
[smoker] -clover.classpath:
[smoker]
[smoker] -clover.setup:
[smoker]
[smoker] clover:
[smoker]
[smoker] common.compile-core:
[smoker]
[smoker] compile-core:
[smoker]
[smoker] common.compile-test:
[smoker] [mkdir] Created dir: /usr/home/jenkins/jenkins-slave/workspace/Lucene-Solr-SmokeRelease-trunk/lucene/build/smokeTestRelease/tmp/unpack/solr-6.0.0/solr/build/solr-core/classes/test
[smoker] [javac] Compiling 473 source files to /usr/home/jenkins/jenkins-slave/workspace/Lucene-Solr-SmokeRelease-trunk/lucene/build/smokeTestRelease/tmp/unpack/solr-6.0.0/solr/build/solr-core/classes/test
[smoker] [javac] Note: Some input files use or override a deprecated API.
[smoker] [javac] Note: Recompile with -Xlint:deprecation for details.
[smoker] [javac] Note: Some input files use unchecked or unsafe operations.
[smoker] [javac] Note: Recompile with -Xlint:unchecked for details.
[smoker] [copy] Copying 1 file to /usr/home/jenkins/jenkins-slave/workspace/Lucene-Solr-SmokeRelease-trunk/lucene/build/smokeTestRelease/tmp/unpack/solr-6.0.0/solr/build/solr-core/classes/test
[smoker]
[smoker] common-solr.compile-test:
[smoker]
[smoker] compile-test:
[smoker]
[smoker] install-junit4-taskdef:
[smoker]
[smoker] compile-tools:
[smoker]
[smoker] ivy-availability-check:
[smoker]
[smoker] ivy-fail:
[smoker]
[smoker] ivy-configure:
[smoker] [ivy:configure] :: loading settings :: file = /usr/home/jenkins/jenkins-slave/workspace/Lucene-Solr-SmokeRelease-trunk/lucene/build/smokeTestRelease/tmp/unpack/solr-6.0.0/lucene/ivy-settings.xml
[smoker]
[smoker] resolve:
[smoker]
[smoker] init:
[smoker]
[smoker] compile-core:
[smoker]
[smoker] validate:
[smoker]
[smoker] resolve-groovy:
[smoker]
[smoker] -init-totals:
[smoker]
[smoker] -test:
[smoker] [mkdir] Created dir: /usr/home/jenkins/jenkins-slave/workspace/Lucene-Solr-SmokeRelease-trunk/lucene/build/smokeTestRelease/tmp/unpack/solr-6.0.0/solr/build/solr-core/test
[smoker] [loadresource] Do not set property tests.explicitclass as its length is 0.
[smoker] [mkdir] Created dir: /usr/home/jenkins/jenkins-slave/workspace/Lucene-Solr-SmokeRelease-trunk/lucene/build/smokeTestRelease/tmp/unpack/solr-6.0.0/solr/build/solr-core/test/temp
[smoker] [mkdir] Created dir: /usr/home/jenkins/jenkins-slave/workspace/Lucene-Solr-SmokeRelease-trunk/lucene/build/smokeTestRelease/tmp/unpack/solr-6.0.0/.caches/test-stats/solr-core
[smoker] [junit4] <JUnit4> says kaixo! Master seed: 8474F32A35EBE432
[smoker] [junit4] Your default console's encoding may not display certain unicode glyphs: US-ASCII
[smoker] [junit4] Executing 436 suites with 4 JVMs.
[smoker] [junit4]
[smoker] [junit4] Started J1 PID(51586@lucene.zones.apache.org).
[smoker] [junit4] Started J2 PID(51584@lucene.zones.apache.org).
[smoker] [junit4] Started J0 PID(51585@lucene.zones.apache.org).
[smoker] [junit4] Started J3 PID(51587@lucene.zones.apache.org).
[smoker] [junit4] Suite: org.apache.solr.schema.ChangedSchemaMergeTest
[smoker] [junit4] Completed on J0 in 38.27s, 1 test
[smoker] [junit4]
[smoker] [junit4] Suite: org.apache.solr.spelling.suggest.TestPhraseSuggestions
[smoker] [junit4] Completed on J3 in 38.69s, 1 test
[smoker] [junit4]
[smoker] [junit4] Suite: org.apache.solr.SolrTestCaseJ4Test
[smoker] [junit4] Completed on J3 in 2.50s, 1 test
[smoker] [junit4]
[smoker] [junit4] Suite: org.apache.solr.spelling.suggest.TestAnalyzeInfixSuggestions
[smoker] [junit4] Completed on J2 in 45.59s, 2 tests
[smoker] [junit4]
[smoker] [junit4] Suite: org.apache.solr.TestDistributedSearch
[smoker] [junit4] IGNOR/A 0.17s J2 | TestDistributedSearch.testDistribSearch
[smoker] [junit4] > Assumption #1: 'slow' test group is disabled (@Slow())
[smoker] [junit4] Completed on J2 in 0.31s, 1 test, 1 skipped
[smoker] [junit4]
[smoker] [junit4] Suite: org.apache.solr.spelling.suggest.TestAnalyzedSuggestions
[smoker] [junit4] Completed on J0 in 8.04s, 2 tests
[smoker] [junit4]
[smoker] [junit4] Suite: org.apache.solr.util.PrimUtilsTest
[smoker] [junit4] Completed on J0 in 0.13s, 2 tests
[smoker] [junit4]
[smoker] [junit4] Suite: org.apache.solr.update.processor.UUIDUpdateProcessorFallbackTest
[smoker] [junit4] Completed on J1 in 47.03s, 1 test
[smoker] [junit4]
[smoker] [junit4] Suite: org.apache.solr.util.TestFastOutputStream
[smoker] [junit4] Completed on J1 in 0.26s, 1 test
[smoker] [junit4]
[smoker] [junit4] Suite: org.apache.solr.cloud.TestShortCircuitedRequests
[smoker] [junit4] IGNOR/A 0.17s J1 | TestShortCircuitedRequests.testDistribSearch
[smoker] [junit4] > Assumption #1: 'slow' test group is disabled (@Slow())
[smoker] [junit4] Completed on J1 in 0.31s, 1 test, 1 skipped
[smoker] [junit4]
[smoker] [junit4] Suite: org.apache.solr.cloud.hdfs.StressHdfsTest
[smoker] [junit4] IGNOR/A 0.00s J1 | StressHdfsTest.testDistribSearch
[smoker] [junit4] > Assumption #1: 'slow' test group is disabled (@Slow())
[smoker] [junit4] Completed on J1 in 0.01s, 1 test, 1 skipped
[smoker] [junit4]
[smoker] [junit4] Suite: org.apache.solr.core.TestShardHandlerFactory
[smoker] [junit4] Completed on J1 in 1.44s, 2 tests
[smoker] [junit4]
[smoker] [junit4] Suite: org.apache.solr.cloud.SharedFSAutoReplicaFailoverTest
[smoker] [junit4] IGNOR/A 0.00s J1 | SharedFSAutoReplicaFailoverTest.testDistribSearch
[smoker] [junit4] > Assumption #1: 'slow' test group is disabled (@Slow())
[smoker] [junit4] Completed on J1 in 0.01s, 1 test, 1 skipped
[smoker] [junit4]
[smoker] [junit4] Suite: org.apache.solr.update.AnalysisErrorHandlingTest
[smoker] [junit4] Completed on J0 in 3.98s, 1 test
[smoker] [junit4]
[smoker] [junit4] Suite: org.apache.solr.handler.TestCSVLoader
[smoker] [junit4] Completed on J3 in 18.02s, 6 tests
[smoker] [junit4]
[smoker] [junit4] Suite: org.apache.solr.request.TestIntervalFaceting
[smoker] [junit4] IGNOR/A 0.01s J1 | TestIntervalFaceting.testRandom
[smoker] [junit4] > Assumption #1: 'slow' test group is disabled (@Slow())
[smoker] [junit4] Completed on J1 in 11.07s, 17 tests, 1 skipped
[smoker] [junit4]
[smoker] [junit4] Suite: org.apache.solr.handler.component.SuggestComponentTest
[smoker] [junit4] Completed on J0 in 12.87s, 7 tests
[smoker] [junit4]
[smoker] [junit4] Suite: org.apache.solr.handler.component.QueryElevationComponentTest
[smoker] [junit4] Completed on J2 in 23.53s, 8 tests
[smoker] [junit4]
[smoker] [junit4] Suite: org.apache.solr.search.TestValueSourceCache
[smoker] [junit4] Completed on J0 in 6.24s, 2 tests
[smoker] [junit4]
[smoker] [junit4] Suite: org.apache.solr.core.TestSolrIndexConfig
[smoker] [junit4] Completed on J0 in 2.15s, 2 tests
[smoker] [junit4]
[smoker] [junit4] Suite: org.apache.solr.response.TestSortingResponseWriter
[smoker] [junit4] Completed on J2 in 2.63s, 1 test
[smoker] [junit4]
[smoker] [junit4] Suite: org.apache.solr.handler.MoreLikeThisHandlerTest
[smoker] [junit4] Completed on J0 in 4.27s, 1 test
[smoker] [junit4]
[smoker] [junit4] Suite: org.apache.solr.handler.component.TestPivotHelperCode
[smoker] [junit4] Completed on J0 in 0.09s, 3 tests
[smoker] [junit4]
[smoker] [junit4] Suite: org.apache.solr.spelling.SpellingQueryConverterTest
[smoker] [junit4] Completed on J0 in 0.05s, 5 tests
[smoker] [junit4]
[smoker] [junit4] Suite: org.apache.solr.analysis.TestReversedWildcardFilterFactory
[smoker] [junit4] Completed on J2 in 6.97s, 4 tests
[smoker] [junit4]
[smoker] [junit4] Suite: org.apache.solr.search.QueryEqualityTest
[smoker] [junit4] Completed on J0 in 5.94s, 72 tests
[smoker] [junit4]
[smoker] [junit4] Suite: org.apache.solr.handler.component.DistributedSpellCheckComponentTest
[smoker] [junit4] IGNOR/A 0.15s J0 | DistributedSpellCheckComponentTest.testDistribSearch
[smoker] [junit4] > Assumption #1: 'slow' test group is disabled (@Slow())
[smoker] [junit4] Completed on J0 in 0.21s, 1 test, 1 skipped
[smoker] [junit4]
[smoker] [junit4] Suite: org.apache.solr.spelling.suggest.SuggesterWFSTTest
[smoker] [junit4] Completed on J0 in 4.18s, 4 tests
[smoker] [junit4]
[smoker] [junit4] Suite: org.apache.solr.core.TestJmxIntegration
[smoker] [junit4] Completed on J0 in 2.88s, 3 tests, 1 skipped
[smoker] [junit4]
[smoker] [junit4] Suite: org.apache.solr.update.TestDocBasedVersionConstraints
[smoker] [junit4] Completed on J2 in 10.57s, 6 tests
[smoker] [junit4]
[smoker] [junit4] Suite: org.apache.solr.schema.TestCloudSchemaless
[smoker] [junit4] IGNOR/A 0.00s J0 | TestCloudSchemaless.testDistribSearch
[smoker] [junit4] > Assumption #1: 'slow' test group is disabled (@Slow())
[smoker] [junit4] Completed on J0 in 0.01s, 1 test, 1 skipped
[smoker] [junit4]
[smoker] [junit4] Suite: org.apache.solr.internal.csv.CharBufferTest
[smoker] [junit4] Completed on J0 in 0.08s, 13 tests
[smoker] [junit4]
[smoker] [junit4] Suite: org.apache.solr.schema.DocValuesMissingTest
[smoker] [junit4] Completed on J0 in 4.65s, 58 tests
[smoker] [junit4]
[smoker] [junit4] Suite: org.apache.solr.handler.component.DistributedQueryComponentCustomSortTest
[smoker] [junit4] Completed on J1 in 41.99s, 1 test
[smoker] [junit4]
[smoker] [junit4] Suite: org.apache.solr.cloud.DeleteShardTest
[smoker] [junit4] IGNOR/A 0.00s J1 | DeleteShardTest.testDistribSearch
[smoker] [junit4] > Assumption #1: 'slow' test group is disabled (@Slow())
[smoker] [junit4] Completed on J1 in 0.01s, 1 test, 1 skipped
[smoker] [junit4]
[smoker] [junit4] Suite: org.apache.solr.schema.PreAnalyzedFieldTest
[smoker] [junit4] Completed on J1 in 0.97s, 4 tests
[smoker] [junit4]
[smoker] [junit4] Suite: org.apache.solr.search.TestStressUserVersions
[smoker] [junit4] Completed on J1 in 6.94s, 1 test
[smoker] [junit4]
[smoker] [junit4] Suite: org.apache.solr.rest.schema.TestDefaultSearchFieldResource
[smoker] [junit4] Completed on J0 in 15.93s, 1 test
[smoker] [junit4]
[smoker] [junit4] Suite: org.apache.solr.core.TestQuerySenderNoQuery
[smoker] [junit4] Completed on J1 in 1.89s, 3 tests
[smoker] [junit4]
[smoker] [junit4] Suite: org.apache.solr.DisMaxRequestHandlerTest
[smoker] [junit4] Completed on J1 in 2.73s, 2 tests
[smoker] [junit4]
[smoker] [junit4] Suite: org.apache.solr.cloud.DistribCursorPagingTest
[smoker] [junit4] IGNOR/A 0.00s J1 | DistribCursorPagingTest.testDistribSearch
[smoker] [junit4] > Assumption #1: 'slow' test group is disabled (@Slow())
[smoker] [junit4] Completed on J1 in 0.01s, 1 test, 1 skipped
[smoker] [junit4]
[smoker] [junit4] Suite: org.apache.solr.search.TestFiltering
[smoker] [junit4] Completed on J0 in 6.08s, 3 tests
[smoker] [junit4]
[smoker] [junit4] Suite: org.apache.solr.rest.schema.analysis.TestManagedStopFilterFactory
[smoker] [junit4] Completed on J2 in 29.12s, 2 tests
[smoker] [junit4]
[smoker] [junit4] Suite: org.apache.solr.schema.CopyFieldTest
[smoker] [junit4] Completed on J2 in 2.04s, 9 tests
[smoker] [junit4]
[smoker] [junit4] Suite: org.apache.solr.ConvertedLegacyTest
[smoker] [junit4] Completed on J0 in 5.20s, 1 test
[smoker] [junit4]
[smoker] [junit4] HEARTBEAT J3 PID(51587@lucene.zones.apache.org): 2014-10-05T14:17:19, stalled for 65.1s at: DistributedTermsComponentTest.testDistribSearch
[smoker] [junit4] Suite: org.apache.solr.cloud.SolrXmlInZkTest
[smoker] [junit4] Completed on J2 in 6.27s, 7 tests
[smoker] [junit4]
[smoker] [junit4] Suite: org.apache.solr.search.TestStressVersions
[smoker] [junit4] Completed on J1 in 13.82s, 1 test
[smoker] [junit4]
[smoker] [junit4] Suite: org.apache.solr.update.SolrIndexConfigTest
[smoker] [junit4] Completed on J1 in 2.48s, 4 tests
[smoker] [junit4]
[smoker] [junit4] Suite: org.apache.solr.update.processor.TestPartialUpdateDeduplication
[smoker] [junit4] Completed on J1 in 1.85s, 1 test
[smoker] [junit4]
[smoker] [junit4] Suite: org.apache.solr.update.AutoCommitTest
[smoker] [junit4] IGNOR/A 0.00s J1 | AutoCommitTest.testMaxDocs
[smoker] [junit4] > Assumption #1: 'slow' test group is disabled (@Slow())
[smoker] [junit4] IGNOR/A 0.00s J1 | AutoCommitTest.testCommitWithin
[smoker] [junit4] > Assumption #1: 'slow' test group is disabled (@Slow())
[smoker] [junit4] IGNOR/A 0.00s J1 | AutoCommitTest.testMaxTime
[smoker] [junit4] > Assumption #1: 'slow' test group is disabled (@Slow())
[smoker] [junit4] Completed on J1 in 0.01s, 3 tests, 3 skipped
[smoker] [junit4]
[smoker] [junit4] Suite: org.apache.solr.handler.component.DistributedTermsComponentTest
[smoker] [junit4] Completed on J3 in 73.77s, 1 test
[smoker] [junit4]
[smoker] [junit4] Suite: org.apache.solr.cloud.CustomCollectionTest
[smoker] [junit4] IGNOR/A 0.17s J3 | CustomCollectionTest.testDistribSearch
[smoker] [junit4] > Assumption #1: 'slow' test group is disabled (@Slow())
[smoker] [junit4] Completed on J3 in 0.26s, 1 test, 1 skipped
[smoker] [junit4]
[smoker] [junit4] Suite: org.apache.solr.update.processor.AtomicUpdatesTest
[smoker] [junit4] Completed on J3 in 3.37s, 4 tests
[smoker] [junit4]
[smoker] [junit4] Suite: org.apache.solr.internal.csv.CSVPrinterTest
[smoker] [junit4] Completed on J3 in 0.60s, 6 tests
[smoker] [junit4]
[smoker] [junit4] Suite: org.apache.solr.handler.admin.LukeRequestHandlerTest
[smoker] [junit4] Completed on J1 in 4.96s, 6 tests
[smoker] [junit4]
[smoker] [junit4] Suite: org.apache.solr.schema.RequiredFieldsTest
[smoker] [junit4] Completed on J1 in 1.58s, 3 tests
[smoker] [junit4]
[smoker] [junit4] Suite: org.apache.solr.cloud.hdfs.HdfsUnloadDistributedZkTest
[smoker] [junit4] IGNOR/A 0.00s J1 | HdfsUnloadDistributedZkTest.testDistribSearch
[smoker] [junit4] > Assumption #1: 'slow' test group is disabled (@Slow())
[smoker] [junit4] Completed on J1 in 0.01s, 1 test, 1 skipped
[smoker] [junit4]
[smoker] [junit4] Suite: org.apache.solr.search.similarities.TestLMDirichletSimilarityFactory
[smoker] [junit4] Completed on J1 in 1.16s, 2 tests
[smoker] [junit4]
[smoker] [junit4] Suite: org.apache.solr.schema.DateFieldTest
[smoker] [junit4] Completed on J1 in 3.01s, 7 tests, 1 skipped
[smoker] [junit4]
[smoker] [junit4] Suite: org.apache.solr.core.TestCoreContainer
[smoker] [junit4] Completed on J0 in 22.34s, 9 tests
[smoker] [junit4]
[smoker] [junit4] Suite: org.apache.solr.search.TestRecoveryHdfs
[smoker] [junit4] Completed on J0 in 0.04s, 10 tests, 10 skipped
[smoker] [junit4]
[smoker] [junit4] Suite: org.apache.solr.highlight.TestPostingsSolrHighlighter
[smoker] [junit4] Completed on J0 in 1.32s, 13 tests
[smoker] [junit4]
[smoker] [junit4] Suite: org.apache.solr.schema.CurrencyFieldOpenExchangeTest
[smoker] [junit4] Completed on J1 in 2.35s, 10 tests, 1 skipped
[smoker] [junit4]
[smoker] [junit4] Suite: org.apache.solr.TestTrie
[smoker] [junit4] Completed on J0 in 1.99s, 8 tests
[smoker] [junit4]
[smoker] [junit4] Suite: org.apache.solr.request.SimpleFacetsTest
[smoker] [junit4] Completed on J3 in 10.12s, 22 tests
[smoker] [junit4]
[smoker] [junit4] Suite: org.apache.solr.search.function.SortByFunctionTest
[smoker] [junit4] Completed on J1 in 2.04s, 2 tests
[smoker] [junit4]
[smoker] [junit4] Suite: org.apache.solr.rest.TestManagedResource
[smoker] [junit4] Completed on J1 in 0.21s, 2 tests
[smoker] [junit4]
[smoker] [junit4] Suite: org.apache.solr.store.blockcache.BlockCacheTest
[smoker] [junit4] Completed on J0 in 1.34s, 2 tests
[smoker] [junit4]
[smoker] [junit4] Suite: org.apache.solr.CursorPagingTest
[smoker] [junit4] Completed on J2 in 22.67s, 5 tests
[smoker] [junit4]
[smoker] [junit4] Suite: org.apache.solr.search.TestLFUCache
[smoker] [junit4] Completed on J1 in 1.64s, 5 tests
[smoker] [junit4]
[smoker] [junit4] Suite: org.apache.solr.search.similarities.TestDFRSimilarityFactory
[smoker] [junit4] Completed on J2 in 1.27s, 3 tests
[smoker] [junit4]
[smoker] [junit4] Suite: org.apache.solr.handler.CSVRequestHandlerTest
[smoker] [junit4] Completed on J0 in 2.08s, 1 test
[smoker] [junit4]
[smoker] [junit4] Suite: org.apache.solr.cloud.ChaosMonkeyNothingIsSafeTest
[smoker] [junit4] IGNOR/A 0.00s J0 | ChaosMonkeyNothingIsSafeTest.testDistribSearch
[smoker] [junit4] > Assumption #1: 'slow' test group is disabled (@Slow())
[smoker] [junit4] Completed on J0 in 0.01s, 1 test, 1 skipped
[smoker] [junit4]
[smoker] [junit4] Suite: org.apache.solr.spelling.suggest.TestFreeTextSuggestions
[smoker] [junit4] Completed on J2 in 0.72s, 1 test
[smoker] [junit4]
[smoker] [junit4] Suite: org.apache.solr.cloud.TestCloudInspectUtil
[smoker] [junit4] Completed on J2 in 0.04s, 1 test
[smoker] [junit4]
[smoker] [junit4] Suite: org.apache.solr.schema.BadCopyFieldTest
[smoker] [junit4] Completed on J2 in 0.85s, 5 tests
[smoker] [junit4]
[smoker] [junit4] Suite: org.apache.solr.response.TestRawResponseWriter
[smoker] [junit4] Completed on J0 in 1.96s, 3 tests
[smoker] [junit4]
[smoker] [junit4] Suite: org.apache.solr.TestSolrCoreProperties
[smoker] [junit4] Completed on J2 in 5.78s, 1 test
[smoker] [junit4]
[smoker] [junit4] Suite: org.apache.solr.handler.TestReplicationHandler
[smoker] [junit4] IGNOR/A 0.00s J2 | TestReplicationHandler.doTestReplicateAfterWrite2Slave
[smoker] [junit4] > Assumption #1: 'slow' test group is disabled (@Slow())
[smoker] [junit4] IGNOR/A 0.00s J2 | TestReplicationHandler.doTestReplicateAfterCoreReload
[smoker] [junit4] > Assumption #1: 'slow' test group is disabled (@Slow())
[smoker] [junit4] IGNOR/A 0.00s J2 | TestReplicationHandler.doTestStressReplication
[smoker] [junit4] > Assumption #1: 'slow' test group is disabled (@Slow())
[smoker] [junit4] IGNOR/A 0.00s J2 | TestReplicationHandler.doTestRepeater
[smoker] [junit4] > Assumption #1: 'slow' test group is disabled (@Slow())
[smoker] [junit4] IGNOR/A 0.00s J2 | TestReplicationHandler.doTestSnapPullWithMasterUrl
[smoker] [junit4] > Assumption #1: 'slow' test group is disabled (@Slow())
[smoker] [junit4] IGNOR/A 0.00s J2 | TestReplicationHandler.testEmptyCommits
[smoker] [junit4] > Assumption #1: 'slow' test group is disabled (@Slow())
[smoker] [junit4] IGNOR/A 0.00s J2 | TestReplicationHandler.doTestReplicateAfterStartup
[smoker] [junit4] > Assumption #1: 'slow' test group is disabled (@Slow())
[smoker] [junit4] IGNOR/A 0.00s J2 | TestReplicationHandler.doTestIndexAndConfigReplication
[smoker] [junit4] > Assumption #1: 'slow' test group is disabled (@Slow())
[smoker] [junit4] IGNOR/A 0.00s J2 | TestReplicationHandler.doTestStopPoll
[smoker] [junit4] > Assumption #1: 'slow' test group is disabled (@Slow())
[smoker] [junit4] IGNOR/A 0.00s J2 | TestReplicationHandler.doTestIndexAndConfigAliasReplication
[smoker] [junit4] > Assumption #1: 'slow' test group is disabled (@Slow())
[smoker] [junit4] IGNOR/A 0.00s J2 | TestReplicationHandler.testRateLimitedReplication
[smoker] [junit4] > Assumption #1: 'slow' test group is disabled (@Slow())
[smoker] [junit4] IGNOR/A 0.00s J2 | TestReplicationHandler.doTestDetails
[smoker] [junit4] > Assumption #1: 'slow' test group is disabled (@Slow())
[smoker] [junit4] IGNOR/A 0.00s J2 | TestReplicationHandler.testNoWriter
[smoker] [junit4] > Assumption #1: 'slow' test group is disabled (@Slow())
[smoker] [junit4] IGNOR/A 0.00s J2 | TestReplicationHandler.doTestReplicateAfterStartupWithNoActivity
[smoker] [junit4] > Assumption #1: 'slow' test group is disabled (@Slow())
[smoker] [junit4] Completed on J2 in 0.06s, 14 tests, 14 skipped
[smoker] [junit4]
[smoker] [junit4] Suite: org.apache.solr.search.TestRangeQuery
[smoker] [junit4] Completed on J0 in 6.71s, 2 tests
[smoker] [junit4]
[smoker] [junit4] Suite: org.apache.solr.update.processor.RegexBoostProcessorTest
[smoker] [junit4] Completed on J2 in 1.62s, 4 tests
[smoker] [junit4]
[smoker] [junit4] Suite: org.apache.solr.core.TestXIncludeConfig
[smoker] [junit4] Completed on J0 in 1.06s, 1 test
[smoker] [junit4]
[smoker] [junit4] Suite: org.apache.solr.cloud.ZkCLITest
[smoker] [junit4] Completed on J3 in 13.87s, 12 tests
[smoker] [junit4]
[smoker] [junit4] Suite: org.apache.solr.core.TestInfoStreamLogging
[smoker] [junit4] Completed on J2 in 1.37s, 1 test
[smoker] [junit4]
[smoker] [junit4] Suite: org.apache.solr.core.RAMDirectoryFactoryTest
[smoker] [junit4] Completed on J2 in 0.02s, 1 test
[smoker] [junit4]
[smoker] [junit4] Suite: org.apache.solr.internal.csv.writer.CSVConfigGuesserTest
[smoker] [junit4] Completed on J2 in 0.13s, 3 tests
[smoker] [junit4]
[smoker] [junit4] Suite: org.apache.solr.OutputWriterTest
[smoker] [junit4] Completed on J3 in 1.79s, 5 tests
[smoker] [junit4]
[smoker] [junit4] Suite: org.apache.solr.update.processor.ParsingFieldUpdateProcessorsTest
[smoker] [junit4] Completed on J0 in 4.28s, 33 tests
[smoker] [junit4]
[smoker] [junit4] Suite: org.apache.solr.update.TestExceedMaxTermLength
[smoker] [junit4] Completed on J0 in 1.37s, 2 tests
[smoker] [junit4]
[smoker] [junit4] Suite: org.apache.solr.core.TestSolrXml
[smoker] [junit4] Completed on J0 in 1.18s, 21 tests
[smoker] [junit4]
[smoker] [junit4] Suite: org.apache.solr.update.PeerSyncTest
[smoker] [junit4] Completed on J1 in 17.50s, 1 test
[smoker] [junit4]
[smoker] [junit4] Suite: org.apache.solr.spelling.WordBreakSolrSpellCheckerTest
[smoker] [junit4] Completed on J3 in 4.38s, 3 tests
[smoker] [junit4]
[smoker] [junit4] Suite: org.apache.solr.store.hdfs.HdfsLockFactoryTest
[smoker] [junit4] Completed on J3 in 0.08s, 1 test, 1 skipped
[smoker] [junit4]
[smoker] [junit4] Suite: org.apache.solr.cloud.hdfs.HdfsRecoveryZkTest
[smoker] [junit4] IGNOR/A 0.00s J3 | HdfsRecoveryZkTest.testDistribSearch
[smoker] [junit4] > Assumption #1: 'nightly' test group is disabled (@Nightly(value=))
[smoker] [junit4] Completed on J3 in 0.01s, 1 test, 1 skipped
[smoker] [junit4]
[smoker] [junit4] Suite: org.apache.solr.internal.csv.CSVUtilsTest
[smoker] [junit4] Completed on J3 in 0.04s, 14 tests
[smoker] [junit4]
[smoker] [junit4] Suite: org.apache.solr.update.processor.SignatureUpdateProcessorFactoryTest
[smoker] [junit4] Completed on J1 in 2.45s, 6 tests
[smoker] [junit4]
[smoker] [junit4] Suite: org.apache.solr.rest.schema.TestSchemaVersionResource
[smoker] [junit4] Completed on J0 in 6.24s, 1 test
[smoker] [junit4]
[smoker] [junit4] Suite: org.apache.solr.TestJoin
[smoker] [junit4] Completed on J3 in 8.13s, 2 tests
[smoker] [junit4]
[smoker] [junit4] Suite: org.apache.solr.core.TestNonNRTOpen
[smoker] [junit4] Completed on J3 in 2.54s, 2 tests
[smoker] [junit4]
[smoker] [junit4] Suite: org.apache.solr.util.DOMUtilTest
[smoker] [junit4] Completed on J3 in 0.04s, 1 test
[smoker] [junit4]
[smoker] [junit4] Suite: org.apache.solr.core.TestConfigSets
[smoker] [junit4] Completed on J3 in 1.20s, 4 tests
[smoker] [junit4]
[smoker] [junit4] Suite: org.apache.solr.rest.schema.TestFieldTypeCollectionResource
[smoker] [junit4] Completed on J0 in 7.02s, 2 tests
[smoker] [junit4]
[smoker] [junit4] Suite: org.apache.solr.update.SoftAutoCommitTest
[smoker] [junit4] IGNOR/A 0.00s J0 | SoftAutoCommitTest.testSoftAndHardCommitMaxTimeMixedAdds
[smoker] [junit4] > Assumption #1: 'slow' test group is disabled (@Slow())
[smoker] [junit4] IGNOR/A 0.00s J0 | SoftAutoCommitTest.testSoftAndHardCommitMaxTimeDelete
[smoker] [junit4] > Assumption #1: 'slow' test group is disabled (@Slow())
[smoker] [junit4] IGNOR/A 0.00s J0 | SoftAutoCommitTest.testSoftAndHardCommitMaxTimeRapidAdds
[smoker] [junit4] > Assumption #1: 'slow' test group is disabled (@Slow())
[smoker] [junit4] Completed on J0 in 0.01s, 3 tests, 3 skipped
[smoker] [junit4]
[smoker] [junit4] Suite: org.apache.solr.handler.component.StatsComponentTest
[smoker] [junit4] Completed on J2 in 21.66s, 14 tests
[smoker] [junit4]
[smoker] [junit4] Suite: org.apache.solr.core.TestBadConfig
[smoker] [junit4] IGNOR/A 0.11s J3 | TestBadConfig.testMissingScriptFile
[smoker] [junit4] > Assumption #1: got: <[null]>, expected: each not null
[smoker] [junit4] IGNOR/A 0.01s J3 | TestBadConfig.testInvalidScriptFile
[smoker] [junit4] > Assumption #1: got: <[null]>, expected: each not null
[smoker] [junit4] Completed on J3 in 4.97s, 13 tests, 2 skipped
[smoker] [junit4]
[smoker] [junit4] Suite: org.apache.solr.schema.CurrencyFieldXmlFileTest
[smoker] [junit4] Completed on J2 in 2.13s, 11 tests, 1 skipped
[smoker] [junit4]
[smoker] [junit4] Suite: org.apache.solr.cloud.SyncSliceTest
[smoker] [junit4] IGNOR/A 0.00s J2 | SyncSliceTest.testDistribSearch
[smoker] [junit4] > Assumption #1: 'slow' test group is disabled (@Slow())
[smoker] [junit4] Completed on J2 in 0.01s, 1 test, 1 skipped
[smoker] [junit4]
[smoker] [junit4] Suite: org.apache.solr.handler.admin.LoggingHandlerTest
[smoker] [junit4] Completed on J3 in 1.55s, 1 test
[smoker] [junit4]
[smoker] [junit4] Suite: org.apache.solr.rest.schema.TestBulkSchemaAPI
[smoker] [junit4] Completed on J1 in 18.79s, 2 tests
[smoker] [junit4]
[smoker] [junit4] Suite: org.apache.solr.search.TestStressLucene
[smoker] [junit4] Completed on J2 in 3.37s, 1 test
[smoker] [junit4]
[smoker] [junit4] Suite: org.apache.solr.update.processor.PreAnalyzedUpdateProcessorTest
[smoker] [junit4] Completed on J1 in 1.56s, 2 tests
[smoker] [junit4]
[smoker] [junit4] Suite: org.apache.solr.spelling.suggest.SuggesterFSTTest
[smoker] [junit4] Completed on J1 in 3.32s, 4 tests
[smoker] [junit4]
[smoker] [junit4] Suite: org.apache.solr.SampleTest
[smoker] [junit4] Completed on J1 in 1.07s, 2 tests
[smoker] [junit4]
[smoker] [junit4] Suite: org.apache.solr.cloud.TestLeaderElectionZkExpiry
[smoker] [junit4] Completed on J0 in 15.35s, 1 test
[smoker] [junit4]
[smoker] [junit4] Suite: org.apache.solr.search.TestMaxScoreQueryParser
[smoker] [junit4] Completed on J1 in 1.79s, 6 tests
[smoker] [junit4]
[smoker] [junit4] Suite: org.apache.solr.handler.admin.CoreAdminHandlerTest
[smoker] [junit4] Completed on J3 in 10.32s, 4 tests
[smoker] [junit4]
[smoker] [junit4] Suite: org.apache.solr.handler.admin.CoreAdminCreateDiscoverTest
[smoker] [junit4] Completed on J0 in 2.01s, 4 tests
[smoker] [junit4]
[smoker] [junit4] Suite: org.apache.solr.cloud.TestRequestStatusCollectionAPI
[smoker] [junit4] IGNOR/A 0.00s J0 | TestRequestStatusCollectionAPI.testDistribSearch
[smoker] [junit4] > Assumption #1: 'slow' test group is disabled (@Slow())
[smoker] [junit4] Completed on J0 in 0.01s, 1 test, 1 skipped
[smoker] [junit4]
[smoker] [junit4] Suite: org.apache.solr.response.TestCSVResponseWriter
[smoker] [junit4] Completed on J3 in 3.39s, 2 tests
[smoker] [junit4]
[smoker] [junit4] Suite: org.apache.solr.cloud.hdfs.HdfsCollectionsAPIDistributedZkTest
[smoker] [junit4] IGNOR/A 0.00s J3 | HdfsCollectionsAPIDistributedZkTest.testDistribSearch
[smoker] [junit4] > Assumption #1: 'nightly' test group is disabled (@Nightly(value=))
[smoker] [junit4] Completed on J3 in 0.01s, 1 test, 1 skipped
[smoker] [junit4]
[smoker] [junit4] Suite: org.apache.solr.search.RankQueryTest
[smoker] [junit4] Completed on J0 in 2.32s, 1 test
[smoker] [junit4]
[smoker] [junit4] Suite: org.apache.solr.search.similarities.TestNonDefinedSimilarityFactory
[smoker] [junit4] Completed on J3 in 1.52s, 3 tests
[smoker] [junit4]
[smoker] [junit4] Suite: org.apache.solr.internal.csv.CSVStrategyTest
[smoker] [junit4] Completed on J3 in 0.00s, 5 tests
[smoker] [junit4]
[smoker] [junit4] Suite: org.apache.solr.cloud.ReplicationFactorTest
[smoker] [junit4] IGNOR/A 0.00s J3 | ReplicationFactorTest.testDistribSearch
[smoker] [junit4] > Assumption #1: 'slow' test group is disabled (@Slow())
[smoker] [junit4] Completed on J3 in 0.01s, 1 test, 1 skipped
[smoker] [junit4]
[smoker] [junit4] Suite: org.apache.solr.core.TestArbitraryIndexDir
[smoker] [junit4] Completed on J0 in 2.00s, 1 test
[smoker] [junit4]
[smoker] [junit4] Suite: org.apache.solr.search.TestCustomSort
[smoker] [junit4] Completed on J0 in 0.88s, 1 test
[smoker] [junit4]
[smoker] [junit4] Suite: org.apache.solr.handler.DocumentAnalysisRequestHandlerTest
[smoker] [junit4] Completed on J3 in 1.84s, 4 tests
[smoker] [junit4]
[smoker] [junit4] Suite: org.apache.solr.rest.schema.analysis.TestManagedSynonymFilterFactory
[smoker] [junit4] Completed on J2 in 15.68s, 2 tests
[smoker] [junit4]
[smoker] [junit4] Suite: org.apache.solr.cloud.LeaderElectionIntegrationTest
[smoker] [junit4] IGNOR/A 0.00s J2 | LeaderElectionIntegrationTest.testSimpleSliceLeaderElection
[smoker] [junit4] > Assumption #1: 'slow' test group is disabled (@Slow())
[smoker] [junit4] IGNOR/A 0.00s J2 | LeaderElectionIntegrationTest.testLeaderElectionAfterClientTimeout
[smoker] [junit4] > Assumption #1: 'slow' test group is disabled (@Slow())
[smoker] [junit4] Completed on J2 in 0.01s, 2 tests, 2 skipped
[smoker] [junit4]
[smoker] [junit4] Suite: org.apache.solr.request.TestBinaryResponseWriter
[smoker] [junit4] Completed on J0 in 1.83s, 2 tests
[smoker] [junit4]
[smoker] [junit4] Suite: org.apache.solr.cloud.ConnectionManagerTest
[smoker] [junit4] IGNOR/A 0.00s J0 | ConnectionManagerTest.testLikelyExpired
[smoker] [junit4] > Assumption #1: 'slow' test group is disabled (@Slow())
[smoker] [junit4] Completed on J0 in 0.01s, 2 tests, 2 skipped
[smoker] [junit4]
[smoker] [junit4] Suite: org.apache.solr.TestTolerantSearch
[smoker] [junit4] Completed on J1 in 8.93s, 2 tests
[smoker] [junit4]
[smoker] [junit4] Suite: org.apache.solr.handler.XmlUpdateRequestHandlerTest
[smoker] [junit4] Completed on J2 in 2.42s, 5 tests
[smoker] [junit4]
[smoker] [junit4] Suite: org.apache.solr.core.TestSolrDeletionPolicy1
[smoker] [junit4] Completed on J0 in 2.13s, 3 tests
[smoker] [junit4]
[smoker] [junit4] Suite: org.apache.solr.update.DirectUpdateHandlerOptimizeTest
[smoker] [junit4] Completed on J1 in 2.13s, 1 test
[smoker] [junit4]
[smoker] [junit4] Suite: org.apache.solr.cloud.TestMultiCoreConfBootstrap
[smoker] [junit4] Completed on J2 in 3.67s, 1 test
[smoker] [junit4]
[smoker] [junit4] Suite: org.apache.solr.core.CachingDirectoryFactoryTest
[smoker] [junit4] Completed on J3 in 8.25s, 1 test
[smoker] [junit4]
[smoker] [junit4] Suite: org.apache.solr.search.TestFastLRUCache
[smoker] [junit4] Completed on J3 in 0.08s, 7 tests
[smoker] [junit4]
[smoker] [junit4] Suite: org.apache.solr.search.similarities.TestLMJelinekMercerSimilarityFactory
[smoker] [junit4] Completed on J3 in 0.61s, 2 tests
[smoker] [junit4]
[smoker] [junit4] Suite: org.apache.solr.search.TestQueryUtils
[smoker] [junit4] Completed on J2 in 1.98s, 1 test
[smoker] [junit4]
[smoker] [junit4] Suite: org.apache.solr.search.TestStandardQParsers
[smoker] [junit4] Completed on J2 in 0.02s, 1 test
[smoker] [junit4]
[smoker] [junit4] Suite: org.apache.solr.cloud.VMParamsZkACLAndCredentialsProvidersTest
[smoker] [junit4] Completed on J1 in 5.86s, 4 tests
[smoker] [junit4]
[smoker] [junit4] Suite: org.apache.solr.handler.component.SearchHandlerTest
[smoker] [junit4] Completed on J3 in 1.88s, 1 test
[smoker] [junit4]
[smoker] [junit4] Suite: org.apache.solr.search.TestNoOpRegenerator
[smoker] [junit4] Completed on J1 in 1.08s, 1 test
[smoker] [junit4]
[smoker] [junit4] Suite: org.apache.solr.core.SOLR749Test
[smoker] [junit4] Completed on J3 in 2.00s, 2 tests
[smoker] [junit4]
[smoker] [junit4] Suite: org.apache.solr.cloud.CollectionsAPIDistributedZkTest
[smoker] [junit4] IGNOR/A 0.00s J3 | CollectionsAPIDistributedZkTest.testDistribSearch
[smoker] [junit4] > Assumption #1: 'slow' test group is disabled (@Slow())
[smoker] [junit4] Completed on J3 in 0.01s, 1 test, 1 skipped
[smoker] [junit4]
[smoker] [junit4] Suite: org.apache.solr.rest.schema.TestFieldResource
[smoker] [junit4] Completed on J2 in 6.77s, 7 tests
[smoker] [junit4]
[smoker] [junit4] Suite: org.apache.solr.update.SolrIndexSplitterTest
[smoker] [junit4] Completed on J3 in 3.21s, 5 tests
[smoker] [junit4]
[smoker] [junit4] Suite: org.apache.solr.core.QueryResultKeyTest
[smoker] [junit4] Completed on J2 in 0.63s, 4 tests
[smoker] [junit4]
[smoker] [junit4] Suite: org.apache.solr.analysis.TestLuceneMatchVersion
[smoker] [junit4] Completed on J2 in 1.09s, 1 test
[smoker] [junit4]
[smoker] [junit4] Suite: org.apache.solr.update.HardAutoCommitTest
[smoker] [junit4] IGNOR/A 0.00s J2 | HardAutoCommitTest.testCommitWithin
[smoker] [junit4] > Assumption #1: 'slow' test group is disabled (@Slow())
[smoker] [junit4] Completed on J2 in 0.01s, 1 test, 1 skipped
[smoker] [junit4]
[smoker] [junit4] Suite: org.apache.solr.schema.BadIndexSchemaTest
[smoker] [junit4] Completed on J3 in 4.47s, 17 tests
[smoker] [junit4]
[smoker] [junit4] Suite: org.apache.solr.handler.admin.ShowFileRequestHandlerTest
[smoker] [junit4] Completed on J1 in 10.79s, 4 tests
[smoker] [junit4]
[smoker] [junit4] Suite: org.apache.solr.core.TestImplicitCoreProperties
[smoker] [junit4] Completed on J3 in 1.98s, 1 test
[smoker] [junit4]
[smoker] [junit4] Suite: org.apache.solr.search.TestIndexSearcher
[smoker] [junit4] Completed on J3 in 2.30s, 2 tests
[smoker] [junit4]
[smoker] [junit4] Suite: org.apache.solr.cloud.ZkSolrClientTest
[smoker] [junit4] Completed on J0 in 21.13s, 7 tests
[smoker] [junit4]
[smoker] [junit4] Suite: org.apache.solr.spelling.suggest.TestFileDictionaryLookup
[smoker] [junit4] Completed on J3 in 1.01s, 1 test
[smoker] [junit4]
[smoker] [junit4] Suite: org.apache.solr.search.TestQueryTypes
[smoker] [junit4] Completed on J0 in 1.59s, 1 test
[smoker] [junit4]
[smoker] [junit4] Suite: org.apache.solr.update.DirectUpdateHandlerTest
[smoker] [junit4] Completed on J1 in 5.88s, 6 tests
[smoker] [junit4]
[smoker] [junit4] Suite: org.apache.solr.MinimalSchemaTest
[smoker] [junit4] Completed on J0 in 1.88s, 3 tests
[smoker] [junit4]
[smoker] [junit4] Suite: org.apache.solr.search.TestSort
[smoker] [junit4] Completed on J3 in 5.68s, 2 tests
[smoker] [junit4]
[smoker] [junit4] Suite: org.apache.solr.schema.TestManagedSchema
[smoker] [junit4] Completed on J2 in 16.86s, 14 tests
[smoker] [junit4]
[smoker] [junit4] Suite: org.apache.solr.rest.schema.TestSchemaResource
[smoker] [junit4] Completed on J0 in 6.31s, 3 tests
[smoker] [junit4]
[smoker] [junit4] Suite: org.apache.solr.core.TestQuerySenderListener
[smoker] [junit4] Completed on J2 in 1.59s, 3 tests
[smoker] [junit4]
[smoker] [junit4] Suite: org.apache.solr.rest.schema.TestSolrQueryParserDefaultOperatorResource
[smoker] [junit4] Completed on J3 in 10.29s, 1 test
[smoker] [junit4]
[smoker] [junit4] Suite: org.apache.solr.handler.component.SpellCheckComponentTest
[smoker] [junit4] IGNOR/A 0.00s J3 | SpellCheckComponentTest.testPerDictionary
[smoker] [junit4] > Assumption #1: 'slow' test group is disabled (@Slow())
[smoker] [junit4] IGNOR/A 0.00s J3 | SpellCheckComponentTest.testExtendedResultsCount
[smoker] [junit4] > Assumption #1: 'slow' test group is disabled (@Slow())
[smoker] [junit4] IGNOR/A 0.00s J3 | SpellCheckComponentTest.testRelativeIndexDirLocation
[smoker] [junit4] > Assumption #1: 'slow' test group is disabled (@Slow())
[smoker] [junit4] IGNOR/A 0.00s J3 | SpellCheckComponentTest.testRebuildOnCommit
[smoker] [junit4] > Assumption #1: 'slow' test group is disabled (@Slow())
[smoker] [junit4] IGNOR/A 0.00s J3 | SpellCheckComponentTest.testCollate
[smoker] [junit4] > Assumption #1: 'slow' test group is disabled (@Slow())
[smoker] [junit4] IGNOR/A 0.00s J3 | SpellCheckComponentTest.test
[smoker] [junit4] > Assumption #1: 'slow' test group is disabled (@Slow())
[smoker] [junit4] IGNOR/A 0.00s J3 | SpellCheckComponentTest.testReloadOnStart
[smoker] [junit4] > Assumption #1: 'slow' test group is disabled (@Slow())
[smoker] [junit4] IGNOR/A 0.00s J3 | SpellCheckComponentTest.testCorrectSpelling
[smoker] [junit4] > Assumption #1: 'slow' test group is disabled (@Slow())
[smoker] [junit4] IGNOR/A 0.00s J3 | SpellCheckComponentTest.testThresholdTokenFrequency
[smoker] [junit4] > Assumption #1: 'slow' test group is disabled (@Slow())
[smoker] [junit4] Completed on J3 in 0.04s, 9 tests, 9 skipped
[smoker] [junit4]
[smoker] [junit4] Suite: org.apache.solr.EchoParamsTest
[smoker] [junit4] Completed on J3 in 1.48s, 1 test
[smoker] [junit4]
[smoker] [junit4] Suite: org.apache.solr.handler.admin.CoreMergeIndexesAdminHandlerTest
[smoker] [junit4] Completed on J3 in 2.40s, 1 test
[smoker] [junit4]
[smoker] [junit4] Suite: org.apache.solr.search.TestLRUCache
[smoker] [junit4] Completed on J3 in 0.03s, 3 tests
[smoker] [junit4]
[smoker] [junit4] Suite: org.apache.solr.search.TestRealTimeGet
[smoker] [junit4] Completed on J2 in 15.41s, 4 tests
[smoker] [junit4]
[smoker] [junit4] Suite: org.apache.solr.spelling.TestSuggestSpellingConverter
[smoker] [junit4] Completed on J2 in 0.03s, 2 tests
[smoker] [junit4]
[smoker] [junit4] Suite: org.apache.solr.rest.schema.TestCopyFieldCollectionResource
[smoker] [junit4] Completed on J3 in 6.50s, 5 tests
[smoker] [junit4]
[smoker] [junit4] Suite: org.apache.solr.search.TestSolrQueryParser
[smoker] [junit4] Completed on J2 in 1.69s, 5 tests
[smoker] [junit4]
[smoker] [junit4] Suite: org.apache.solr.util.SolrPluginUtilsTest
[smoker] [junit4] Completed on J3 in 1.71s, 7 tests
[smoker] [junit4]
[smoker] [junit4] Suite: org.apache.solr.schema.PolyFieldTest
[smoker] [junit4] Completed on J2 in 1.94s, 4 tests
[smoker] [junit4]
[smoker] [junit4] Suite: org.apache.solr.search.TestRecovery
[smoker] [junit4] Completed on J1 in 30.81s, 11 tests
[smoker] [junit4]
[smoker] [junit4] Suite: org.apache.solr.request.JSONWriterTest
[smoker] [junit4] Completed on J1 in 1.41s, 3 tests
[smoker] [junit4]
[smoker] [junit4] Suite: org.apache.solr.rest.TestRestManager
[smoker] [junit4] Completed on J3 in 6.97s, 5 tests
[smoker] [junit4]
[smoker] [junit4] Suite: org.apache.solr.rest.schema.TestFieldTypeResource
[smoker] [junit4] Completed on J2 in 6.04s, 4 tests
[smoker] [junit4]
[smoker] [junit4] Suite: org.apache.solr.update.processor.UniqFieldsUpdateProcessorFactoryTest
[smoker] [junit4] Completed on J3 in 1.52s, 1 test
[smoker] [junit4]
[smoker] [junit4] Suite: org.apache.solr.util.TimeZoneUtilsTest
[smoker] [junit4] Completed on J3 in 0.16s, 5 tests
[smoker] [junit4]
[smoker] [junit4] Suite: org.apache.solr.BasicFunctionalityTest
[smoker] [junit4] Completed on J2 in 4.09s, 23 tests
[smoker] [junit4]
[smoker] [junit4] Suite: org.apache.solr.schema.TestBinaryField
[smoker] [junit4] Completed on J1 in 5.65s, 1 test
[smoker] [junit4]
[smoker] [junit4] Suite: org.apache.solr.highlight.HighlighterConfigTest
[smoker] [junit4] Completed on J2 in 1.35s, 1 test
[smoker] [junit4]
[smoker] [junit4] Suite: org.apache.solr.search.TestComplexPhraseQParserPlugin
[smoker] [junit4] Completed on J3 in 4.17s, 6 tests
[smoker] [junit4]
[smoker] [junit4] Suite: org.apache.solr.search.TestSearcherReuse
[smoker] [junit4] Completed on J2 in 0.98s, 1 test
[smoker] [junit4]
[smoker] [junit4] Suite: org.apache.solr.schema.ModifyConfFileTest
[smoker] [junit4] Completed on J2 in 1.41s, 1 test
[smoker] [junit4]
[smoker] [junit4] Suite: org.apache.solr.handler.component.DistributedFacetPivotSmallTest
[smoker] [junit4] Completed on J0 in 35.33s, 1 test
[smoker] [junit4]
[smoker] [junit4] Suite: org.apache.solr.cloud.MultiThreadedOCPTest
[smoker] [junit4] IGNOR/A 0.00s J0 | MultiThreadedOCPTest.testDistribSearch
[smoker] [junit4] > Assumption #1: 'slow' test group is disabled (@Slow())
[smoker] [junit4] Completed on J0 in 0.01s, 1 test, 1 skipped
[smoker] [junit4]
[smoker] [junit4] Suite: org.apache.solr.cloud.TestCollectionAPI
[smoker] [junit4] IGNOR/A 0.00s J0 | TestCollectionAPI.testDistribSearch
[smoker] [junit4] > Assumption #1: 'slow' test group is disabled (@Slow())
[smoker] [junit4] Completed on J0 in 0.00s, 1 test, 1 skipped
[smoker] [junit4]
[smoker] [junit4] Suite: org.apache.solr.core.TestSolrXmlPersistor
[smoker] [junit4] Completed on J0 in 0.41s, 7 tests
[smoker] [junit4]
[smoker] [junit4] Suite: org.apache.solr.update.processor.UpdateRequestProcessorFactoryTest
[smoker] [junit4] Completed on J2 in 1.93s, 2 tests
[smoker] [junit4]
[smoker] [junit4] Suite: org.apache.solr.search.CursorMarkTest
[smoker] [junit4] Completed on
[...truncated too long message...]
W][SUITE-SolrExampleXMLTest-seed#[FA8CCFDC75EFE6BD]-worker]: rollback
[smoker] [junit4] 2> 94044 T73 C12 oasu.LoggingInfoStream.message [IW][SUITE-SolrExampleXMLTest-seed#[FA8CCFDC75EFE6BD]-worker]: all running merges have aborted
[smoker] [junit4] 2> 94045 T73 C12 oasu.LoggingInfoStream.message [IW][SUITE-SolrExampleXMLTest-seed#[FA8CCFDC75EFE6BD]-worker]: rollback: done finish merges
[smoker] [junit4] 2> 94045 T73 C12 oasu.LoggingInfoStream.message [DW][SUITE-SolrExampleXMLTest-seed#[FA8CCFDC75EFE6BD]-worker]: abort
[smoker] [junit4] 2> 94045 T73 C12 oasu.LoggingInfoStream.message [DW][SUITE-SolrExampleXMLTest-seed#[FA8CCFDC75EFE6BD]-worker]: done abort; abortedFiles=[] success=true
[smoker] [junit4] 2> 94046 T73 C12 oasu.LoggingInfoStream.message [IW][SUITE-SolrExampleXMLTest-seed#[FA8CCFDC75EFE6BD]-worker]: rollback: infos=_14(6.0.0):C10 _16(6.0.0):C1
[smoker] [junit4] 2> 94046 T73 C12 oasu.LoggingInfoStream.message [IFD][SUITE-SolrExampleXMLTest-seed#[FA8CCFDC75EFE6BD]-worker]: now checkpoint "_14(6.0.0):C10 _16(6.0.0):C1" [2 segments ; isCommit = false]
[smoker] [junit4] 2> 94046 T73 C12 oasu.LoggingInfoStream.message [IFD][SUITE-SolrExampleXMLTest-seed#[FA8CCFDC75EFE6BD]-worker]: 0 msec to checkpoint
[smoker] [junit4] 2> 94047 T73 oasc.SolrCore.closeSearcher [collection1] Closing main searcher on request.
[smoker] [junit4] 2> 94048 T73 oasc.CachingDirectoryFactory.close Closing MockDirectoryFactory - 2 directories currently being tracked
[smoker] [junit4] 2> 94048 T73 oasc.CachingDirectoryFactory.closeCacheValue looking to close /usr/home/jenkins/jenkins-slave/workspace/Lucene-Solr-SmokeRelease-trunk/lucene/build/smokeTestRelease/tmp/unpack/solr-6.0.0/solr/build/solr-solrj/test/J2/temp/solr.client.solrj.SolrExampleXMLTest-FA8CCFDC75EFE6BD-001/tempDir-001/index [CachedDir<<refCount=0;path=/usr/home/jenkins/jenkins-slave/workspace/Lucene-Solr-SmokeRelease-trunk/lucene/build/smokeTestRelease/tmp/unpack/solr-6.0.0/solr/build/solr-solrj/test/J2/temp/solr.client.solrj.SolrExampleXMLTest-FA8CCFDC75EFE6BD-001/tempDir-001/index;done=false>>]
[smoker] [junit4] 2> 94048 T73 oasc.CachingDirectoryFactory.close Closing directory: /usr/home/jenkins/jenkins-slave/workspace/Lucene-Solr-SmokeRelease-trunk/lucene/build/smokeTestRelease/tmp/unpack/solr-6.0.0/solr/build/solr-solrj/test/J2/temp/solr.client.solrj.SolrExampleXMLTest-FA8CCFDC75EFE6BD-001/tempDir-001/index
[smoker] [junit4] 2> 94049 T73 oasc.CachingDirectoryFactory.closeCacheValue looking to close /usr/home/jenkins/jenkins-slave/workspace/Lucene-Solr-SmokeRelease-trunk/lucene/build/smokeTestRelease/tmp/unpack/solr-6.0.0/solr/build/solr-solrj/test/J2/temp/solr.client.solrj.SolrExampleXMLTest-FA8CCFDC75EFE6BD-001/tempDir-001 [CachedDir<<refCount=0;path=/usr/home/jenkins/jenkins-slave/workspace/Lucene-Solr-SmokeRelease-trunk/lucene/build/smokeTestRelease/tmp/unpack/solr-6.0.0/solr/build/solr-solrj/test/J2/temp/solr.client.solrj.SolrExampleXMLTest-FA8CCFDC75EFE6BD-001/tempDir-001;done=false>>]
[smoker] [junit4] 2> 94049 T73 oasc.CachingDirectoryFactory.close Closing directory: /usr/home/jenkins/jenkins-slave/workspace/Lucene-Solr-SmokeRelease-trunk/lucene/build/smokeTestRelease/tmp/unpack/solr-6.0.0/solr/build/solr-solrj/test/J2/temp/solr.client.solrj.SolrExampleXMLTest-FA8CCFDC75EFE6BD-001/tempDir-001
[smoker] [junit4] 2> 94050 T73 oejsh.ContextHandler.doStop stopped o.e.j.s.ServletContextHandler{/solr,null}
[smoker] [junit4] 2> 99050 T73 oas.SolrTestCaseJ4.deleteCore ###deleteCore
[smoker] [junit4] 2> NOTE: leaving temporary files on disk at: /usr/home/jenkins/jenkins-slave/workspace/Lucene-Solr-SmokeRelease-trunk/lucene/build/smokeTestRelease/tmp/unpack/solr-6.0.0/solr/build/solr-solrj/test/J2/temp/solr.client.solrj.SolrExampleXMLTest-FA8CCFDC75EFE6BD-001
[smoker] [junit4] 2> NOTE: test params are: codec=Asserting(Lucene50): {}, docValues:{}, sim=RandomSimilarityProvider(queryNorm=false,coord=crazy): {}, locale=lt, timezone=Europe/Isle_of_Man
[smoker] [junit4] 2> NOTE: FreeBSD 9.1-RELEASE-p3 amd64/Oracle Corporation 1.7.0_65 (64-bit)/cpus=16,threads=1,free=58140120,total=263192576
[smoker] [junit4] 2> NOTE: All tests run in this JVM: [SolrParamTest, TermsResponseTest, TestBatchUpdate, SolrExampleEmbeddedTest, MergeIndexesEmbeddedTest, LargeVolumeEmbeddedTest, SolrExampleXMLTest]
[smoker] [junit4] Completed on J2 in 15.07s, 28 tests, 1 error <<< FAILURES!
[smoker] [junit4]
[smoker] [junit4] Suite: org.apache.solr.common.util.TestJavaBinCodec
[smoker] [junit4] Completed on J2 in 0.30s, 6 tests
[smoker] [junit4]
[smoker] [junit4] Suite: org.apache.solr.client.solrj.request.TestUpdateRequestCodec
[smoker] [junit4] Completed on J2 in 0.04s, 3 tests
[smoker] [junit4]
[smoker] [junit4] Suite: org.apache.solr.common.params.ModifiableSolrParamsTest
[smoker] [junit4] Completed on J2 in 0.05s, 5 tests
[smoker] [junit4]
[smoker] [junit4] Suite: org.apache.solr.client.solrj.response.AnlysisResponseBaseTest
[smoker] [junit4] Completed on J2 in 0.03s, 2 tests
[smoker] [junit4]
[smoker] [junit4] Suite: org.apache.solr.client.solrj.impl.ConcurrentUpdateSolrServerTest
[smoker] [junit4] Completed on J0 in 11.77s, 1 test
[smoker] [junit4]
[smoker] [junit4] Suite: org.apache.solr.client.solrj.embedded.LargeVolumeJettyTest
[smoker] [junit4] Completed on J2 in 6.72s, 1 test
[smoker] [junit4]
[smoker] [junit4]
[smoker] [junit4] Tests with failures:
[smoker] [junit4] - org.apache.solr.client.solrj.SolrExampleBinaryTest.testExampleConfig
[smoker] [junit4] - org.apache.solr.client.solrj.embedded.SolrExampleJettyTest.testExampleConfig
[smoker] [junit4] - org.apache.solr.client.solrj.SolrExampleXMLTest.testExampleConfig
[smoker] [junit4]
[smoker] [junit4]
[smoker] [junit4] JVM J0: 7.17 .. 122.91 = 115.75s
[smoker] [junit4] JVM J1: 7.90 .. 118.50 = 110.60s
[smoker] [junit4] JVM J2: 7.90 .. 127.03 = 119.12s
[smoker] [junit4] JVM J3: 7.40 .. 114.27 = 106.87s
[smoker] [junit4] Execution time total: 2 minutes 7 seconds
[smoker] [junit4] Tests summary: 53 suites, 314 tests, 3 errors, 64 ignored (64 assumptions)
[smoker]
[smoker] BUILD FAILED
[smoker] /usr/home/jenkins/jenkins-slave/workspace/Lucene-Solr-SmokeRelease-trunk/lucene/build/smokeTestRelease/tmp/unpack/solr-6.0.0/solr/build.xml:202: The following error occurred while executing this line:
[smoker] /usr/home/jenkins/jenkins-slave/workspace/Lucene-Solr-SmokeRelease-trunk/lucene/build/smokeTestRelease/tmp/unpack/solr-6.0.0/solr/common-build.xml:496: The following error occurred while executing this line:
[smoker] /usr/home/jenkins/jenkins-slave/workspace/Lucene-Solr-SmokeRelease-trunk/lucene/build/smokeTestRelease/tmp/unpack/solr-6.0.0/lucene/common-build.xml:1359: The following error occurred while executing this line:
[smoker] /usr/home/jenkins/jenkins-slave/workspace/Lucene-Solr-SmokeRelease-trunk/lucene/build/smokeTestRelease/tmp/unpack/solr-6.0.0/lucene/common-build.xml:961: There were test failures: 53 suites, 314 tests, 3 errors, 64 ignored (64 assumptions)
[smoker]
[smoker] Total time: 11 minutes 51 seconds
[smoker] Traceback (most recent call last):
[smoker] File "/usr/home/jenkins/jenkins-slave/workspace/Lucene-Solr-SmokeRelease-trunk/dev-tools/sc
[smoker]
[smoker] ripts/smokeTestRelease.py", line 1505, in <module>
[smoker] main()
[smoker] File "/usr/home/jenkins/jenkins-slave/workspace/Lucene-Solr-SmokeRelease-trunk/dev-tools/scripts/smokeTestRelease.py", line 1450, in main
[smoker] smokeTest(c.java, c.url, c.revision, c.version, c.tmp_dir, c.is_signed, ' '.join(c.test_args))
[smoker] File "/usr/home/jenkins/jenkins-slave/workspace/Lucene-Solr-SmokeRelease-trunk/dev-tools/scripts/smokeTestRelease.py", line 1495, in smokeTest
[smoker] unpackAndVerify(java, 'solr', tmpDir, 'solr-%s-src.tgz' % version, svnRevision, version, testArgs, baseURL)
[smoker] File "/usr/home/jenkins/jenkins-slave/workspace/Lucene-Solr-SmokeRelease-trunk/dev-tools/scripts/smokeTestRelease.py", line 616, in unpackAndVerify
[smoker] verifyUnpacked(java, project, artifact, unpackPath, svnRevision, version, testArgs, tmpDir, baseURL)
[smoker] File "/usr/home/jenkins/jenkins-slave/workspace/Lucene-Solr-SmokeRelease-trunk/dev-tools/scripts/smokeTestRelease.py", line 734, in verifyUnpacked
[smoker] java.run_java7('ant clean test -Dtests.slow=false %s' % testArgs, '%s/test.log' % unpackPath)
[smoker] File "/usr/home/jenkins/jenkins-slave/workspace/Lucene-Solr-SmokeRelease-trunk/dev-tools/scripts/smokeTestRelease.py", line 1281, in run_java
[smoker] run('%s; %s' % (cmd_prefix, cmd), logfile)
[smoker] File "/usr/home/jenkins/jenkins-slave/workspace/Lucene-Solr-SmokeRelease-trunk/dev-tools/scripts/smokeTestRelease.py", line 541, in run
[smoker] raise RuntimeError('command "%s" failed; see log file %s' % (command, logPath))
[smoker] RuntimeError: command "export JAVA_HOME="/home/jenkins/tools/java/latest1.7" PATH="/home/jenkins/tools/java/latest1.7/bin:$PATH" JAVACMD="/home/jenkins/tools/java/latest1.7/bin/java"; ant clean test -Dtests.slow=false -Dtests.jettyConnector=Socket -Dtests.disableHdfs=true -Dtests.multiplier=1 -Dtests.slow=false" failed; see log file /usr/home/jenkins/jenkins-slave/workspace/Lucene-Solr-SmokeRelease-trunk/lucene/build/smokeTestRelease/tmp/unpack/solr-6.0.0/test.log
BUILD FAILED
/usr/home/jenkins/jenkins-slave/workspace/Lucene-Solr-SmokeRelease-trunk/build.xml:409: exec returned: 1
Total time: 67 minutes 47 seconds
Build step 'Invoke Ant' marked build as failure
Email was triggered for: Failure
Sending email for trigger: Failure