You are viewing a plain text version of this content. The canonical link for it is here.
Posted to dev@lucene.apache.org by Policeman Jenkins Server <je...@thetaphi.de> on 2018/08/17 08:48:10 UTC

[JENKINS] Lucene-Solr-7.x-Linux (64bit/jdk1.8.0_172) - Build # 2573 - Unstable!

Build: https://jenkins.thetaphi.de/job/Lucene-Solr-7.x-Linux/2573/
Java: 64bit/jdk1.8.0_172 -XX:-UseCompressedOops -XX:+UseParallelGC

1 tests failed.
FAILED:  org.apache.solr.cloud.TestWithCollection.testDeleteWithCollection

Error Message:
Error from server at https://127.0.0.1:34311/solr: Could not find collection : testDeleteWithCollection_abc_2

Stack Trace:
org.apache.solr.client.solrj.impl.HttpSolrClient$RemoteSolrException: Error from server at https://127.0.0.1:34311/solr: Could not find collection : testDeleteWithCollection_abc_2
	at __randomizedtesting.SeedInfo.seed([288F3D28BE3E1F12:5356CAC5E7A4CDAC]:0)
	at org.apache.solr.client.solrj.impl.HttpSolrClient.executeMethod(HttpSolrClient.java:643)
	at org.apache.solr.client.solrj.impl.HttpSolrClient.request(HttpSolrClient.java:255)
	at org.apache.solr.client.solrj.impl.HttpSolrClient.request(HttpSolrClient.java:244)
	at org.apache.solr.client.solrj.impl.LBHttpSolrClient.doRequest(LBHttpSolrClient.java:483)
	at org.apache.solr.client.solrj.impl.LBHttpSolrClient.request(LBHttpSolrClient.java:413)
	at org.apache.solr.client.solrj.impl.CloudSolrClient.sendRequest(CloudSolrClient.java:1109)
	at org.apache.solr.client.solrj.impl.CloudSolrClient.requestWithRetryOnStaleState(CloudSolrClient.java:886)
	at org.apache.solr.client.solrj.impl.CloudSolrClient.request(CloudSolrClient.java:819)
	at org.apache.solr.client.solrj.SolrRequest.process(SolrRequest.java:194)
	at org.apache.solr.client.solrj.SolrRequest.process(SolrRequest.java:211)
	at org.apache.solr.cloud.TestWithCollection.testDeleteWithCollection(TestWithCollection.java:224)
	at sun.reflect.NativeMethodAccessorImpl.invoke0(Native Method)
	at sun.reflect.NativeMethodAccessorImpl.invoke(NativeMethodAccessorImpl.java:62)
	at sun.reflect.DelegatingMethodAccessorImpl.invoke(DelegatingMethodAccessorImpl.java:43)
	at java.lang.reflect.Method.invoke(Method.java:498)
	at com.carrotsearch.randomizedtesting.RandomizedRunner.invoke(RandomizedRunner.java:1737)
	at com.carrotsearch.randomizedtesting.RandomizedRunner$8.evaluate(RandomizedRunner.java:934)
	at com.carrotsearch.randomizedtesting.RandomizedRunner$9.evaluate(RandomizedRunner.java:970)
	at com.carrotsearch.randomizedtesting.RandomizedRunner$10.evaluate(RandomizedRunner.java:984)
	at com.carrotsearch.randomizedtesting.rules.SystemPropertiesRestoreRule$1.evaluate(SystemPropertiesRestoreRule.java:57)
	at org.apache.lucene.util.TestRuleSetupTeardownChained$1.evaluate(TestRuleSetupTeardownChained.java:49)
	at org.apache.lucene.util.AbstractBeforeAfterRule$1.evaluate(AbstractBeforeAfterRule.java:45)
	at org.apache.lucene.util.TestRuleThreadAndTestName$1.evaluate(TestRuleThreadAndTestName.java:48)
	at org.apache.lucene.util.TestRuleIgnoreAfterMaxFailures$1.evaluate(TestRuleIgnoreAfterMaxFailures.java:64)
	at org.apache.lucene.util.TestRuleMarkFailure$1.evaluate(TestRuleMarkFailure.java:47)
	at com.carrotsearch.randomizedtesting.rules.StatementAdapter.evaluate(StatementAdapter.java:36)
	at com.carrotsearch.randomizedtesting.ThreadLeakControl$StatementRunner.run(ThreadLeakControl.java:368)
	at com.carrotsearch.randomizedtesting.ThreadLeakControl.forkTimeoutingTask(ThreadLeakControl.java:817)
	at com.carrotsearch.randomizedtesting.ThreadLeakControl$3.evaluate(ThreadLeakControl.java:468)
	at com.carrotsearch.randomizedtesting.RandomizedRunner.runSingleTest(RandomizedRunner.java:943)
	at com.carrotsearch.randomizedtesting.RandomizedRunner$5.evaluate(RandomizedRunner.java:829)
	at com.carrotsearch.randomizedtesting.RandomizedRunner$6.evaluate(RandomizedRunner.java:879)
	at com.carrotsearch.randomizedtesting.RandomizedRunner$7.evaluate(RandomizedRunner.java:890)
	at com.carrotsearch.randomizedtesting.rules.StatementAdapter.evaluate(StatementAdapter.java:36)
	at com.carrotsearch.randomizedtesting.rules.SystemPropertiesRestoreRule$1.evaluate(SystemPropertiesRestoreRule.java:57)
	at org.apache.lucene.util.AbstractBeforeAfterRule$1.evaluate(AbstractBeforeAfterRule.java:45)
	at com.carrotsearch.randomizedtesting.rules.StatementAdapter.evaluate(StatementAdapter.java:36)
	at org.apache.lucene.util.TestRuleStoreClassName$1.evaluate(TestRuleStoreClassName.java:41)
	at com.carrotsearch.randomizedtesting.rules.NoShadowingOrOverridesOnMethodsRule$1.evaluate(NoShadowingOrOverridesOnMethodsRule.java:40)
	at com.carrotsearch.randomizedtesting.rules.NoShadowingOrOverridesOnMethodsRule$1.evaluate(NoShadowingOrOverridesOnMethodsRule.java:40)
	at com.carrotsearch.randomizedtesting.rules.StatementAdapter.evaluate(StatementAdapter.java:36)
	at com.carrotsearch.randomizedtesting.rules.StatementAdapter.evaluate(StatementAdapter.java:36)
	at com.carrotsearch.randomizedtesting.rules.StatementAdapter.evaluate(StatementAdapter.java:36)
	at org.apache.lucene.util.TestRuleAssertionsRequired$1.evaluate(TestRuleAssertionsRequired.java:53)
	at org.apache.lucene.util.TestRuleMarkFailure$1.evaluate(TestRuleMarkFailure.java:47)
	at org.apache.lucene.util.TestRuleIgnoreAfterMaxFailures$1.evaluate(TestRuleIgnoreAfterMaxFailures.java:64)
	at org.apache.lucene.util.TestRuleIgnoreTestSuites$1.evaluate(TestRuleIgnoreTestSuites.java:54)
	at com.carrotsearch.randomizedtesting.rules.StatementAdapter.evaluate(StatementAdapter.java:36)
	at com.carrotsearch.randomizedtesting.ThreadLeakControl$StatementRunner.run(ThreadLeakControl.java:368)
	at java.lang.Thread.run(Thread.java:748)




Build Log:
[...truncated 14221 lines...]
   [junit4] Suite: org.apache.solr.cloud.TestWithCollection
   [junit4]   2> Creating dataDir: /home/jenkins/workspace/Lucene-Solr-7.x-Linux/solr/build/solr-core/test/J2/temp/solr.cloud.TestWithCollection_288F3D28BE3E1F12-001/init-core-data-001
   [junit4]   2> 1853938 WARN  (SUITE-TestWithCollection-seed#[288F3D28BE3E1F12]-worker) [    ] o.a.s.SolrTestCaseJ4 startTrackingSearchers: numOpens=9 numCloses=9
   [junit4]   2> 1853938 INFO  (SUITE-TestWithCollection-seed#[288F3D28BE3E1F12]-worker) [    ] o.a.s.SolrTestCaseJ4 Using PointFields (NUMERIC_POINTS_SYSPROP=true) w/NUMERIC_DOCVALUES_SYSPROP=false
   [junit4]   2> 1853939 INFO  (SUITE-TestWithCollection-seed#[288F3D28BE3E1F12]-worker) [    ] o.a.s.SolrTestCaseJ4 Randomized ssl (true) and clientAuth (false) via: @org.apache.solr.util.RandomizeSSL(reason=, value=NaN, ssl=NaN, clientAuth=NaN)
   [junit4]   2> 1853939 INFO  (SUITE-TestWithCollection-seed#[288F3D28BE3E1F12]-worker) [    ] o.a.s.SolrTestCaseJ4 SecureRandom sanity checks: test.solr.allowed.securerandom=null & java.security.egd=file:/dev/./urandom
   [junit4]   2> 1853939 INFO  (SUITE-TestWithCollection-seed#[288F3D28BE3E1F12]-worker) [    ] o.a.s.c.MiniSolrCloudCluster Starting cluster of 2 servers in /home/jenkins/workspace/Lucene-Solr-7.x-Linux/solr/build/solr-core/test/J2/temp/solr.cloud.TestWithCollection_288F3D28BE3E1F12-001/tempDir-001
   [junit4]   2> 1853939 INFO  (SUITE-TestWithCollection-seed#[288F3D28BE3E1F12]-worker) [    ] o.a.s.c.ZkTestServer STARTING ZK TEST SERVER
   [junit4]   2> 1853940 INFO  (Thread-5988) [    ] o.a.s.c.ZkTestServer client port:0.0.0.0/0.0.0.0:0
   [junit4]   2> 1853940 INFO  (Thread-5988) [    ] o.a.s.c.ZkTestServer Starting server
   [junit4]   2> 1853942 ERROR (Thread-5988) [    ] o.a.z.s.ZooKeeperServer ZKShutdownHandler is not registered, so ZooKeeper server won't take any action on ERROR or SHUTDOWN server state changes
   [junit4]   2> 1854040 INFO  (SUITE-TestWithCollection-seed#[288F3D28BE3E1F12]-worker) [    ] o.a.s.c.ZkTestServer start zk server on port:40291
   [junit4]   2> 1854043 INFO  (zkConnectionManagerCallback-6715-thread-1) [    ] o.a.s.c.c.ConnectionManager zkClient has connected
   [junit4]   2> 1854049 INFO  (jetty-launcher-6712-thread-2) [    ] o.e.j.s.Server jetty-9.4.11.v20180605; built: 2018-06-05T18:24:03.829Z; git: d5fc0523cfa96bfebfbda19606cad384d772f04c; jvm 1.8.0_172-b11
   [junit4]   2> 1854049 INFO  (jetty-launcher-6712-thread-1) [    ] o.e.j.s.Server jetty-9.4.11.v20180605; built: 2018-06-05T18:24:03.829Z; git: d5fc0523cfa96bfebfbda19606cad384d772f04c; jvm 1.8.0_172-b11
   [junit4]   2> 1854050 INFO  (jetty-launcher-6712-thread-2) [    ] o.e.j.s.session DefaultSessionIdManager workerName=node0
   [junit4]   2> 1854050 INFO  (jetty-launcher-6712-thread-2) [    ] o.e.j.s.session No SessionScavenger set, using defaults
   [junit4]   2> 1854050 INFO  (jetty-launcher-6712-thread-2) [    ] o.e.j.s.session node0 Scavenging every 660000ms
   [junit4]   2> 1854050 INFO  (jetty-launcher-6712-thread-1) [    ] o.e.j.s.session DefaultSessionIdManager workerName=node0
   [junit4]   2> 1854050 INFO  (jetty-launcher-6712-thread-1) [    ] o.e.j.s.session No SessionScavenger set, using defaults
   [junit4]   2> 1854050 INFO  (jetty-launcher-6712-thread-1) [    ] o.e.j.s.session node0 Scavenging every 660000ms
   [junit4]   2> 1854050 INFO  (jetty-launcher-6712-thread-2) [    ] o.e.j.s.h.ContextHandler Started o.e.j.s.ServletContextHandler@b5110d8{/solr,null,AVAILABLE}
   [junit4]   2> 1854050 INFO  (jetty-launcher-6712-thread-1) [    ] o.e.j.s.h.ContextHandler Started o.e.j.s.ServletContextHandler@3461cc26{/solr,null,AVAILABLE}
   [junit4]   2> 1854053 INFO  (jetty-launcher-6712-thread-1) [    ] o.e.j.s.AbstractConnector Started ServerConnector@22229e2{SSL,[ssl, http/1.1]}{127.0.0.1:34311}
   [junit4]   2> 1854053 INFO  (jetty-launcher-6712-thread-2) [    ] o.e.j.s.AbstractConnector Started ServerConnector@d1f5dd7{SSL,[ssl, http/1.1]}{127.0.0.1:44399}
   [junit4]   2> 1854053 INFO  (jetty-launcher-6712-thread-1) [    ] o.e.j.s.Server Started @1854079ms
   [junit4]   2> 1854053 INFO  (jetty-launcher-6712-thread-2) [    ] o.e.j.s.Server Started @1854079ms
   [junit4]   2> 1854053 INFO  (jetty-launcher-6712-thread-1) [    ] o.a.s.c.s.e.JettySolrRunner Jetty properties: {hostContext=/solr, hostPort=34311}
   [junit4]   2> 1854053 INFO  (jetty-launcher-6712-thread-2) [    ] o.a.s.c.s.e.JettySolrRunner Jetty properties: {hostContext=/solr, hostPort=44399}
   [junit4]   2> 1854053 ERROR (jetty-launcher-6712-thread-1) [    ] o.a.s.u.StartupLoggingUtils Missing Java Option solr.log.dir. Logging may be missing or incomplete.
   [junit4]   2> 1854053 ERROR (jetty-launcher-6712-thread-2) [    ] o.a.s.u.StartupLoggingUtils Missing Java Option solr.log.dir. Logging may be missing or incomplete.
   [junit4]   2> 1854053 INFO  (jetty-launcher-6712-thread-1) [    ] o.a.s.s.SolrDispatchFilter Using logger factory org.apache.logging.slf4j.Log4jLoggerFactory
   [junit4]   2> 1854053 INFO  (jetty-launcher-6712-thread-2) [    ] o.a.s.s.SolrDispatchFilter Using logger factory org.apache.logging.slf4j.Log4jLoggerFactory
   [junit4]   2> 1854054 INFO  (jetty-launcher-6712-thread-1) [    ] o.a.s.s.SolrDispatchFilter  ___      _       Welcome to Apache Solr™ version 7.5.0
   [junit4]   2> 1854054 INFO  (jetty-launcher-6712-thread-2) [    ] o.a.s.s.SolrDispatchFilter  ___      _       Welcome to Apache Solr™ version 7.5.0
   [junit4]   2> 1854054 INFO  (jetty-launcher-6712-thread-1) [    ] o.a.s.s.SolrDispatchFilter / __| ___| |_ _   Starting in cloud mode on port null
   [junit4]   2> 1854054 INFO  (jetty-launcher-6712-thread-2) [    ] o.a.s.s.SolrDispatchFilter / __| ___| |_ _   Starting in cloud mode on port null
   [junit4]   2> 1854054 INFO  (jetty-launcher-6712-thread-1) [    ] o.a.s.s.SolrDispatchFilter \__ \/ _ \ | '_|  Install dir: null
   [junit4]   2> 1854054 INFO  (jetty-launcher-6712-thread-2) [    ] o.a.s.s.SolrDispatchFilter \__ \/ _ \ | '_|  Install dir: null
   [junit4]   2> 1854054 INFO  (jetty-launcher-6712-thread-1) [    ] o.a.s.s.SolrDispatchFilter |___/\___/_|_|    Start time: 2018-08-17T08:10:59.976Z
   [junit4]   2> 1854054 INFO  (jetty-launcher-6712-thread-2) [    ] o.a.s.s.SolrDispatchFilter |___/\___/_|_|    Start time: 2018-08-17T08:10:59.976Z
   [junit4]   2> 1854055 INFO  (zkConnectionManagerCallback-6719-thread-1) [    ] o.a.s.c.c.ConnectionManager zkClient has connected
   [junit4]   2> 1854055 INFO  (zkConnectionManagerCallback-6718-thread-1) [    ] o.a.s.c.c.ConnectionManager zkClient has connected
   [junit4]   2> 1854055 INFO  (jetty-launcher-6712-thread-1) [    ] o.a.s.s.SolrDispatchFilter solr.xml found in ZooKeeper. Loading...
   [junit4]   2> 1854055 INFO  (jetty-launcher-6712-thread-2) [    ] o.a.s.s.SolrDispatchFilter solr.xml found in ZooKeeper. Loading...
   [junit4]   2> 1854115 INFO  (jetty-launcher-6712-thread-1) [    ] o.a.s.c.ZkContainer Zookeeper client=127.0.0.1:40291/solr
   [junit4]   2> 1854116 INFO  (zkConnectionManagerCallback-6723-thread-1) [    ] o.a.s.c.c.ConnectionManager zkClient has connected
   [junit4]   2> 1854117 INFO  (zkConnectionManagerCallback-6725-thread-1) [    ] o.a.s.c.c.ConnectionManager zkClient has connected
   [junit4]   2> 1854145 INFO  (jetty-launcher-6712-thread-1) [n:127.0.0.1:34311_solr    ] o.a.s.c.OverseerElectionContext I am going to be the leader 127.0.0.1:34311_solr
   [junit4]   2> 1854145 INFO  (jetty-launcher-6712-thread-1) [n:127.0.0.1:34311_solr    ] o.a.s.c.Overseer Overseer (id=72063435752538116-127.0.0.1:34311_solr-n_0000000000) starting
   [junit4]   2> 1854148 INFO  (zkConnectionManagerCallback-6732-thread-1) [    ] o.a.s.c.c.ConnectionManager zkClient has connected
   [junit4]   2> 1854149 INFO  (jetty-launcher-6712-thread-1) [n:127.0.0.1:34311_solr    ] o.a.s.c.s.i.ZkClientClusterStateProvider Cluster at 127.0.0.1:40291/solr ready
   [junit4]   2> 1854149 INFO  (OverseerStateUpdate-72063435752538116-127.0.0.1:34311_solr-n_0000000000) [    ] o.a.s.c.Overseer Starting to work on the main queue : 127.0.0.1:34311_solr
   [junit4]   2> 1854150 DEBUG (OverseerAutoScalingTriggerThread-72063435752538116-127.0.0.1:34311_solr-n_0000000000) [    ] o.a.s.c.a.OverseerTriggerThread Adding .auto_add_replicas and .scheduled_maintenance triggers
   [junit4]   2> 1854150 INFO  (jetty-launcher-6712-thread-1) [n:127.0.0.1:34311_solr    ] o.a.s.c.ZkController Register node as live in ZooKeeper:/live_nodes/127.0.0.1:34311_solr
   [junit4]   2> 1854150 DEBUG (OverseerAutoScalingTriggerThread-72063435752538116-127.0.0.1:34311_solr-n_0000000000) [    ] o.a.s.c.a.OverseerTriggerThread Refreshing /autoscaling.json with znode version 1
   [junit4]   2> 1854150 INFO  (zkCallback-6731-thread-1) [    ] o.a.s.c.c.ZkStateReader Updated live nodes from ZooKeeper... (0) -> (1)
   [junit4]   2> 1854150 INFO  (zkCallback-6724-thread-1) [    ] o.a.s.c.c.ZkStateReader Updated live nodes from ZooKeeper... (0) -> (1)
   [junit4]   2> 1854150 DEBUG (OverseerAutoScalingTriggerThread-72063435752538116-127.0.0.1:34311_solr-n_0000000000) [    ] o.a.s.c.a.OverseerTriggerThread Current znodeVersion 1, lastZnodeVersion -1
   [junit4]   2> 1854150 DEBUG (OverseerAutoScalingTriggerThread-72063435752538116-127.0.0.1:34311_solr-n_0000000000) [    ] o.a.s.c.a.OverseerTriggerThread Processed trigger updates upto znodeVersion 1
   [junit4]   2> 1854151 DEBUG (OverseerAutoScalingTriggerThread-72063435752538116-127.0.0.1:34311_solr-n_0000000000) [    ] o.a.s.c.a.NodeLostTrigger NodeLostTrigger .auto_add_replicas - Initial livenodes: [127.0.0.1:34311_solr]
   [junit4]   2> 1854152 DEBUG (OverseerAutoScalingTriggerThread-72063435752538116-127.0.0.1:34311_solr-n_0000000000) [    ] o.a.s.c.a.OverseerTriggerThread -- clean old nodeAdded markers
   [junit4]   2> 1854152 DEBUG (OverseerAutoScalingTriggerThread-72063435752538116-127.0.0.1:34311_solr-n_0000000000) [    ] o.a.s.c.a.OverseerTriggerThread Current znodeVersion 1, lastZnodeVersion 1
   [junit4]   2> 1854152 DEBUG (ScheduledTrigger-8345-thread-1) [    ] o.a.s.c.a.NodeLostTrigger Running NodeLostTrigger: .auto_add_replicas with currently live nodes: 1
   [junit4]   2> 1854160 INFO  (jetty-launcher-6712-thread-1) [n:127.0.0.1:34311_solr    ] o.a.s.h.a.MetricsHistoryHandler No .system collection, keeping metrics history in memory.
   [junit4]   2> 1854175 INFO  (jetty-launcher-6712-thread-1) [n:127.0.0.1:34311_solr    ] o.a.s.m.r.SolrJmxReporter JMX monitoring for 'solr_34311.solr.node' (registry 'solr.node') enabled at server: com.sun.jmx.mbeanserver.JmxMBeanServer@2df92738
   [junit4]   2> 1854179 INFO  (jetty-launcher-6712-thread-1) [n:127.0.0.1:34311_solr    ] o.a.s.m.r.SolrJmxReporter JMX monitoring for 'solr_34311.solr.jvm' (registry 'solr.jvm') enabled at server: com.sun.jmx.mbeanserver.JmxMBeanServer@2df92738
   [junit4]   2> 1854179 INFO  (jetty-launcher-6712-thread-1) [n:127.0.0.1:34311_solr    ] o.a.s.m.r.SolrJmxReporter JMX monitoring for 'solr_34311.solr.jetty' (registry 'solr.jetty') enabled at server: com.sun.jmx.mbeanserver.JmxMBeanServer@2df92738
   [junit4]   2> 1854179 INFO  (jetty-launcher-6712-thread-1) [n:127.0.0.1:34311_solr    ] o.a.s.c.CorePropertiesLocator Found 0 core definitions underneath /home/jenkins/workspace/Lucene-Solr-7.x-Linux/solr/build/solr-core/test/J2/temp/solr.cloud.TestWithCollection_288F3D28BE3E1F12-001/tempDir-001/node1/.
   [junit4]   2> 1854190 INFO  (jetty-launcher-6712-thread-2) [    ] o.a.s.c.ZkContainer Zookeeper client=127.0.0.1:40291/solr
   [junit4]   2> 1854191 INFO  (zkConnectionManagerCallback-6737-thread-1) [    ] o.a.s.c.c.ConnectionManager zkClient has connected
   [junit4]   2> 1854192 INFO  (zkConnectionManagerCallback-6739-thread-1) [    ] o.a.s.c.c.ConnectionManager zkClient has connected
   [junit4]   2> 1854195 INFO  (jetty-launcher-6712-thread-2) [n:127.0.0.1:44399_solr    ] o.a.s.c.c.ZkStateReader Updated live nodes from ZooKeeper... (0) -> (1)
   [junit4]   2> 1854196 INFO  (jetty-launcher-6712-thread-2) [n:127.0.0.1:44399_solr    ] o.a.s.c.TransientSolrCoreCacheDefault Allocating transient cache for 2147483647 transient cores
   [junit4]   2> 1854196 INFO  (jetty-launcher-6712-thread-2) [n:127.0.0.1:44399_solr    ] o.a.s.c.ZkController Register node as live in ZooKeeper:/live_nodes/127.0.0.1:44399_solr
   [junit4]   2> 1854196 INFO  (zkCallback-6731-thread-1) [    ] o.a.s.c.c.ZkStateReader Updated live nodes from ZooKeeper... (1) -> (2)
   [junit4]   2> 1854196 INFO  (zkCallback-6724-thread-1) [    ] o.a.s.c.c.ZkStateReader Updated live nodes from ZooKeeper... (1) -> (2)
   [junit4]   2> 1854196 INFO  (zkCallback-6738-thread-1) [    ] o.a.s.c.c.ZkStateReader Updated live nodes from ZooKeeper... (1) -> (2)
   [junit4]   2> 1854207 INFO  (zkConnectionManagerCallback-6746-thread-1) [    ] o.a.s.c.c.ConnectionManager zkClient has connected
   [junit4]   2> 1854208 INFO  (jetty-launcher-6712-thread-2) [n:127.0.0.1:44399_solr    ] o.a.s.c.c.ZkStateReader Updated live nodes from ZooKeeper... (0) -> (2)
   [junit4]   2> 1854208 INFO  (jetty-launcher-6712-thread-2) [n:127.0.0.1:44399_solr    ] o.a.s.c.s.i.ZkClientClusterStateProvider Cluster at 127.0.0.1:40291/solr ready
   [junit4]   2> 1854208 INFO  (jetty-launcher-6712-thread-2) [n:127.0.0.1:44399_solr    ] o.a.s.h.a.MetricsHistoryHandler No .system collection, keeping metrics history in memory.
   [junit4]   2> 1854224 INFO  (jetty-launcher-6712-thread-2) [n:127.0.0.1:44399_solr    ] o.a.s.m.r.SolrJmxReporter JMX monitoring for 'solr_44399.solr.node' (registry 'solr.node') enabled at server: com.sun.jmx.mbeanserver.JmxMBeanServer@2df92738
   [junit4]   2> 1854228 INFO  (jetty-launcher-6712-thread-2) [n:127.0.0.1:44399_solr    ] o.a.s.m.r.SolrJmxReporter JMX monitoring for 'solr_44399.solr.jvm' (registry 'solr.jvm') enabled at server: com.sun.jmx.mbeanserver.JmxMBeanServer@2df92738
   [junit4]   2> 1854228 INFO  (jetty-launcher-6712-thread-2) [n:127.0.0.1:44399_solr    ] o.a.s.m.r.SolrJmxReporter JMX monitoring for 'solr_44399.solr.jetty' (registry 'solr.jetty') enabled at server: com.sun.jmx.mbeanserver.JmxMBeanServer@2df92738
   [junit4]   2> 1854228 INFO  (jetty-launcher-6712-thread-2) [n:127.0.0.1:44399_solr    ] o.a.s.c.CorePropertiesLocator Found 0 core definitions underneath /home/jenkins/workspace/Lucene-Solr-7.x-Linux/solr/build/solr-core/test/J2/temp/solr.cloud.TestWithCollection_288F3D28BE3E1F12-001/tempDir-001/node2/.
   [junit4]   2> 1854243 INFO  (zkConnectionManagerCallback-6749-thread-1) [    ] o.a.s.c.c.ConnectionManager zkClient has connected
   [junit4]   2> 1854245 INFO  (zkConnectionManagerCallback-6754-thread-1) [    ] o.a.s.c.c.ConnectionManager zkClient has connected
   [junit4]   2> 1854246 INFO  (SUITE-TestWithCollection-seed#[288F3D28BE3E1F12]-worker) [    ] o.a.s.c.c.ZkStateReader Updated live nodes from ZooKeeper... (0) -> (2)
   [junit4]   2> 1854246 INFO  (SUITE-TestWithCollection-seed#[288F3D28BE3E1F12]-worker) [    ] o.a.s.c.s.i.ZkClientClusterStateProvider Cluster at 127.0.0.1:40291/solr ready
   [junit4]   2> 1854313 INFO  (TEST-TestWithCollection.testMoveReplicaMainCollection-seed#[288F3D28BE3E1F12]) [    ] o.a.s.SolrTestCaseJ4 ###Starting testMoveReplicaMainCollection
   [junit4]   2> 1854314 DEBUG (zkCallback-6731-thread-1) [    ] o.a.s.c.a.OverseerTriggerThread Refreshing /autoscaling.json with znode version 2
   [junit4]   2> 1854314 DEBUG (OverseerAutoScalingTriggerThread-72063435752538116-127.0.0.1:34311_solr-n_0000000000) [    ] o.a.s.c.a.OverseerTriggerThread Processed trigger updates upto znodeVersion 2
   [junit4]   2> 1854315 INFO  (TEST-TestWithCollection.testMoveReplicaMainCollection-seed#[288F3D28BE3E1F12]) [    ] o.a.s.c.c.ZkStateReader Updated live nodes from ZooKeeper... (0) -> (2)
   [junit4]   2> 1854318 DEBUG (OverseerAutoScalingTriggerThread-72063435752538116-127.0.0.1:34311_solr-n_0000000000) [    ] o.a.s.c.a.OverseerTriggerThread -- clean old nodeLost markers
   [junit4]   2> 1854318 DEBUG (OverseerAutoScalingTriggerThread-72063435752538116-127.0.0.1:34311_solr-n_0000000000) [    ] o.a.s.c.a.OverseerTriggerThread -- clean old nodeAdded markers
   [junit4]   2> 1854318 DEBUG (OverseerAutoScalingTriggerThread-72063435752538116-127.0.0.1:34311_solr-n_0000000000) [    ] o.a.s.c.a.OverseerTriggerThread Current znodeVersion 2, lastZnodeVersion 2
   [junit4]   2> 1854337 INFO  (qtp1501380926-25570) [n:127.0.0.1:34311_solr    ] o.a.s.s.HttpSolrCall [admin] webapp=null path=/admin/metrics params={prefix=CONTAINER.fs.usableSpace,CORE.coreName&wt=javabin&version=2&group=solr.node,solr.core} status=0 QTime=0
   [junit4]   2> 1854341 INFO  (qtp694349042-25569) [n:127.0.0.1:44399_solr    ] o.a.s.s.HttpSolrCall [admin] webapp=null path=/admin/metrics params={prefix=CONTAINER.fs.usableSpace,CORE.coreName&wt=javabin&version=2&group=solr.node,solr.core} status=0 QTime=0
   [junit4]   2> 1854341 DEBUG (qtp694349042-25565) [n:127.0.0.1:44399_solr    ] o.a.s.c.a.AutoScalingHandler Verified autoscaling configuration
   [junit4]   2> 1854342 INFO  (qtp694349042-25565) [n:127.0.0.1:44399_solr    ] o.a.s.s.HttpSolrCall [admin] webapp=null path=/cluster/autoscaling params={wt=javabin&version=2} status=0 QTime=15
   [junit4]   2> 1854342 INFO  (TEST-TestWithCollection.testMoveReplicaMainCollection-seed#[288F3D28BE3E1F12]) [    ] o.a.s.c.TestWithCollection Chosen node 127.0.0.1:44399_solr for collection testMoveReplicaMainCollection_abc
   [junit4]   2> 1854342 DEBUG (zkCallback-6731-thread-1) [    ] o.a.s.c.a.OverseerTriggerThread Refreshing /autoscaling.json with znode version 3
   [junit4]   2> 1854342 DEBUG (OverseerAutoScalingTriggerThread-72063435752538116-127.0.0.1:34311_solr-n_0000000000) [    ] o.a.s.c.a.OverseerTriggerThread Processed trigger updates upto znodeVersion 3
   [junit4]   2> 1854342 DEBUG (OverseerAutoScalingTriggerThread-72063435752538116-127.0.0.1:34311_solr-n_0000000000) [    ] o.a.s.c.a.OverseerTriggerThread -- clean old nodeLost markers
   [junit4]   2> 1854343 DEBUG (OverseerAutoScalingTriggerThread-72063435752538116-127.0.0.1:34311_solr-n_0000000000) [    ] o.a.s.c.a.OverseerTriggerThread -- clean old nodeAdded markers
   [junit4]   2> 1854343 DEBUG (OverseerAutoScalingTriggerThread-72063435752538116-127.0.0.1:34311_solr-n_0000000000) [    ] o.a.s.c.a.OverseerTriggerThread Current znodeVersion 3, lastZnodeVersion 3
   [junit4]   2> 1854345 INFO  (qtp1501380926-25570) [n:127.0.0.1:34311_solr    ] o.a.s.h.a.CollectionsHandler Invoked Collection Action :create with params pullReplicas=0&name=testMoveReplicaMainCollection_abc&nrtReplicas=1&action=CREATE&numShards=1&tlogReplicas=0&createNodeSet=127.0.0.1:44399_solr&wt=javabin&version=2 and sendToOCPQueue=true
   [junit4]   2> 1854345 INFO  (OverseerThreadFactory-8347-thread-1) [    ] o.a.s.c.a.c.CreateCollectionCmd Create collection testMoveReplicaMainCollection_abc
   [junit4]   2> 1854346 INFO  (OverseerThreadFactory-8347-thread-1) [    ] o.a.s.c.c.ZkConfigManager Copying zk node /configs/_default/protwords.txt to /configs/testMoveReplicaMainCollection_abc.AUTOCREATED/protwords.txt
   [junit4]   2> 1854346 INFO  (OverseerThreadFactory-8347-thread-1) [    ] o.a.s.c.c.ZkConfigManager Copying zk node /configs/_default/managed-schema to /configs/testMoveReplicaMainCollection_abc.AUTOCREATED/managed-schema
   [junit4]   2> 1854347 INFO  (OverseerThreadFactory-8347-thread-1) [    ] o.a.s.c.c.ZkConfigManager Copying zk node /configs/_default/solrconfig.xml to /configs/testMoveReplicaMainCollection_abc.AUTOCREATED/solrconfig.xml
   [junit4]   2> 1854347 INFO  (OverseerThreadFactory-8347-thread-1) [    ] o.a.s.c.c.ZkConfigManager Copying zk node /configs/_default/synonyms.txt to /configs/testMoveReplicaMainCollection_abc.AUTOCREATED/synonyms.txt
   [junit4]   2> 1854348 INFO  (OverseerThreadFactory-8347-thread-1) [    ] o.a.s.c.c.ZkConfigManager Copying zk node /configs/_default/stopwords.txt to /configs/testMoveReplicaMainCollection_abc.AUTOCREATED/stopwords.txt
   [junit4]   2> 1854348 INFO  (OverseerThreadFactory-8347-thread-1) [    ] o.a.s.c.c.ZkConfigManager Copying zk node /configs/_default/lang/contractions_it.txt to /configs/testMoveReplicaMainCollection_abc.AUTOCREATED/lang/contractions_it.txt
   [junit4]   2> 1854349 INFO  (OverseerThreadFactory-8347-thread-1) [    ] o.a.s.c.c.ZkConfigManager Copying zk node /configs/_default/lang/stemdict_nl.txt to /configs/testMoveReplicaMainCollection_abc.AUTOCREATED/lang/stemdict_nl.txt
   [junit4]   2> 1854349 INFO  (OverseerThreadFactory-8347-thread-1) [    ] o.a.s.c.c.ZkConfigManager Copying zk node /configs/_default/lang/stopwords_hy.txt to /configs/testMoveReplicaMainCollection_abc.AUTOCREATED/lang/stopwords_hy.txt
   [junit4]   2> 1854350 INFO  (OverseerThreadFactory-8347-thread-1) [    ] o.a.s.c.c.ZkConfigManager Copying zk node /configs/_default/lang/stopwords_no.txt to /configs/testMoveReplicaMainCollection_abc.AUTOCREATED/lang/stopwords_no.txt
   [junit4]   2> 1854350 INFO  (OverseerThreadFactory-8347-thread-1) [    ] o.a.s.c.c.ZkConfigManager Copying zk node /configs/_default/lang/contractions_ca.txt to /configs/testMoveReplicaMainCollection_abc.AUTOCREATED/lang/contractions_ca.txt
   [junit4]   2> 1854351 INFO  (OverseerThreadFactory-8347-thread-1) [    ] o.a.s.c.c.ZkConfigManager Copying zk node /configs/_default/lang/stopwords_id.txt to /configs/testMoveReplicaMainCollection_abc.AUTOCREATED/lang/stopwords_id.txt
   [junit4]   2> 1854351 INFO  (OverseerThreadFactory-8347-thread-1) [    ] o.a.s.c.c.ZkConfigManager Copying zk node /configs/_default/lang/stopwords_ga.txt to /configs/testMoveReplicaMainCollection_abc.AUTOCREATED/lang/stopwords_ga.txt
   [junit4]   2> 1854352 INFO  (OverseerThreadFactory-8347-thread-1) [    ] o.a.s.c.c.ZkConfigManager Copying zk node /configs/_default/lang/stopwords_hi.txt to /configs/testMoveReplicaMainCollection_abc.AUTOCREATED/lang/stopwords_hi.txt
   [junit4]   2> 1854352 INFO  (OverseerThreadFactory-8347-thread-1) [    ] o.a.s.c.c.ZkConfigManager Copying zk node /configs/_default/lang/stopwords_da.txt to /configs/testMoveReplicaMainCollection_abc.AUTOCREATED/lang/stopwords_da.txt
   [junit4]   2> 1854353 INFO  (OverseerThreadFactory-8347-thread-1) [    ] o.a.s.c.c.ZkConfigManager Copying zk node /configs/_default/lang/stopwords_ja.txt to /configs/testMoveReplicaMainCollection_abc.AUTOCREATED/lang/stopwords_ja.txt
   [junit4]   2> 1854353 INFO  (OverseerThreadFactory-8347-thread-1) [    ] o.a.s.c.c.ZkConfigManager Copying zk node /configs/_default/lang/stopwords_pt.txt to /configs/testMoveReplicaMainCollection_abc.AUTOCREATED/lang/stopwords_pt.txt
   [junit4]   2> 1854354 INFO  (OverseerThreadFactory-8347-thread-1) [    ] o.a.s.c.c.ZkConfigManager Copying zk node /configs/_default/lang/stopwords_hu.txt to /configs/testMoveReplicaMainCollection_abc.AUTOCREATED/lang/stopwords_hu.txt
   [junit4]   2> 1854354 INFO  (OverseerThreadFactory-8347-thread-1) [    ] o.a.s.c.c.ZkConfigManager Copying zk node /configs/_default/lang/stopwords_el.txt to /configs/testMoveReplicaMainCollection_abc.AUTOCREATED/lang/stopwords_el.txt
   [junit4]   2> 1854355 INFO  (OverseerThreadFactory-8347-thread-1) [    ] o.a.s.c.c.ZkConfigManager Copying zk node /configs/_default/lang/stopwords_ru.txt to /configs/testMoveReplicaMainCollection_abc.AUTOCREATED/lang/stopwords_ru.txt
   [junit4]   2> 1854355 INFO  (OverseerThreadFactory-8347-thread-1) [    ] o.a.s.c.c.ZkConfigManager Copying zk node /configs/_default/lang/stopwords_tr.txt to /configs/testMoveReplicaMainCollection_abc.AUTOCREATED/lang/stopwords_tr.txt
   [junit4]   2> 1854356 INFO  (OverseerThreadFactory-8347-thread-1) [    ] o.a.s.c.c.ZkConfigManager Copying zk node /configs/_default/lang/stopwords_ar.txt to /configs/testMoveReplicaMainCollection_abc.AUTOCREATED/lang/stopwords_ar.txt
   [junit4]   2> 1854356 INFO  (OverseerThreadFactory-8347-thread-1) [    ] o.a.s.c.c.ZkConfigManager Copying zk node /configs/_default/lang/userdict_ja.txt to /configs/testMoveReplicaMainCollection_abc.AUTOCREATED/lang/userdict_ja.txt
   [junit4]   2> 1854357 INFO  (OverseerThreadFactory-8347-thread-1) [    ] o.a.s.c.c.ZkConfigManager Copying zk node /configs/_default/lang/stopwords_eu.txt to /configs/testMoveReplicaMainCollection_abc.AUTOCREATED/lang/stopwords_eu.txt
   [junit4]   2> 1854357 INFO  (OverseerThreadFactory-8347-thread-1) [    ] o.a.s.c.c.ZkConfigManager Copying zk node /configs/_default/lang/stopwords_it.txt to /configs/testMoveReplicaMainCollection_abc.AUTOCREATED/lang/stopwords_it.txt
   [junit4]   2> 1854358 INFO  (OverseerThreadFactory-8347-thread-1) [    ] o.a.s.c.c.ZkConfigManager Copying zk node /configs/_default/lang/stopwords_cz.txt to /configs/testMoveReplicaMainCollection_abc.AUTOCREATED/lang/stopwords_cz.txt
   [junit4]   2> 1854358 INFO  (OverseerThreadFactory-8347-thread-1) [    ] o.a.s.c.c.ZkConfigManager Copying zk node /configs/_default/lang/stoptags_ja.txt to /configs/testMoveReplicaMainCollection_abc.AUTOCREATED/lang/stoptags_ja.txt
   [junit4]   2> 1854358 INFO  (OverseerThreadFactory-8347-thread-1) [    ] o.a.s.c.c.ZkConfigManager Copying zk node /configs/_default/lang/contractions_fr.txt to /configs/testMoveReplicaMainCollection_abc.AUTOCREATED/lang/contractions_fr.txt
   [junit4]   2> 1854359 INFO  (OverseerThreadFactory-8347-thread-1) [    ] o.a.s.c.c.ZkConfigManager Copying zk node /configs/_default/lang/stopwords_de.txt to /configs/testMoveReplicaMainCollection_abc.AUTOCREATED/lang/stopwords_de.txt
   [junit4]   2> 1854359 INFO  (OverseerThreadFactory-8347-thread-1) [    ] o.a.s.c.c.ZkConfigManager Copying zk node /configs/_default/lang/stopwords_fa.txt to /configs/testMoveReplicaMainCollection_abc.AUTOCREATED/lang/stopwords_fa.txt
   [junit4]   2> 1854360 INFO  (OverseerThreadFactory-8347-thread-1) [    ] o.a.s.c.c.ZkConfigManager Copying zk node /configs/_default/lang/contractions_ga.txt to /configs/testMoveReplicaMainCollection_abc.AUTOCREATED/lang/contractions_ga.txt
   [junit4]   2> 1854360 INFO  (OverseerThreadFactory-8347-thread-1) [    ] o.a.s.c.c.ZkConfigManager Copying zk node /configs/_default/lang/stopwords_ca.txt to /configs/testMoveReplicaMainCollection_abc.AUTOCREATED/lang/stopwords_ca.txt
   [junit4]   2> 1854361 INFO  (OverseerThreadFactory-8347-thread-1) [    ] o.a.s.c.c.ZkConfigManager Copying zk node /configs/_default/lang/stopwords_nl.txt to /configs/testMoveReplicaMainCollection_abc.AUTOCREATED/lang/stopwords_nl.txt
   [junit4]   2> 1854361 INFO  (OverseerThreadFactory-8347-thread-1) [    ] o.a.s.c.c.ZkConfigManager Copying zk node /configs/_default/lang/stopwords_bg.txt to /configs/testMoveReplicaMainCollection_abc.AUTOCREATED/lang/stopwords_bg.txt
   [junit4]   2> 1854362 INFO  (OverseerThreadFactory-8347-thread-1) [    ] o.a.s.c.c.ZkConfigManager Copying zk node /configs/_default/lang/stopwords_lv.txt to /configs/testMoveReplicaMainCollection_abc.AUTOCREATED/lang/stopwords_lv.txt
   [junit4]   2> 1854362 INFO  (OverseerThreadFactory-8347-thread-1) [    ] o.a.s.c.c.ZkConfigManager Copying zk node /configs/_default/lang/stopwords_en.txt to /configs/testMoveReplicaMainCollection_abc.AUTOCREATED/lang/stopwords_en.txt
   [junit4]   2> 1854363 INFO  (OverseerThreadFactory-8347-thread-1) [    ] o.a.s.c.c.ZkConfigManager Copying zk node /configs/_default/lang/stopwords_es.txt to /configs/testMoveReplicaMainCollection_abc.AUTOCREATED/lang/stopwords_es.txt
   [junit4]   2> 1854363 INFO  (OverseerThreadFactory-8347-thread-1) [    ] o.a.s.c.c.ZkConfigManager Copying zk node /configs/_default/lang/stopwords_th.txt to /configs/testMoveReplicaMainCollection_abc.AUTOCREATED/lang/stopwords_th.txt
   [junit4]   2> 1854364 INFO  (OverseerThreadFactory-8347-thread-1) [    ] o.a.s.c.c.ZkConfigManager Copying zk node /configs/_default/lang/stopwords_ro.txt to /configs/testMoveReplicaMainCollection_abc.AUTOCREATED/lang/stopwords_ro.txt
   [junit4]   2> 1854364 INFO  (OverseerThreadFactory-8347-thread-1) [    ] o.a.s.c.c.ZkConfigManager Copying zk node /configs/_default/lang/stopwords_fr.txt to /configs/testMoveReplicaMainCollection_abc.AUTOCREATED/lang/stopwords_fr.txt
   [junit4]   2> 1854365 INFO  (OverseerThreadFactory-8347-thread-1) [    ] o.a.s.c.c.ZkConfigManager Copying zk node /configs/_default/lang/stopwords_sv.txt to /configs/testMoveReplicaMainCollection_abc.AUTOCREATED/lang/stopwords_sv.txt
   [junit4]   2> 1854365 INFO  (OverseerThreadFactory-8347-thread-1) [    ] o.a.s.c.c.ZkConfigManager Copying zk node /configs/_default/lang/stopwords_fi.txt to /configs/testMoveReplicaMainCollection_abc.AUTOCREATED/lang/stopwords_fi.txt
   [junit4]   2> 1854366 INFO  (OverseerThreadFactory-8347-thread-1) [    ] o.a.s.c.c.ZkConfigManager Copying zk node /configs/_default/lang/hyphenations_ga.txt to /configs/testMoveReplicaMainCollection_abc.AUTOCREATED/lang/hyphenations_ga.txt
   [junit4]   2> 1854367 INFO  (OverseerThreadFactory-8347-thread-1) [    ] o.a.s.c.c.ZkConfigManager Copying zk node /configs/_default/lang/stopwords_gl.txt to /configs/testMoveReplicaMainCollection_abc.AUTOCREATED/lang/stopwords_gl.txt
   [junit4]   2> 1854367 INFO  (OverseerThreadFactory-8347-thread-1) [    ] o.a.s.c.c.ZkConfigManager Copying zk node /configs/_default/params.json to /configs/testMoveReplicaMainCollection_abc.AUTOCREATED/params.json
   [junit4]   2> 1854471 DEBUG (OverseerThreadFactory-8347-thread-1) [    ] o.a.s.c.s.c.a.PolicyHelper Creating a new session
   [junit4]   2> 1854474 INFO  (qtp1501380926-25637) [n:127.0.0.1:34311_solr    ] o.a.s.s.HttpSolrCall [admin] webapp=null path=/admin/metrics params={prefix=CONTAINER.fs.usableSpace,CONTAINER.fs.totalSpace,CORE.coreName&wt=javabin&version=2&group=solr.node,solr.core} status=0 QTime=0
   [junit4]   2> 1854476 INFO  (qtp694349042-25565) [n:127.0.0.1:44399_solr    ] o.a.s.s.HttpSolrCall [admin] webapp=null path=/admin/metrics params={prefix=CONTAINER.fs.usableSpace,CONTAINER.fs.totalSpace,CORE.coreName&wt=javabin&version=2&group=solr.node,solr.core} status=0 QTime=0
   [junit4]   2> 1854476 DEBUG (OverseerThreadFactory-8347-thread-1) [    ] o.a.s.c.s.c.a.PolicyHelper New session created 
   [junit4]   2> 1854477 INFO  (OverseerThreadFactory-8347-thread-1) [    ] o.a.s.c.s.c.a.PolicyHelper returnSession, curr-time 89138027 sessionWrapper.createTime 89138027056966, this.sessionWrapper.createTime 89138027056966 
   [junit4]   2> 1854479 INFO  (OverseerStateUpdate-72063435752538116-127.0.0.1:34311_solr-n_0000000000) [    ] o.a.s.c.o.SliceMutator createReplica() {
   [junit4]   2>   "operation":"ADDREPLICA",
   [junit4]   2>   "collection":"testMoveReplicaMainCollection_abc",
   [junit4]   2>   "shard":"shard1",
   [junit4]   2>   "core":"testMoveReplicaMainCollection_abc_shard1_replica_n1",
   [junit4]   2>   "state":"down",
   [junit4]   2>   "base_url":"https://127.0.0.1:44399/solr",
   [junit4]   2>   "type":"NRT",
   [junit4]   2>   "waitForFinalState":"false"} 
   [junit4]   2> 1854682 INFO  (qtp694349042-25558) [n:127.0.0.1:44399_solr    x:testMoveReplicaMainCollection_abc_shard1_replica_n1] o.a.s.h.a.CoreAdminOperation core create command qt=/admin/cores&coreNodeName=core_node2&collection.configName=testMoveReplicaMainCollection_abc.AUTOCREATED&newCollection=true&name=testMoveReplicaMainCollection_abc_shard1_replica_n1&action=CREATE&numShards=1&collection=testMoveReplicaMainCollection_abc&shard=shard1&wt=javabin&version=2&replicaType=NRT
   [junit4]   2> 1855693 INFO  (qtp694349042-25558) [n:127.0.0.1:44399_solr c:testMoveReplicaMainCollection_abc s:shard1 r:core_node2 x:testMoveReplicaMainCollection_abc_shard1_replica_n1] o.a.s.c.RequestParams conf resource params.json loaded . version : 0 
   [junit4]   2> 1855693 INFO  (qtp694349042-25558) [n:127.0.0.1:44399_solr c:testMoveReplicaMainCollection_abc s:shard1 r:core_node2 x:testMoveReplicaMainCollection_abc_shard1_replica_n1] o.a.s.c.RequestParams request params refreshed to version 0
   [junit4]   2> 1855694 WARN  (qtp694349042-25558) [n:127.0.0.1:44399_solr c:testMoveReplicaMainCollection_abc s:shard1 r:core_node2 x:testMoveReplicaMainCollection_abc_shard1_replica_n1] o.a.s.c.SolrConfig Couldn't add files from /home/jenkins/workspace/Lucene-Solr-7.x-Linux/solr/build/solr-core/test/J2/temp/solr.cloud.TestWithCollection_288F3D28BE3E1F12-001/tempDir-001/node2/testMoveReplicaMainCollection_abc_shard1_replica_n1/../../../../contrib/extraction/lib filtered by .*\.jar to classpath: /home/jenkins/workspace/Lucene-Solr-7.x-Linux/solr/build/solr-core/test/J2/temp/solr.cloud.TestWithCollection_288F3D28BE3E1F12-001/tempDir-001/node2/testMoveReplicaMainCollection_abc_shard1_replica_n1/../../../../contrib/extraction/lib
   [junit4]   2> 1855694 WARN  (qtp694349042-25558) [n:127.0.0.1:44399_solr c:testMoveReplicaMainCollection_abc s:shard1 r:core_node2 x:testMoveReplicaMainCollection_abc_shard1_replica_n1] o.a.s.c.SolrConfig Couldn't add files from /home/jenkins/workspace/Lucene-Solr-7.x-Linux/solr/build/solr-core/test/J2/temp/solr.cloud.TestWithCollection_288F3D28BE3E1F12-001/tempDir-001/node2/testMoveReplicaMainCollection_abc_shard1_replica_n1/../../../../dist filtered by solr-cell-\d.*\.jar to classpath: /home/jenkins/workspace/Lucene-Solr-7.x-Linux/solr/build/solr-core/test/J2/temp/solr.cloud.TestWithCollection_288F3D28BE3E1F12-001/tempDir-001/node2/testMoveReplicaMainCollection_abc_shard1_replica_n1/../../../../dist
   [junit4]   2> 1855694 WARN  (qtp694349042-25558) [n:127.0.0.1:44399_solr c:testMoveReplicaMainCollection_abc s:shard1 r:core_node2 x:testMoveReplicaMainCollection_abc_shard1_replica_n1] o.a.s.c.SolrConfig Couldn't add files from /home/jenkins/workspace/Lucene-Solr-7.x-Linux/solr/build/solr-core/test/J2/temp/solr.cloud.TestWithCollection_288F3D28BE3E1F12-001/tempDir-001/node2/testMoveReplicaMainCollection_abc_shard1_replica_n1/../../../../contrib/clustering/lib filtered by .*\.jar to classpath: /home/jenkins/workspace/Lucene-Solr-7.x-Linux/solr/build/solr-core/test/J2/temp/solr.cloud.TestWithCollection_288F3D28BE3E1F12-001/tempDir-001/node2/testMoveReplicaMainCollection_abc_shard1_replica_n1/../../../../contrib/clustering/lib
   [junit4]   2> 1855694 WARN  (qtp694349042-25558) [n:127.0.0.1:44399_solr c:testMoveReplicaMainCollection_abc s:shard1 r:core_node2 x:testMoveReplicaMainCollection_abc_shard1_replica_n1] o.a.s.c.SolrConfig Couldn't add files from /home/jenkins/workspace/Lucene-Solr-7.x-Linux/solr/build/solr-core/test/J2/temp/solr.cloud.TestWithCollection_288F3D28BE3E1F12-001/tempDir-001/node2/testMoveReplicaMainCollection_abc_shard1_replica_n1/../../../../dist filtered by solr-clustering-\d.*\.jar to classpath: /home/jenkins/workspace/Lucene-Solr-7.x-Linux/solr/build/solr-core/test/J2/temp/solr.cloud.TestWithCollection_288F3D28BE3E1F12-001/tempDir-001/node2/testMoveReplicaMainCollection_abc_shard1_replica_n1/../../../../dist
   [junit4]   2> 1855694 WARN  (qtp694349042-25558) [n:127.0.0.1:44399_solr c:testMoveReplicaMainCollection_abc s:shard1 r:core_node2 x:testMoveReplicaMainCollection_abc_shard1_replica_n1] o.a.s.c.SolrConfig Couldn't add files from /home/jenkins/workspace/Lucene-Solr-7.x-Linux/solr/build/solr-core/test/J2/temp/solr.cloud.TestWithCollection_288F3D28BE3E1F12-001/tempDir-001/node2/testMoveReplicaMainCollection_abc_shard1_replica_n1/../../../../contrib/langid/lib filtered by .*\.jar to classpath: /home/jenkins/workspace/Lucene-Solr-7.x-Linux/solr/build/solr-core/test/J2/temp/solr.cloud.TestWithCollection_288F3D28BE3E1F12-001/tempDir-001/node2/testMoveReplicaMainCollection_abc_shard1_replica_n1/../../../../contrib/langid/lib
   [junit4]   2> 1855694 WARN  (qtp694349042-25558) [n:127.0.0.1:44399_solr c:testMoveReplicaMainCollection_abc s:shard1 r:core_node2 x:testMoveReplicaMainCollection_abc_shard1_replica_n1] o.a.s.c.SolrConfig Couldn't add files from /home/jenkins/workspace/Lucene-Solr-7.x-Linux/solr/build/solr-core/test/J2/temp/solr.cloud.TestWithCollection_288F3D28BE3E1F12-001/tempDir-001/node2/testMoveReplicaMainCollection_abc_shard1_replica_n1/../../../../dist filtered by solr-langid-\d.*\.jar to classpath: /home/jenkins/workspace/Lucene-Solr-7.x-Linux/solr/build/solr-core/test/J2/temp/solr.cloud.TestWithCollection_288F3D28BE3E1F12-001/tempDir-001/node2/testMoveReplicaMainCollection_abc_shard1_replica_n1/../../../../dist
   [junit4]   2> 1855694 WARN  (qtp694349042-25558) [n:127.0.0.1:44399_solr c:testMoveReplicaMainCollection_abc s:shard1 r:core_node2 x:testMoveReplicaMainCollection_abc_shard1_replica_n1] o.a.s.c.SolrConfig Couldn't add files from /home/jenkins/workspace/Lucene-Solr-7.x-Linux/solr/build/solr-core/test/J2/temp/solr.cloud.TestWithCollection_288F3D28BE3E1F12-001/tempDir-001/node2/testMoveReplicaMainCollection_abc_shard1_replica_n1/../../../../contrib/velocity/lib filtered by .*\.jar to classpath: /home/jenkins/workspace/Lucene-Solr-7.x-Linux/solr/build/solr-core/test/J2/temp/solr.cloud.TestWithCollection_288F3D28BE3E1F12-001/tempDir-001/node2/testMoveReplicaMainCollection_abc_shard1_replica_n1/../../../../contrib/velocity/lib
   [junit4]   2> 1855694 WARN  (qtp694349042-25558) [n:127.0.0.1:44399_solr c:testMoveReplicaMainCollection_abc s:shard1 r:core_node2 x:testMoveReplicaMainCollection_abc_shard1_replica_n1] o.a.s.c.SolrConfig Couldn't add files from /home/jenkins/workspace/Lucene-Solr-7.x-Linux/solr/build/solr-core/test/J2/temp/solr.cloud.TestWithCollection_288F3D28BE3E1F12-001/tempDir-001/node2/testMoveReplicaMainCollection_abc_shard1_replica_n1/../../../../dist filtered by solr-velocity-\d.*\.jar to classpath: /home/jenkins/workspace/Lucene-Solr-7.x-Linux/solr/build/solr-core/test/J2/temp/solr.cloud.TestWithCollection_288F3D28BE3E1F12-001/tempDir-001/node2/testMoveReplicaMainCollection_abc_shard1_replica_n1/../../../../dist
   [junit4]   2> 1855698 INFO  (qtp694349042-25558) [n:127.0.0.1:44399_solr c:testMoveReplicaMainCollection_abc s:shard1 r:core_node2 x:testMoveReplicaMainCollection_abc_shard1_replica_n1] o.a.s.c.SolrConfig Using Lucene MatchVersion: 7.5.0
   [junit4]   2> 1855718 INFO  (qtp694349042-25558) [n:127.0.0.1:44399_solr c:testMoveReplicaMainCollection_abc s:shard1 r:core_node2 x:testMoveReplicaMainCollection_abc_shard1_replica_n1] o.a.s.s.IndexSchema [testMoveReplicaMainCollection_abc_shard1_replica_n1] Schema name=default-config
   [junit4]   2> 1855798 INFO  (qtp694349042-25558) [n:127.0.0.1:44399_solr c:testMoveReplicaMainCollection_abc s:shard1 r:core_node2 x:testMoveReplicaMainCollection_abc_shard1_replica_n1] o.a.s.s.IndexSchema Loaded schema default-config/1.6 with uniqueid field id
   [junit4]   2> 1855809 INFO  (qtp694349042-25558) [n:127.0.0.1:44399_solr c:testMoveReplicaMainCollection_abc s:shard1 r:core_node2 x:testMoveReplicaMainCollection_abc_shard1_replica_n1] o.a.s.c.CoreContainer Creating SolrCore 'testMoveReplicaMainCollection_abc_shard1_replica_n1' using configuration from collection testMoveReplicaMainCollection_abc, trusted=true
   [junit4]   2> 1855810 INFO  (qtp694349042-25558) [n:127.0.0.1:44399_solr c:testMoveReplicaMainCollection_abc s:shard1 r:core_node2 x:testMoveReplicaMainCollection_abc_shard1_replica_n1] o.a.s.m.r.SolrJmxReporter JMX monitoring for 'solr_44399.solr.core.testMoveReplicaMainCollection_abc.shard1.replica_n1' (registry 'solr.core.testMoveReplicaMainCollection_abc.shard1.replica_n1') enabled at server: com.sun.jmx.mbeanserver.JmxMBeanServer@2df92738
   [junit4]   2> 1855810 INFO  (qtp694349042-25558) [n:127.0.0.1:44399_solr c:testMoveReplicaMainCollection_abc s:shard1 r:core_node2 x:testMoveReplicaMainCollection_abc_shard1_replica_n1] o.a.s.c.SolrCore solr.RecoveryStrategy.Builder
   [junit4]   2> 1855810 INFO  (qtp694349042-25558) [n:127.0.0.1:44399_solr c:testMoveReplicaMainCollection_abc s:shard1 r:core_node2 x:testMoveReplicaMainCollection_abc_shard1_replica_n1] o.a.s.c.SolrCore [[testMoveReplicaMainCollection_abc_shard1_replica_n1] ] Opening new SolrCore at [/home/jenkins/workspace/Lucene-Solr-7.x-Linux/solr/build/solr-core/test/J2/temp/solr.cloud.TestWithCollection_288F3D28BE3E1F12-001/tempDir-001/node2/testMoveReplicaMainCollection_abc_shard1_replica_n1], dataDir=[/home/jenkins/workspace/Lucene-Solr-7.x-Linux/solr/build/solr-core/test/J2/temp/solr.cloud.TestWithCollection_288F3D28BE3E1F12-001/tempDir-001/node2/./testMoveReplicaMainCollection_abc_shard1_replica_n1/data/]
   [junit4]   2> 1855812 INFO  (qtp694349042-25558) [n:127.0.0.1:44399_solr c:testMoveReplicaMainCollection_abc s:shard1 r:core_node2 x:testMoveReplicaMainCollection_abc_shard1_replica_n1] o.a.s.r.XSLTResponseWriter xsltCacheLifetimeSeconds=5
   [junit4]   2> 1855842 INFO  (qtp694349042-25558) [n:127.0.0.1:44399_solr c:testMoveReplicaMainCollection_abc s:shard1 r:core_node2 x:testMoveReplicaMainCollection_abc_shard1_replica_n1] o.a.s.u.UpdateHandler Using UpdateLog implementation: org.apache.solr.update.UpdateLog
   [junit4]   2> 1855842 INFO  (qtp694349042-25558) [n:127.0.0.1:44399_solr c:testMoveReplicaMainCollection_abc s:shard1 r:core_node2 x:testMoveReplicaMainCollection_abc_shard1_replica_n1] o.a.s.u.UpdateLog Initializing UpdateLog: dataDir= defaultSyncLevel=FLUSH numRecordsToKeep=100 maxNumLogsToKeep=10 numVersionBuckets=65536
   [junit4]   2> 1855843 INFO  (qtp694349042-25558) [n:127.0.0.1:44399_solr c:testMoveReplicaMainCollection_abc s:shard1 r:core_node2 x:testMoveReplicaMainCollection_abc_shard1_replica_n1] o.a.s.u.CommitTracker Hard AutoCommit: if uncommitted for 15000ms; 
   [junit4]   2> 1855843 INFO  (qtp694349042-25558) [n:127.0.0.1:44399_solr c:testMoveReplicaMainCollection_abc s:shard1 r:core_node2 x:testMoveReplicaMainCollection_abc_shard1_replica_n1] o.a.s.u.CommitTracker Soft AutoCommit: disabled
   [junit4]   2> 1855844 INFO  (qtp694349042-25558) [n:127.0.0.1:44399_solr c:testMoveReplicaMainCollection_abc s:shard1 r:core_node2 x:testMoveReplicaMainCollection_abc_shard1_replica_n1] o.a.s.s.SolrIndexSearcher Opening [Searcher@221d606b[testMoveReplicaMainCollection_abc_shard1_replica_n1] main]
   [junit4]   2> 1855845 INFO  (qtp694349042-25558) [n:127.0.0.1:44399_solr c:testMoveReplicaMainCollection_abc s:shard1 r:core_node2 x:testMoveReplicaMainCollection_abc_shard1_replica_n1] o.a.s.r.ManagedResourceStorage Configured ZooKeeperStorageIO with znodeBase: /configs/testMoveReplicaMainCollection_abc.AUTOCREATED
   [junit4]   2> 1855845 INFO  (qtp694349042-25558) [n:127.0.0.1:44399_solr c:testMoveReplicaMainCollection_abc s:shard1 r:core_node2 x:testMoveReplicaMainCollection_abc_shard1_replica_n1] o.a.s.r.ManagedResourceStorage Loaded null at path _rest_managed.json using ZooKeeperStorageIO:path=/configs/testMoveReplicaMainCollection_abc.AUTOCREATED
   [junit4]   2> 1855845 INFO  (qtp694349042-25558) [n:127.0.0.1:44399_solr c:testMoveReplicaMainCollection_abc s:shard1 r:core_node2 x:testMoveReplicaMainCollection_abc_shard1_replica_n1] o.a.s.s.ZkIndexSchemaReader Creating ZooKeeper watch for the managed schema at /configs/testMoveReplicaMainCollection_abc.AUTOCREATED/managed-schema
   [junit4]   2> 1855845 INFO  (qtp694349042-25558) [n:127.0.0.1:44399_solr c:testMoveReplicaMainCollection_abc s:shard1 r:core_node2 x:testMoveReplicaMainCollection_abc_shard1_replica_n1] o.a.s.s.ZkIndexSchemaReader Current schema version 0 is already the latest
   [junit4]   2> 1855846 INFO  (qtp694349042-25558) [n:127.0.0.1:44399_solr c:testMoveReplicaMainCollection_abc s:shard1 r:core_node2 x:testMoveReplicaMainCollection_abc_shard1_replica_n1] o.a.s.h.c.SpellCheckComponent Initializing spell checkers
   [junit4]   2> 1855846 INFO  (qtp694349042-25558) [n:127.0.0.1:44399_solr c:testMoveReplicaMainCollection_abc s:shard1 r:core_node2 x:testMoveReplicaMainCollection_abc_shard1_replica_n1] o.a.s.s.DirectSolrSpellChecker init: {name=default,field=_text_,classname=solr.DirectSolrSpellChecker,distanceMeasure=internal,accuracy=0.5,maxEdits=2,minPrefix=1,maxInspections=5,minQueryLength=4,maxQueryFrequency=0.01}
   [junit4]   2> 1855847 INFO  (qtp694349042-25558) [n:127.0.0.1:44399_solr c:testMoveReplicaMainCollection_abc s:shard1 r:core_node2 x:testMoveReplicaMainCollection_abc_shard1_replica_n1] o.a.s.h.ReplicationHandler Commits will be reserved for 10000ms.
   [junit4]   2> 1855847 INFO  (searcherExecutor-8359-thread-1-processing-n:127.0.0.1:44399_solr x:testMoveReplicaMainCollection_abc_shard1_replica_n1 c:testMoveReplicaMainCollection_abc s:shard1 r:core_node2) [n:127.0.0.1:44399_solr c:testMoveReplicaMainCollection_abc s:shard1 r:core_node2 x:testMoveReplicaMainCollection_abc_shard1_replica_n1] o.a.s.c.QuerySenderListener QuerySenderListener sending requests to Searcher@221d606b[testMoveReplicaMainCollection_abc_shard1_replica_n1] main{ExitableDirectoryReader(UninvertingDirectoryReader())}
   [junit4]   2> 1855847 INFO  (qtp694349042-25558) [n:127.0.0.1:44399_solr c:testMoveReplicaMainCollection_abc s:shard1 r:core_node2 x:testMoveReplicaMainCollection_abc_shard1_replica_n1] o.a.s.u.UpdateLog Could not find max version in index or recent updates, using new clock 1609033016167890944
   [junit4]   2> 1855847 INFO  (searcherExecutor-8359-thread-1-processing-n:127.0.0.1:44399_solr x:testMoveReplicaMainCollection_abc_shard1_replica_n1 c:testMoveReplicaMainCollection_abc s:shard1 r:core_node2) [n:127.0.0.1:44399_solr c:testMoveReplicaMainCollection_abc s:shard1 r:core_node2 x:testMoveReplicaMainCollection_abc_shard1_replica_n1] o.a.s.c.QuerySenderListener QuerySenderListener done.
   [junit4]   2> 1855847 INFO  (searcherExecutor-8359-thread-1-processing-n:127.0.0.1:44399_solr x:testMoveReplicaMainCollection_abc_shard1_replica_n1 c:testMoveReplicaMainCollection_abc s:shard1 r:core_node2) [n:127.0.0.1:44399_solr c:testMoveReplicaMainCollection_abc s:shard1 r:core_node2 x:testMoveReplicaMainCollection_abc_shard1_replica_n1] o.a.s.h.c.SpellCheckComponent Loading spell index for spellchecker: default
   [junit4]   2> 1855848 INFO  (searcherExecutor-8359-thread-1-processing-n:127.0.0.1:44399_solr x:testMoveReplicaMainCollection_abc_shard1_replica_n1 c:testMoveReplicaMainCollection_abc s:shard1 r:core_node2) [n:127.0.0.1:44399_solr c:testMoveReplicaMainCollection_abc s:shard1 r:core_node2 x:testMoveReplicaMainCollection_abc_shard1_replica_n1] o.a.s.c.SolrCore [testMoveReplicaMainCollection_abc_shard1_replica_n1] Registered new searcher Searcher@221d606b[testMoveReplicaMainCollection_abc_shard1_replica_n1] main{ExitableDirectoryReader(UninvertingDirectoryReader())}
   [junit4]   2> 1855850 INFO  (qtp694349042-25558) [n:127.0.0.1:44399_solr c:testMoveReplicaMainCollection_abc s:shard1 r:core_node2 x:testMoveReplicaMainCollection_abc_shard1_replica_n1] o.a.s.c.ZkShardTerms Successful update of terms at /collections/testMoveReplicaMainCollection_abc/terms/shard1 to Terms{values={core_node2=0}, version=0}
   [junit4]   2> 1855851 INFO  (qtp694349042-25558) [n:127.0.0.1:44399_solr c:testMoveReplicaMainCollection_abc s:shard1 r:core_node2 x:testMoveReplicaMainCollection_abc_shard1_replica_n1] o.a.s.c.ShardLeaderElectionContext Enough replicas found to continue.
   [junit4]   2> 1855852 INFO  (qtp694349042-25558) [n:127.0.0.1:44399_solr c:testMoveReplicaMainCollection_abc s:shard1 r:core_node2 x:testMoveReplicaMainCollection_abc_shard1_replica_n1] o.a.s.c.ShardLeaderElectionContext I may be the new leader - try and sync
   [junit4]   2> 1855852 INFO  (qtp694349042-25558) [n:127.0.0.1:44399_solr c:testMoveReplicaMainCollection_abc s:shard1 r:core_node2 x:testMoveReplicaMainCollection_abc_shard1_replica_n1] o.a.s.c.SyncStrategy Sync replicas to https://127.0.0.1:44399/solr/testMoveReplicaMainCollection_abc_shard1_replica_n1/
   [junit4]   2> 1855852 INFO  (qtp694349042-25558) [n:127.0.0.1:44399_solr c:testMoveReplicaMainCollection_abc s:shard1 r:core_node2 x:testMoveReplicaMainCollection_abc_shard1_replica_n1] o.a.s.c.SyncStrategy Sync Success - now sync replicas to me
   [junit4]   2> 1855852 INFO  (qtp694349042-25558) [n:127.0.0.1:44399_solr c:testMoveReplicaMainCollection_abc s:shard1 r:core_node2 x:testMoveReplicaMainCollection_abc_shard1_replica_n1] o.a.s.c.SyncStrategy https://127.0.0.1:44399/solr/testMoveReplicaMainCollection_abc_shard1_replica_n1/ has no replicas
   [junit4]   2> 1855852 INFO  (qtp694349042-25558) [n:127.0.0.1:44399_solr c:testMoveReplicaMainCollection_abc s:shard1 r:core_node2 x:testMoveReplicaMainCollection_abc_shard1_replica_n1] o.a.s.c.ShardLeaderElectionContext Found all replicas participating in election, clear LIR
   [junit4]   2> 1855853 INFO  (qtp694349042-25558) [n:127.0.0.1:44399_solr c:testMoveReplicaMainCollection_abc s:shard1 r:core_node2 x:testMoveReplicaMainCollection_abc_shard1_replica_n1] o.a.s.c.ShardLeaderElectionContext I am the new leader: https://127.0.0.1:44399/solr/testMoveReplicaMainCollection_abc_shard1_replica_n1/ shard1
   [junit4]   2> 1856005 INFO  (qtp694349042-25558) [n:127.0.0.1:44399_solr c:testMoveReplicaMainCollection_abc s:shard1 r:core_node2 x:testMoveReplicaMainCollection_abc_shard1_replica_n1] o.a.s.c.ZkController I am the leader, no recovery necessary
   [junit4]   2> 1856061 INFO  (qtp694349042-25558) [n:127.0.0.1:44399_solr c:testMoveReplicaMainCollection_abc s:shard1 r:core_node2 x:testMoveReplicaMainCollection_abc_shard1_replica_n1] o.a.s.s.HttpSolrCall [admin] webapp=null path=/admin/cores params={qt=/admin/cores&coreNodeName=core_node2&collection.configName=testMoveReplicaMainCollection_abc.AUTOCREATED&newCollection=true&name=testMoveReplicaMainCollection_abc_shard1_replica_n1&action=CREATE&numShards=1&collection=testMoveReplicaMainCollection_abc&shard=shard1&wt=javabin&version=2&replicaType=NRT} status=0 QTime=1379
   [junit4]   2> 1856061 DEBUG (OverseerThreadFactory-8347-thread-1) [    ] o.a.s.c.s.c.a.PolicyHelper session set to NULL
   [junit4]   2> 1856064 INFO  (qtp1501380926-25570) [n:127.0.0.1:34311_solr    ] o.a.s.h.a.CollectionsHandler Wait for new collection to be active for at most 30 seconds. Check all shard replicas
   [junit4]   2> 1856106 INFO  (zkCallback-6738-thread-1) [    ] o.a.s.c.c.ZkStateReader A cluster state change: [WatchedEvent state:SyncConnected type:NodeDataChanged path:/collections/testMoveReplicaMainCollection_abc/state.json] for collection [testMoveReplicaMainCollection_abc] has occurred - updating... (live nodes size: [2])
   [junit4]   2> 1856347 INFO  (OverseerCollectionConfigSetProcessor-72063435752538116-127.0.0.1:34311_solr-n_0000000000) [    ] o.a.s.c.OverseerTaskQueue Response ZK path: /overseer/collection-queue-work/qnr-0000000000 doesn't exist.  Requestor may have disconnected from ZooKeeper
   [junit4]   2> 1857066 INFO  (qtp1501380926-25570) [n:127.0.0.1:34311_solr    ] o.a.s.s.HttpSolrCall [admin] webapp=null path=/admin/collections params={pullReplicas=0&name=testMoveReplicaMainCollection_abc&nrtReplicas=1&action=CREATE&numShards=1&tlogReplicas=0&createNodeSet=127.0.0.1:44399_solr&wt=javabin&version=2} status=0 QTime=2721
   [junit4]   2> 1857066 INFO  (qtp1501380926-25572) [n:127.0.0.1:34311_solr    ] o.a.s.h.a.CollectionsHandler Invoked Collection Action :create with params pullReplicas=0&withCollection=testMoveReplicaMainCollection_abc&name=testMoveReplicaMainCollection_xyz&nrtReplicas=1&action=CREATE&numShards=1&tlogReplicas=0&wt=javabin&version=2 and sendToOCPQueue=true
   [junit4]   2> 1857068 INFO  (OverseerThreadFactory-8347-thread-2) [    ] o.a.s.c.a.c.CreateCollectionCmd Create collection testMoveReplicaMainCollection_xyz
   [junit4]   2> 1857069 INFO  (OverseerThreadFactory-8347-thread-2) [    ] o.a.s.c.c.ZkConfigManager Copying zk node /configs/_default/protwords.txt to /configs/testMoveReplicaMainCollection_xyz.AUTOCREATED/protwords.txt
   [junit4]   2> 1857070 INFO  (OverseerThreadFactory-8347-thread-2) [    ] o.a.s.c.c.ZkConfigManager Copying zk node /configs/_default/managed-schema to /configs/testMoveReplicaMainCollection_xyz.AUTOCREATED/managed-schema
   [junit4]   2> 1857071 INFO  (OverseerThreadFactory-8347-thread-2) [    ] o.a.s.c.c.ZkConfigManager Copying zk node /configs/_default/solrconfig.xml to /configs/testMoveReplicaMainCollection_xyz.AUTOCREATED/solrconfig.xml
   [junit4]   2> 1857072 INFO  (OverseerThreadFactory-8347-thread-2) [    ] o.a.s.c.c.ZkConfigManager Copying zk node /configs/_default/synonyms.txt to /configs/testMoveReplicaMainCollection_xyz.AUTOCREATED/synonyms.txt
   [junit4]   2> 1857072 INFO  (OverseerThreadFactory-8347-thread-2) [    ] o.a.s.c.c.ZkConfigManager Copying zk node /configs/_default/stopwords.txt to /configs/testMoveReplicaMainCollection_xyz.AUTOCREATED/stopwords.txt
   [junit4]   2> 1857073 INFO  (OverseerThreadFactory-8347-thread-2) [    ] o.a.s.c.c.ZkConfigManager Copying zk node /configs/_default/lang/contractions_it.txt to /configs/testMoveReplicaMainCollection_xyz.AUTOCREATED/lang/contractions_it.txt
   [junit4]   2> 1857073 INFO  (OverseerThreadFactory-8347-thread-2) [    ] o.a.s.c.c.ZkConfigManager Copying zk node /configs/_default/lang/stemdict_nl.txt to /configs/testMoveReplicaMainCollection_xyz.AUTOCREATED/lang/stemdict_nl.txt
   [junit4]   2> 1857074 INFO  (OverseerThreadFactory-8347-thread-2) [    ] o.a.s.c.c.ZkConfigManager Copying zk node /configs/_default/lang/stopwords_hy.txt to /configs/testMoveReplicaMainCollection_xyz.AUTOCREATED/lang/stopwords_hy.txt
   [junit4]   2> 1857074 INFO  (OverseerThreadFactory-8347-thread-2) [    ] o.a.s.c.c.ZkConfigManager Copying zk node /configs/_default/lang/stopwords_no.txt to /configs/testMoveReplicaMainCollection_xyz.AUTOCREATED/lang/stopwords_no.txt
   [junit4]   2> 1857075 INFO  (OverseerThreadFactory-8347-thread-2) [    ] o.a.s.c.c.ZkConfigManager Copying zk node /configs/_default/lang/contractions_ca.txt to /configs/testMoveReplicaMainCollection_xyz.AUTOCREATED/lang/contractions_ca.txt
   [junit4]   2> 1857075 INFO  (OverseerThreadFactory-8347-thread-2) [    ] o.a.s.c.c.ZkConfigManager Copying zk node /configs/_default/lang/stopwords_id.txt to /configs/testMoveReplicaMainCollection_xyz.AUTOCREATED/lang/stopwords_id.txt
   [junit4]   2> 1857076 INFO  (OverseerThreadFactory-8347-thread-2) [    ] o.a.s.c.c.ZkConfigManager Copying zk node /configs/_default/lang/stopwords_ga.txt to /configs/testMoveReplicaMainCollection_xyz.AUTOCREATED/lang/stopwords_ga.txt
   [junit4]   2> 1857076 INFO  (OverseerThreadFactory-8347-thread-2) [    ] o.a.s.c.c.ZkConfigManager Copying zk node /configs/_default/lang/stopwords_hi.txt to /configs/testMoveReplicaMainCollection_xyz.AUTOCREATED/lang/stopwords_hi.txt
   [junit4]   2> 1857077 INFO  (OverseerThreadFactory-8347-thread-2) [    ] o.a.s.c.c.ZkConfigManager Copying zk node /configs/_default/lang/stopwords_da.txt to /configs/testMoveReplicaMainCollection_xyz.AUTOCREATED/lang/stopwords_da.txt
   [junit4]   2> 1857078 INFO  (OverseerThreadFactory-8347-thread-2) [    ] o.a.s.c.c.ZkConfigManager Copying zk node /configs/_default/lang/stopwords_ja.txt to /configs/testMoveReplicaMainCollection_xyz.AUTOCREATED/lang/stopwords_ja.txt
   [junit4]   2> 1857078 INFO  (OverseerThreadFactory-8347-thread-2) [    ] o.a.s.c.c.ZkConfigManager Copying zk node /configs/_default/lang/stopwords_pt.txt to /configs/testMoveReplicaMainCollection_xyz.AUTOCREATED/lang/stopwords_pt.txt
   [junit4]   2> 1857079 INFO  (OverseerThreadFactory-8347-thread-2) [    ] o.a.s.c.c.ZkConfigManager Copying zk node /configs/_default/lang/stopwords_hu.txt to /configs/testMoveReplicaMainCollection_xyz.AUTOCREATED/lang/stopwords_hu.txt
   [junit4]   2> 1857079 INFO  (OverseerThreadFactory-8347-thread-2) [    ] o.a.s.c.c.ZkConfigManager Copying zk node /configs/_default/lang/stopwords_el.txt to /configs/testMoveReplicaMainCollection_xyz.AUTOCREATED/lang/stopwords_el.txt
   [junit4]   2> 1857080 INFO  (OverseerThreadFactory-8347-thread-2) [    ] o.a.s.c.c.ZkConfigManager Copying zk node /configs/_default/lang/stopwords_ru.txt to /configs/testMoveReplicaMainCollection_xyz.AUTOCREATED/lang/stopwords_ru.txt
   [junit4]   2> 1857080 INFO  (OverseerThreadFactory-8347-thread-2) [    ] o.a.s.c.c.ZkConfigManager Copying zk node /configs/_default/lang/stopwords_tr.txt to /configs/testMoveReplicaMainCollection_xyz.AUTOCREATED/lang/stopwords_tr.txt
   [junit4]   2> 1857081 INFO  (OverseerThreadFactory-8347-thread-2) [    ] o.a.s.c.c.ZkConfigManager Copying zk node /configs/_default/lang/stopwords_ar.txt to /configs/testMoveReplicaMainCollection_xyz.AUTOCREATED/lang/stopwords_ar.txt
   [junit4]   2> 1857081 INFO  (OverseerThreadFactory-8347-thread-2) [    ] o.a.s.c.c.ZkConfigManager Copying zk node /configs/_default/lang/userdict_ja.txt to /configs/testMoveReplicaMainCollection_xyz.AUTOCREATED/lang/userdict_ja.txt
   [junit4]   2> 1857082 INFO  (OverseerThreadFactory-8347-thread-2) [    ] o.a.s.c.c.ZkConfigManager Copying zk node /configs/_default/lang/stopwords_eu.txt to /configs/testMoveReplicaMainCollection_xyz.AUTOCREATED/lang/stopwords_eu.txt
   [junit4]   2> 1857082 INFO  (OverseerThreadFactory-8347-thread-2) [    ] o.a.s.c.c.ZkConfigManager Copying zk node /configs/_default/lang/stopwords_it.txt to /configs/testMoveReplicaMainCollection_xyz.AUTOCREATED/lang/stopwords_it.txt
   [junit4]   2> 1857083 INFO  (OverseerThreadFactory-8347-thread-2) [    ] o.a.s.c.c.ZkConfigManager Copying zk node /configs/_default/lang/stopwords_cz.txt to /configs/testMoveReplicaMainCollection_xyz.AUTOCREATED/lang/stopwords_cz.txt
   [junit4]   2> 1857083 INFO  (OverseerThreadFactory-8347-thread-2) [    ] o.a.s.c.c.ZkConfigManager Copying zk node /configs/_default/lang/stoptags_ja.txt to /configs/testMoveReplicaMainCollection_xyz.AUTOCREATED/lang/stoptags_ja.txt
   [junit4]   2> 1857084 INFO  (OverseerThreadFactory-8347-thread-2) [    ] o.a.s.c.c.ZkConfigManager Copying zk node /configs/_default/lang/contractions_fr.txt to /configs/testMoveReplicaMainCollection_xyz.AUTOCREATED/lang/contractions_fr.txt
   [junit4]   2> 1857085 INFO  (OverseerThreadFactory-8347-thread-2) [    ] o.a.s.c.c.ZkConfigManager Copying zk node /configs/_default/lang/stopwords_de.txt to /configs/testMoveReplicaMainCollection_xyz.AUTOCREATED/lang/stopwords_de.txt
   [junit4]   2> 1857085 INFO  (OverseerThreadFactory-8347-thread-2) [    ] o.a.s.c.c.ZkConfigManager Copying zk node /configs/_default/lang/stopwords_fa.txt to /configs/testMoveReplicaMainCollection_xyz.AUTOCREATED/lang/stopwords_fa.txt
   [junit4]   2> 1857086 INFO  (OverseerThreadFactory-8347-thread-2) [    ] o.a.s.c.c.ZkConfigManager Copying zk node /configs/_default/lang/contractions_ga.txt to /configs/testMoveReplicaMainCollection_xyz.AUTOCREATED/lang/contractions_ga.txt
   [junit4]   2> 1857086 INFO  (OverseerThreadFactory-8347-thread-2) [    ] o.a.s.c.c.ZkConfigManager Copying zk node /configs/_default/lang/stopwords_ca.txt to /configs/testMoveReplicaMainCollection_xyz.AUTOCREATED/lang/stopwords_ca.txt
   [junit4]   2> 1857087 INFO  (OverseerThreadFactory-8347-thread-2) [    ] o.a.s.c.c.ZkConfigManager Copying zk node /configs/_default/lang/stopwords_nl.txt to /configs/testMoveReplicaMainCollection_xyz.AUTOCREATED/lang/stopwords_nl.txt
   [junit4]   2> 1857087 INFO  (OverseerThreadFactory-8347-thread-2) [    ] o.a.s.c.c.ZkConfigManager Copying zk node /configs/_default/lang/stopwords_bg.txt to /configs/testMoveReplicaMainCollection_xyz.AUTOCREATED/lang/stopwords_bg.txt
   [junit4]   2> 1857088 INFO  (OverseerThreadFactory-8347-thread-2) [    ] o.a.s.c.c.ZkConfigManager Copying zk node /configs/_default/lang/stopwords_lv.txt to /configs/testMoveReplicaMainCollection_xyz.AUTOCREATED/lang/stopwords_lv.txt
   [junit4]   2> 1857088 INFO  (OverseerThreadFactory-8347-thread-2) [    ] o.a.s.c.c.ZkConfigManager Copying zk node /configs/_default/lang/stopwords_en.txt to /configs/testMoveReplicaMainCollection_xyz.AUTOCREATED/lang/stopwords_en.txt
   [junit4]   2> 1857088 INFO  (OverseerThreadFactory-8347-thread-2) [    ] o.a.s.c.c.ZkConfigManager Copying zk node /configs/_default/lang/stopwords_es.txt to /configs/testMoveReplicaMainCollection_xyz.AUTOCREATED/lang/stopwords_es.txt
   [junit4]   2> 1857089 INFO  (OverseerThreadFactory-8347-thread-2) [    ] o.a.s.c.c.ZkConfigManager Copying zk node /configs/_default/lang/stopwords_th.txt to /configs/testMoveReplicaMainCollection_xyz.AUTOCREATED/lang/stopwords_th.txt
   [junit4]   2> 1857090 INFO  (OverseerThreadFactory-8347-thread-2) [    ] o.a.s.c.c.ZkConfigManager Copying zk node /configs/_default/lang/stopwords_ro.txt to /configs/testMoveReplicaMainCollection_xyz.AUTOCREATED/lang/stopwords_ro.txt
   [junit4]   2> 1857090 INFO  (OverseerThreadFactory-8347-thread-2) [    ] o.a.s.c.c.ZkConfigManager Copying zk node /configs/_default/lang/stopwords_fr.txt to /configs/testMoveReplicaMainCollection_xyz.AUTOCREATED/lang/stopwords_fr.txt
   [junit4]   2> 1857091 INFO  (OverseerThreadFactory-8347-thread-2) [    ] o.a.s.c.c.ZkConfigManager Copying zk node /configs/_default/lang/stopwords_sv.txt to /configs/testMoveReplicaMainCollection_xyz.AUTOCREATED/lang/stopwords_sv.txt
   [junit4]   2> 1857091 INFO  (OverseerThreadFactory-8347-thread-2) [    ] o.a.s.c.c.ZkConfigManager Copying zk node /configs/_default/lang/stopwords_fi.txt to /configs/testMoveReplicaMainCollection_xyz.AUTOCREATED/lang/stopwords_fi.txt
   [junit4]   2> 1857091 INFO  (OverseerThreadFactory-8347-thread-2) [    ] o.a.s.c.c.ZkConfigManager Copying zk node /configs/_default/lang/hyphenations_ga.txt to /configs/testMoveReplicaMainCollection_xyz.AUTOCREATED/lang/hyphenations_ga.txt
   [junit4]   2> 1857092 INFO  (OverseerThreadFactory-8347-thread-2) [    ] o.a.s.c.c.ZkConfigManager Copying zk node /configs/_default/lang/stopwords_gl.txt to /configs/testMoveReplicaMainCollection_xyz.AUTOCREATED/lang/stopwords_gl.txt
   [junit4]   2> 1857092 INFO  (OverseerThreadFactory-8347-thread-2) [    ] o.a.s.c.c.ZkConfigManager Copying zk node /configs/_default/params.json to /configs/testMoveReplicaMainCollection_xyz.AUTOCREATED/params.json
   [junit4]   2> 1857296 DEBUG (OverseerThreadFactory-8347-thread-2) [    ] o.a.s.c.s.c.a.PolicyHelper Creating a new session
   [junit4]   2> 1857300 INFO  (qtp1501380926-25562) [n:127.0.0.1:34311_solr    ] o.a.s.s.HttpSolrCall [admin] webapp=null path=/admin/metrics params={prefix=CONTAINER.fs.usableSpace,CONTAINER.fs.totalSpace,CORE.coreName&wt=javabin&version=2&group=solr.node,solr.core} status=0 QTime=0
   [junit4]   2> 1857301 INFO  (qtp694349042-25569) [n:127.0.0.1:44399_solr    ] o.a.s.s.HttpSolrCall [admin] webapp=null path=/admin/metrics params={wt=javabin&version=2&key=solr.core.testMoveReplicaMainCollection_abc.shard1.replica_n1:INDEX.sizeInBytes} status=0 QTime=0
   [junit4]   2> 1857302 INFO  (qtp694349042-25558) [n:127.0.0.1:44399_solr    ] o.a.s.s.HttpSolrCall [admin] webapp=null path=/admin/metrics params={prefix=CONTAINER.fs.usableSpace,CONTAINER.fs.totalSpace,CORE.coreName&wt=javabin&version=2&group=solr.node,solr.core} status=0 QTime=0
   [junit4]   2> 1857303 DEBUG (OverseerThreadFactory-8347-thread-2) [    ] o.a.s.c.s.c.a.PolicyHelper New session created 
   [junit4]   2> 1857304 INFO  (OverseerThreadFactory-8347-thread-2) [    ] o.a.s.c.s.c.a.PolicyHelper returnSession, curr-time 89140855 sessionWrapper.createTime 89140853771575, this.sessionWrapper.createTime 89140853771575 
   [junit4]   2> 1857307 INFO  (OverseerStateUpdate-72063435752538116-127.0.0.1:34311_solr-n_0000000000) [    ] o.a.s.c.o.SliceMutator createReplica() {
   [junit4]   2>   "operation":"ADDREPLICA",
   [junit4]   2>   "collection":"testMoveReplicaMainCollection_xyz",
   [junit4]   2>   "shard":"shard1",
   [junit4]   2>   "core":"testMoveReplicaMainCollection_xyz_shard1_replica_n1",
   [junit4]   2>   "state":"down",
   [junit4]   2>   "base_url":"https://127.0.0.1:44399/solr",
   [junit4]   2>   "type":"NRT",
   [junit4]   2>   "waitForFinalState":"false"} 
   [junit4]   2> 1857509 INFO  (qtp694349042-25565) [n:127.0.0.1:44399_solr    x:testMoveReplicaMainCollection_xyz_shard1_replica_n1] o.a.s.h.a.CoreAdminOperation core create command qt=/admin/cores&coreNodeName=core_node2&collection.configName=testMoveReplicaMainCollection_xyz.AUTOCREATED&newCollection=true&name=testMoveReplicaMainCollection_xyz_shard1_replica_n1&action=CREATE&numShards=1&collection=testMoveReplicaMainCollection_xyz&shard=shard1&wt=javabin&version=2&replicaType=NRT
   [junit4]   2> 1858518 INFO  (qtp694349042-25565) [n:127.0.0.1:44399_solr c:testMoveReplicaMainCollection_xyz s:shard1 r:core_node2 x:testMoveReplicaMainCollection_xyz_shard1_replica_n1] o.a.s.c.RequestParams conf resource params.json loaded . version : 0 
   [junit4]   2> 1858518 INFO  (qtp694349042-25565) [n:127.0.0.1:44399_solr c:testMoveReplicaMainCollection_xyz s:shard1 r:core_node2 x:testMoveReplicaMainCollection_xyz_shard1_replica_n1] o.a.s.c.RequestParams request params refreshed to version 0
   [junit4]   2> 1858519 WARN  (qtp694349042-25565) [n:127.0.0.1:44399_solr c:testMoveReplicaMainCollection_xyz s:shard1 r:core_node2 x:testMoveReplicaMainCollection_xyz_shard1_replica_n1] o.a.s.c.SolrConfig Couldn't add files from /home/jenkins/workspace/Lucene-Solr-7.x-Linux/solr/build/solr-core/test/J2/temp/solr.cloud.TestWithCollection_288F3D28BE3E1F12-001/tempDir-001/node2/testMoveReplicaMainCollection_xyz_shard1_replica_n1/../../../../contrib/extraction/lib filtered by .*\.jar to classpath: /home/jenkins/workspace/Lucene-Solr-7.x-Linux/solr/build/solr-core/test/J2/temp/solr.cloud.TestWithCollection_288F3D28BE3E1F12-001/tempDir-001/node2/testMoveReplicaMainCollection_xyz_shard1_replica_n1/../../../../contrib/extraction/lib
   [junit4]   2> 1858520 WARN  (qtp694349042-25565) [n:127.0.0.1:44399_solr c:testMoveReplicaMainCollection_xyz s:shard1 r:core_node2 x:testMoveReplicaMainCollection_xyz_shard1_replica_n1] o.a.s.c.SolrConfig Couldn't add files from /home/jenkins/workspace/Lucene-Solr-7.x-Linux/solr/build/solr-core/test/J2/temp/solr.cloud.TestWithCollection_288F3D28BE3E1F12-001/tempDir-001/node2/testMoveReplicaMainCollection_xyz_shard1_replica_n1/../../../../dist filtered by solr-cell-\d.*\.jar to classpath: /home/jenkins/workspace/Lucene-Solr-7.x-Linux/solr/build/solr-core/test/J2/temp/solr.cloud.TestWithCollection_288F3D28BE3E1F12-001/tempDir-001/node2/testMoveReplicaMainCollection_xyz_shard1_replica_n1/../../../../dist
   [junit4]   2> 1858520 WARN  (qtp694349042-25565) [n:127.0.0.1:44399_solr c:testMoveReplicaMainCollection_xyz s:shard1 r:core_node2 x:testMoveReplicaMainCollection_xyz_shard1_replica_n1] o.a.s.c.SolrConfig Couldn't add files from /home/jenkins/workspace/Lucene-Solr-7.x-Linux/solr/build/solr-core/test/J2/temp/solr.cloud.TestWithCollection_288F3D28BE3E1F12-001/tempDir-001/node2/testMoveReplicaMainCollection_xyz_shard1_replica_n1/../../../../contrib/clustering/lib filtered by .*\.jar to classpath: /home/jenkins/workspace/Lucene-Solr-7.x-Linux/solr/build/solr-core/test/J2/temp/solr.cloud.TestWithCollection_288F3D28BE3E1F12-001/tempDir-001/node2/testMoveReplicaMainCollection_xyz_shard1_replica_n1/../../../../contrib/clustering/lib
   [junit4]   2> 1858520 WARN  (qtp694349042-25565) [n:127.0.0.1:44399_solr c:testMoveReplicaMainCollection_xyz s:shard1 r:core_node2 x:testMoveReplicaMainCollection_xyz_shard1_replica_n1] o.a.s.c.SolrConfig Couldn't add files from /home/jenkins/workspace/Lucene-Solr-7.x-Linux/solr/build/solr-core/test/J2/temp/solr.cloud.TestWithCollection_288F3D28BE3E1F12-001/tempDir-001/node2/testMoveReplicaMainCollection_xyz_shard1_replica_n1/../../../../dist filtered by solr-clustering-\d.*\.jar to classpath: /home/jenkins/workspace/Lucene-Solr-7.x-Linux/solr/build/solr-core/test/J2/temp/solr.cloud.TestWithCollection_288F3D28BE3E1F12-001/tempDir-001/node2/testMoveReplicaMainCollection_xyz_shard1_replica_n1/../../../../dist
   [junit4]   2> 1858520 WARN  (qtp694349042-25565) [n:127.0.0.1:44399_solr c:testMoveReplicaMainCollection_xyz s:shard1 r:core_node2 x:testMoveReplicaMainCollection_xyz_shard1_replica_n1] o.a.s.c.SolrConfig Couldn't add files from /home/jenkins/workspace/Lucene-Solr-7.x-Linux/solr/build/solr-core/test/J2/temp/solr.cloud.TestWithCollection_288F3D28BE3E1F12-001/tempDir-001/node2/testMoveReplicaMainCollection_xyz_shard1_replica_n1/../../../../contrib/langid/lib filtered by .*\.jar to classpath: /home/jenkins/workspace/Lucene-Solr-7.x-Linux/solr/build/solr-core/test/J2/temp/solr.cloud.TestWithCollection_288F3D28BE3E1F12-001/tempDir-001/node2/testMoveReplicaMainCollection_xyz_shard1_replica_n1/../../../../contrib/langid/lib
   [junit4]   2> 1858520 WARN  (qtp694349042-25565) [n:127.0.0.1:44399_solr c:testMoveReplicaMainCollection_xyz s:shard1 r:core_node2 x:testMoveReplicaMainCollection_xyz_shard1_replica_n1] o.a.s.c.SolrConfig Couldn't add files from /home/jenkins/workspace/Lucene-Solr-7.x-Linux/solr/build/solr-core/test/J2/temp/solr.cloud.TestWithCollection_288F3D28BE3E1F12-001/tempDir-001/node2/testMoveReplicaMainCollection_xyz_shard1_replica_n1/../../../../dist filtered by solr-langid-\d.*\.jar to classpath: /home/jenkins/workspace/Lucene-Solr-7.x-Linux/solr/build/solr-core/test/J2/temp/solr.cloud.TestWithCollection_288F3D28BE3E1F12-001/tempDir-001/node2/testMoveReplicaMainCollection_xyz_shard1_replica_n1/../../../../dist
   [junit4]   2> 1858521 WARN  (qtp694349042-25565) [n:127.0.0.1:44399_solr c:testMoveReplicaMainCollection_xyz s:shard1 r:core_node2 x:testMoveReplicaMainCollection_xyz_shard1_replica_n1] o.a.s.c.SolrConfig Couldn't add files from /home/jenkins/workspace/Lucene-Solr-7.x-Linux/solr/build/solr-core/test/J2/temp/solr.cloud.TestWithCollection_288F3D28BE3E1F12-001/tempDir-001/node2/testMoveReplicaMainCollection_xyz_shard1_replica_n1/../../../../contrib/velocity/lib filtered by .*\.jar to classpath: /home/jenkins/workspace/Lucene-Solr-7.x-Linux/solr/build/solr-core/test/J2/temp/solr.cloud.TestWithCollection_288F3D28BE3E1F12-001/tempDir-001/node2/testMoveReplicaMainCollection_xyz_shard1_replica_n1/../../../../contrib/velocity/lib
   [junit4]   2> 1858521 WARN  (qtp694349042-25565) [n:127.0.0.1:44399_solr c:testMoveReplicaMainCollection_xyz s:shard1 r:core_node2 x:testMoveReplicaMainCollection_xyz_shard1_replica_n1] o.a.s.c.SolrConfig Couldn't add files from /home/jenkins/workspace/Lucene-Solr-7.x-Linux/solr/build/solr-core/test/J2/temp/solr.cloud.TestWithCollection_288F3D28BE3E1F12-001/tempDir-001/node2/testMoveReplicaMainCollection_xyz_shard1_replica_n1/../../../../dist filtered by solr-velocity-\d.*\.jar to classpath: /home/jenkins/workspace/Lucene-Solr-7.x-Linux/solr/build/solr-core/test/J2/temp/solr.cloud.TestWithCollection_288F3D28BE3E1F12-001/tempDir-001/node2/testMoveReplicaMainCollection_xyz_shard1_replica_n1/../../../../dist
   [junit4]   2> 1858531 INFO  (qtp694349042-25565) [n:127.0.0.1:44399_solr c:testMoveReplicaMainCollection_xyz s:shard1 r:core_node2 x:testMoveReplicaMainCollection_xyz_shard1_replica_n1] o.a.s.c.SolrConfig Using Lucene MatchVersion: 7.5.0
   [junit4]   2> 1858543 INFO  (qtp694349042-25565) [n:127.0.0.1:44399_solr c:testMoveReplicaMainCollection_xyz s:shard1 r:core_node2 x:testMoveReplicaMainCollection_xyz_shard1_replica_n1] o.a.s.s.IndexSchema [testMoveReplicaMainCollection_xyz_shard1_replica_n1] Schema name=default-config
   [junit4]   2> 1858624 INFO  (qtp694349042-25565) [n:127.0.0.1:44399_solr c:testMoveReplicaMainCollection_xyz s:shard1 r:core_node2 x:testMoveReplicaMainCollection_xyz_shard1_replica_n1] o.a.s.s.IndexSchema Loaded schema default-config/1.6 with uniqueid field id
   [junit4]   2> 1858636 INFO  (qtp694349042-25565) [n:127.0.0.1:44399_solr c:testMoveReplicaMainCollection_xyz s:shard1 r:core_node2 x:testMoveReplicaMainCollection_xyz_shard1_replica_n1] o.a.s.c.CoreContainer Creating SolrCore 'testMoveReplicaMainCollection_xyz_shard1_replica_n1' using configuration from collection testMoveReplicaMainCollection_xyz, trusted=true
   [junit4]   2> 1858637 INFO  (qtp694349042-25565) [n:127.0.0.1:44399_solr c:testMoveReplicaMainCollection_xyz s:shard1 r:core_node2 x:testMoveReplicaMainCollection_xyz_shard1_replica_n1] o.a.s.m.r.SolrJmxReporter JMX monitoring for 'solr_44399.solr.core.testMoveReplicaMainCollection_xyz.shard1.replica_n1' (registry 'solr.core.testMoveReplicaMainCollection_xyz.shard1.replica_n1') enabled at server: com.sun.jmx.mbeanserver.JmxMBeanServer@2df92738
   [junit4]   2> 1858637 INFO  (qtp694349042-25565) [n:127.0.0.1:44399_solr c:testMoveReplicaMainCollection_xyz s:shard1 r:core_node2 x:testMoveReplicaMainCollection_xyz_shard1_replica_n1] o.a.s.c.SolrCore solr.RecoveryStrategy.Builder
   [junit4]   2> 1858637 INFO  (qtp694349042-25565) [n:127.0.0.1:44399_solr c:testMoveReplicaMainCollection_xyz s:shard1 r:core_node2 x:testMoveReplicaMainCollection_xyz_shard1_replica_n1] o.a.s.c.SolrCore [[testMoveReplicaMainCollection_xyz_shard1_replica_n1] ] Opening new SolrCore at [/home/jenkins/workspace/Lucene-Solr-7.x-Linux/solr/build/solr-core/test/J2/temp/solr.cloud.TestWithCollection_288F3D28BE3E1F12-001/tempDir-001/node2/testMoveReplicaMainCollection_xyz_shard1_replica_n1], dataDir=[/home/jenkins/workspace/Lucene-Solr-7.x-Linux/solr/build/solr-core/test/J2/temp/solr.cloud.TestWithCollection_288F3D28BE3E1F12-001/tempDir-001/node2/./testMoveReplicaMainCollection_xyz_shard1_replica_n1/data/]
   [junit4]   2> 1858639 INFO  (qtp694349042-25565) [n:127.0.0.1:44399_solr c:testMoveReplicaMainCollection_xyz s:shard1 r:core_node2 x:testMoveReplicaMainCollection_xyz_shard1_replica_n1] o.a.s.r.XSLTResponseWriter xsltCacheLifetimeSeconds=5
   [junit4]   2> 1858668 INFO  (qtp694349042-25565) [n:127.0.0.1:44399_solr c:testMoveReplicaMainCollection_xyz s:shard1 r:core_node2 x:testMoveReplicaMainCollection_xyz_shard1_replica_n1] o.a.s.u.UpdateHandler Using UpdateLog implementation: org.apache.solr.update.UpdateLog
   [junit4]   2> 1858668 INFO  (qtp694349042-25565) [n:127.0.0.1:44399_solr c:testMoveReplicaMainCollection_xyz s:shard1 r:core_node2 x:testMoveReplicaMainCollection_xyz_shard1_replica_n1] o.a.s.u.UpdateLog Initializing UpdateLog: dataDir= defaultSyncLevel=FLUSH numRecordsToKeep=100 maxNumLogsToKeep=10 numVersionBuckets=65536
   [junit4]   2> 1858669 INFO  (qtp694349042-25565) [n:127.0.0.1:44399_solr c:testMoveReplicaMainCollection_xyz s:shard1 r:core_node2 x:testMoveReplicaMainCollection_xyz_shard1_replica_n1] o.a.s.u.CommitTracker Hard AutoCommit: if uncommitted for 15000ms; 
   [junit4]   2> 1858669 INFO  (qtp694349042-25565) [n:127.0.0.1:44399_solr c:testMoveReplicaMainCollection_xyz s:shard1 r:core_node2 x:testMoveReplicaMainCollection_xyz_shard1_replica_n1] o.a.s.u.CommitTracker Soft AutoCommit: disabled
   [junit4]   2> 1858670 INFO  (qtp694349042-25565) [n:127.0.0.1:44399_solr c:testMoveReplicaMainCollection_xyz s:shard1 r:core_node2 x:testMoveReplicaMainCollection_xyz_shard1_replica_n1] o.a.s.s.SolrIndexSearcher Opening [Searcher@c95a9fa[testMoveReplicaMainCollection_xyz_shard1_replica_n1] main]
   [junit4]   2> 1858670 INFO  (qtp694349042-25565) [n:127.0.0.1:44399_solr c:testMoveReplicaMainCollection_xyz s:shard1 r:core_node2 x:testMoveReplicaMainCollection_xyz_shard1_replica_n1] o.a.s.r.ManagedResourceStorage Configured ZooKeeperStorageIO with znodeBase: /configs/testMoveReplicaMainCollection_xyz.AUTOCREATED
   [junit4]   2> 1858670 INFO  (qtp694349042-25565) [n:127.0.0.1:44399_solr c:testMoveReplicaMainCollection_xyz s:shard1 r:core_node2 x:testMoveReplicaMainCollection_xyz_shard1_replica_n1] o.a.s.r.ManagedResourceStorage Loaded null at path _rest_managed.json using ZooKeeperStorageIO:path=/configs/testMoveReplicaMainCollection_xyz.AUTOCREATED
   [junit4]   2> 1858670 INFO  (qtp694349042-25565) [n:127.0.0.1:44399_solr c:testMoveReplicaMainCollection_xyz s:shard1 r:core_node2 x:testMoveReplicaMainCollection_xyz_shard1_replica_n1] o.a.s.s.ZkIndexSchemaReader Creating ZooKeeper watch for the managed schema at /configs/testMoveReplicaMainCollection_xyz.AUTOCREATED/managed-schema
   [junit4]   2> 1858671 INFO  (qtp694349042-25565) [n:127.0.0.1:44399_solr c:testMoveReplicaMainCollection_xyz s:shard1 r:core_node2 x:testMoveReplicaMainCollection_xyz_shard1_replica_n1] o.a.s.s.ZkIndexSchemaReader Current schema version 0 is already the latest
   [junit4]   2> 1858671 INFO  (qtp694349042-25565) [n:127.0.0.1:44399_solr c:testMoveReplicaMainCollection_xyz s:shard1 r:core_node2 x:testMoveReplicaMainCollection_xyz_shard1_replica_n1] o.a.s.h.c.SpellCheckComponent Initializing spell checkers
   [junit4]   2> 1858671 INFO  (qtp694349042-25565) [n:127.0.0.1:44399_solr c:testMoveReplicaMainCollection_xyz s:shard1 r:core_node2 x:testMoveReplicaMainCollection_xyz_shard1_replica_n1] o.a.s.s.DirectSolrSpellChecker init: {name=default,field=_text_,classname=solr.DirectSolrSpellChecker,distanceMeasure=internal,accuracy=0.5,maxEdits=2,minPrefix=1,maxInspections=5,minQueryLength=4,maxQueryFrequency=0.01}
   [junit4]   2> 1858672 INFO  (qtp694349042-25565) [n:127.0.0.1:44399_solr c:testMoveReplicaMainCollection_xyz s:shard1 r:core_node2 x:testMoveReplicaMainCollection_xyz_shard1_replica_n1] o.a.s.h.ReplicationHandler Commits will be reserved for 10000ms.
   [junit4]   2> 1858672 INFO  (qtp694349042-25565) [n:127.0.0.1:44399_solr c:testMoveReplicaMainCollection_xyz s:shard1 r:core_node2 x:testMoveReplicaMainCollection_xyz_shard1_replica_n1] o.a.s.u.UpdateLog Could not find max version in index or recent updates, using new clock 1609033019130118144
   [junit4]   2> 1858672 INFO  (searcherExecutor-8364-thread-1-processing-n:127.0.0.1:44399_solr x:testMoveReplicaMainCollection_xyz_shard1_replica_n1 c:testMoveReplicaMainCollection_xyz s:shard1 r:core_node2) [n:127.0.0.1:44399_solr c:testMoveReplicaMainCollection_xyz s:shard1 r:core_node2 x:testMoveReplicaMainCollection_xyz_shard1_replica_n1] o.a.s.c.QuerySenderListener QuerySenderListener sending requests to Searcher@c95a9fa[testMoveReplicaMainCollection_xyz_shard1_replica_n1] main{ExitableDirectoryReader(UninvertingDirectoryReader())}
   [junit4]   2> 1858672 INFO  (searcherExecutor-8364-thread-1-processing-n:127.0.0.1:44399_solr x:testMoveReplicaMainCollection_xyz_shard1_replica_n1 c:testMoveReplicaMainCollection_xyz s:shard1 r:core_node2) [n:127.0.0.1:44399_solr c:testMoveReplicaMainCollection_xyz s:shard1 r:core_node2 x:testMoveReplicaMainCollection_xyz_shard1_replica_n1] o.a.s.c.QuerySenderListener QuerySenderListener done.
   [junit4]   2> 1858672 INFO  (searcherExecutor-8364-thread-1-processing-n:127.0.0.1:44399_solr x:testMoveReplicaMainCollection_xyz_shard1_replica_n1 c:testMoveReplicaMainCollection_xyz s:shard1 r:core_node2) [n:127.0.0.1:44399_solr c:testMoveReplicaMainCollection_xyz s:shard1 r:core_node2 x:testMoveReplicaMainCollection_xyz_shard1_replica_n1] o.a.s.h.c.SpellCheckComponent Loading spell index for spellchecker: default
   [junit4]   2> 1858673 INFO  (searcherExecutor-8364-thread-1-processing-n:127.0.0.1:44399_solr x:testMoveReplicaMainCollection_xyz_shard1_replica_n1 c:testMoveReplicaMainCollection_xyz s:shard1 r:core_node2) [n:127.0.0.1:44399_solr c:testMoveReplicaMainCollection_xyz s:shard1 r:core_node2 x:testMoveReplicaMainCollection_xyz_shard1_replica_n1] o.a.s.c.SolrCore [testMoveReplicaMainCollection_xyz_shard1_replica_n1] Registered new searcher Searcher@c95a9fa[testMoveReplicaMainCollection_xyz_shard1_replica_n1] main{ExitableDirectoryReader(UninvertingDirectoryReader())}
   [junit4]   2> 1858675 INFO  (qtp694349042-25565) [n:127.0.0.1:44399_solr c:testMoveReplicaMainCollection_xyz s:shard1 r:core_node2 x:testMoveReplicaMainCollection_xyz_shard1_replica_n1] o.a.s.c.ZkShardTerms Successful update of terms at /collections/testMoveReplicaMainCollection_xyz/terms/shard1 to Terms{values={core_node2=0}, version=0}
   [junit4]   2> 1858676 INFO  (qtp694349042-25565) [n:127.0.0.1:44399_solr c:testMoveReplicaMainCollection_xyz s:shard1 r:core_node2 x:testMoveReplicaMainCollection_xyz_shard1_replica_n1] o.a.s.c.ShardLeaderElectionContext Enough replicas found to continue.
   [junit4]   2> 1858676 INFO  (qtp694349042-25565) [n:127.0.0.1:44399_solr c:testMoveReplicaMainCollection_xyz s:shard1 r:core_node2 x:testMoveReplicaMainCollection_xyz_shard1_replica_n1] o.a.s.c.ShardLeaderElectionContext I may be the new leader - try and sync
   [junit4]   2> 1858677 INFO  (qtp694349042-25565) [n:127.0.0.1:44399_solr c:testMoveReplicaMainCollection_xyz s:shard1 r:core_node2 x:testMoveReplicaMainCollection_xyz_shard1_replica_n1] o.a.s.c.SyncStrategy Sync replicas to https://127.0.0.1:44399/solr/testMoveReplicaMainCollection_xyz_shard1_replica_n1/
   [junit4]   2> 1858677 INFO  (qtp694349042-25565) [n:127.0.0.1:44399_solr c:testMoveReplicaMainCollection_xyz s:shard1 r:core_node2 x:testMoveReplicaMainCollection_xyz_shard1_replica_n1] o.a.s.c.SyncStrategy Sync Success - now sync replicas to me
   [junit4]   2> 1858677 INFO  (qtp694349042-25565) [n:127.0.0.1:44399_solr c:testMoveReplicaMainCollection_xyz s:shard1 r:core_node2 x:testMoveReplicaMainCollection_xyz_shard1_replica_n1] o.a.s.c.SyncStrategy https://127.0.0.1:44399/solr/testMoveReplicaMainCollection_xyz_shard1_replica_n1/ has no replicas
   [junit4]   2> 1858677 INFO  (qtp694349042-25565) [n:127.0.0.1:44399_solr c:testMoveReplicaMainCollection_xyz s:shard1 r:core_node2 x:testMoveReplicaMainCollection_xyz_shard1_replica_n1] o.a.s.c.ShardLeaderElectionContext Found all replicas participating in election, clear LIR
   [junit4]   2> 1858678 INFO  (qtp694349042-25565) [n:127.0.0.1:44399_solr c:testMoveReplicaMainCollection_xyz s:shard1 r:core_node2 x:testMoveReplicaMainCollection_xyz_shard1_replica_n1] o.a.s.c.ShardLeaderElectionContext I am the new leader: https://127.0.0.1:44399/solr/testMoveReplicaMainCollection_xyz_shard1_replica_n1/ shard1
   [junit4]   2> 1858836 INFO  (qtp694349042-25565) [n:127.0.0.1:44399_solr c:testMoveReplicaMainCollection_xyz s:shard1 r:core_node2 x:testMoveReplicaMainCollection_xyz_shard1_replica_n1] o.a.s.c.ZkController I am the leader, no recovery necessary
   [junit4]   2> 1858860 INFO  (qtp694349042-25565) [n:127.0.0.1:44399_solr c:testMoveReplicaMainCollection_xyz s:shard1 r:core_node2 x:testMoveReplicaMainCollection_xyz_shard1_replica_n1] o.a.s.s.HttpSolrCall [admin] webapp=null path=/admin/cores params={qt=/admin/cores&coreNodeName=core_node2&collection.configName=testMoveReplicaMainCollection_xyz.AUTOCREATED&newCollection=true&name=testMoveReplicaMainCollection_xyz_shard1_replica_n1&action=CREATE&numShards=1&collection=testMoveReplicaMainCollection_xyz&shard=shard1&wt=javabin&version=2&replicaType=NRT} status=0 QTime=1351
   [junit4]   2> 1858862 DEBUG (OverseerThreadFactory-8347-thread-2) [    ] o.a.s.c.s.c.a.PolicyHelper session set to NULL
   [junit4]   2> 1858863 INFO  (qtp1501380926-25572) [n:127.0.0.1:34311_solr    ] o.a.s.h.a.CollectionsHandler Wait for new collection to be active for at most 30 seconds. Check all shard replicas
   [junit4]   2> 1858964 INFO  (zkCallback-6738-thread-1) [    ] o.a.s.c.c.ZkStateReader A cluster state change: [WatchedEvent state:SyncConnected type:NodeDataChanged path:/collections/testMoveReplicaMainCollection_xyz/state.json] for collection [testMoveReplicaMainCollection_xyz] has occurred - updating... (live nodes size: [2])
   [junit4]   2> 1858964 INFO  (zkCallback-6738-thread-1) [    ] o.a.s.c.c.ZkStateReader A cluster state change: [WatchedEvent state:SyncConnected type:NodeDataChanged path:/collections/testMoveReplicaMainCollection_abc/state.json] for collection [testMoveReplicaMainCollection_abc] has occurred - updating... (live nodes size: [2])
   [junit4]   2> 1859069 INFO  (OverseerCollectionConfigSetProcessor-72063435752538116-127.0.0.1:34311_solr-n_0000000000) [    ] o.a.s.c.OverseerTaskQueue Response ZK path: /overseer/collection-queue-work/qnr-0000000002 doesn't exist.  Requestor may have disconnected from ZooKeeper
   [junit4]   2> 1859865 INFO  (qtp1501380926-25572) [n:127.0.0.1:34311_solr    ] o.a.s.s.HttpSolrCall [admin] webapp=null path=/admin/collections params={pullReplicas=0&withCollection=testMoveReplicaMainCollection_abc&name=testMoveReplicaMainCollection_xyz&nrtReplicas=1&action=CREATE&numShards=1&tlogReplicas=0&wt=javabin&version=2} status=0 QTime=2798
   [junit4]   2> 1859866 INFO  (qtp1501380926-25570) [n:127.0.0.1:34311_solr    ] o.a.s.h.a.CollectionsHandler Invoked Collection Action :movereplica with params replica=core_node2&action=MOVEREPLICA&collection=testMoveReplicaMainCollection_xyz&targetNode=127.0.0.1:34311_solr&wt=javabin&version=2&inPlaceMove=true and sendToOCPQueue=true
   [junit4]   2> 1859868 INFO  (OverseerThreadFactory-8347-thread-3) [ c:testMoveReplicaMainCollection_xyz  r:core_node2 ] o.a.s.c.a.c.MoveReplicaCmd Replica will be moved to node 127.0.0.1:34311_solr: core_node2:{"core":"testMoveReplicaMainCollection_xyz_shard1_replica_n1","base_url":"https://127.0.0.1:44399/solr","node_name":"127.0.0.1:44399_solr","state":"active","type":"NRT","force_set_state":"false","leader":"true"}
   [junit4]   2> 1859869 

[...truncated too long message...]

-fail-disallowed-ivy-version:

ivy-fail:

resolve-groovy:
[ivy:cachepath] :: resolving dependencies :: org.codehaus.groovy#groovy-all-caller;working
[ivy:cachepath] 	confs: [default]
[ivy:cachepath] 	found org.codehaus.groovy#groovy-all;2.4.15 in public
[ivy:cachepath] :: resolution report :: resolve 13ms :: artifacts dl 0ms
	---------------------------------------------------------------------
	|                  |            modules            ||   artifacts   |
	|       conf       | number| search|dwnlded|evicted|| number|dwnlded|
	---------------------------------------------------------------------
	|      default     |   1   |   0   |   0   |   0   ||   1   |   0   |
	---------------------------------------------------------------------

-init-totals:

-test:
    [mkdir] Created dir: /home/jenkins/workspace/Lucene-Solr-7.x-Linux/solr/build/solr-core/test
[junit4:pickseed] Seed property 'tests.seed' already defined: 288F3D28BE3E1F12
    [mkdir] Created dir: /home/jenkins/workspace/Lucene-Solr-7.x-Linux/solr/build/solr-core/test/temp
   [junit4] <JUnit4> says salut! Master seed: 288F3D28BE3E1F12
   [junit4] Executing 5 suites with 3 JVMs.
   [junit4] 
   [junit4] Started J2 PID(14954@serv1.sd-datasolutions.de).
   [junit4] Started J1 PID(14956@serv1.sd-datasolutions.de).
   [junit4] Started J0 PID(14955@serv1.sd-datasolutions.de).
   [junit4] Suite: org.apache.solr.cloud.TestWithCollection
   [junit4] OK      14.6s J0 | TestWithCollection.testMoveReplicaMainCollection
   [junit4] OK      12.2s J0 | TestWithCollection.testAddReplicaWithPolicy
   [junit4] OK      7.34s J0 | TestWithCollection.testMoveReplicaWithCollection
   [junit4] OK      16.3s J0 | TestWithCollection.testNodeAdded
   [junit4] OK      7.12s J0 | TestWithCollection.testCreateCollection
   [junit4] OK      16.9s J0 | TestWithCollection.testDeleteWithCollection
   [junit4] OK      8.64s J0 | TestWithCollection.testAddReplicaSimple
   [junit4] OK      4.38s J0 | TestWithCollection.testCreateCollectionNoWithCollection
   [junit4] OK      16.6s J0 | TestWithCollection.testMultipleWithCollections
   [junit4] Completed [1/5] on J0 in 114.94s, 9 tests
   [junit4] 
   [junit4] Suite: org.apache.solr.cloud.TestWithCollection
   [junit4] OK      14.2s J2 | TestWithCollection.testMoveReplicaMainCollection
   [junit4] OK      12.6s J2 | TestWithCollection.testAddReplicaWithPolicy
   [junit4] OK      7.33s J2 | TestWithCollection.testMoveReplicaWithCollection
   [junit4] OK      16.6s J2 | TestWithCollection.testNodeAdded
   [junit4] OK      7.13s J2 | TestWithCollection.testCreateCollection
   [junit4] OK      17.1s J2 | TestWithCollection.testDeleteWithCollection
   [junit4] OK      8.74s J2 | TestWithCollection.testAddReplicaSimple
   [junit4] OK      4.50s J2 | TestWithCollection.testCreateCollectionNoWithCollection
   [junit4] OK      17.2s J2 | TestWithCollection.testMultipleWithCollections
   [junit4] Completed [2/5] on J2 in 115.60s, 9 tests
   [junit4] 
   [junit4] Suite: org.apache.solr.cloud.TestWithCollection
   [junit4] OK      14.7s J1 | TestWithCollection.testMoveReplicaMainCollection
   [junit4] OK      12.5s J1 | TestWithCollection.testAddReplicaWithPolicy
   [junit4] OK      7.32s J1 | TestWithCollection.testMoveReplicaWithCollection
   [junit4] OK      16.6s J1 | TestWithCollection.testNodeAdded
   [junit4] OK      7.14s J1 | TestWithCollection.testCreateCollection
   [junit4] OK      17.0s J1 | TestWithCollection.testDeleteWithCollection
   [junit4] OK      8.73s J1 | TestWithCollection.testAddReplicaSimple
   [junit4] OK      4.46s J1 | TestWithCollection.testCreateCollectionNoWithCollection
   [junit4] OK      17.1s J1 | TestWithCollection.testMultipleWithCollections
   [junit4] Completed [3/5] on J1 in 115.60s, 9 tests
   [junit4] 
   [junit4] Duplicate suite name used with XML reports: org.apache.solr.cloud.TestWithCollection. This may confuse tools that process XML reports. Set 'ignoreDuplicateSuites' to true to skip this message.
   [junit4] Suite: org.apache.solr.cloud.TestWithCollection
   [junit4] OK      9.73s J0 | TestWithCollection.testMoveReplicaMainCollection
   [junit4] OK      11.7s J0 | TestWithCollection.testAddReplicaWithPolicy
   [junit4] OK      7.09s J0 | TestWithCollection.testMoveReplicaWithCollection
   [junit4] OK      16.6s J0 | TestWithCollection.testNodeAdded
   [junit4] OK      6.93s J0 | TestWithCollection.testCreateCollection
   [junit4] OK      14.8s J0 | TestWithCollection.testDeleteWithCollection
   [junit4] OK      8.55s J0 | TestWithCollection.testAddReplicaSimple
   [junit4] OK      4.36s J0 | TestWithCollection.testCreateCollectionNoWithCollection
   [junit4] OK      16.4s J0 | TestWithCollection.testMultipleWithCollections
   [junit4] Completed [4/5] on J0 in 102.29s, 9 tests
   [junit4] 
   [junit4] Suite: org.apache.solr.cloud.TestWithCollection
   [junit4] OK      9.67s J2 | TestWithCollection.testMoveReplicaMainCollection
   [junit4] OK      11.7s J2 | TestWithCollection.testAddReplicaWithPolicy
   [junit4] OK      7.79s J2 | TestWithCollection.testMoveReplicaWithCollection
   [junit4] OK      16.0s J2 | TestWithCollection.testNodeAdded
   [junit4] OK      7.06s J2 | TestWithCollection.testCreateCollection
   [junit4] OK      14.8s J2 | TestWithCollection.testDeleteWithCollection
   [junit4] OK      8.57s J2 | TestWithCollection.testAddReplicaSimple
   [junit4] OK      4.35s J2 | TestWithCollection.testCreateCollectionNoWithCollection
   [junit4] OK      16.5s J2 | TestWithCollection.testMultipleWithCollections
   [junit4] Completed [5/5] on J2 in 102.80s, 9 tests
   [junit4] 
   [junit4] JVM J0:     0.38 ..   219.14 =   218.76s
   [junit4] JVM J1:     0.37 ..   116.77 =   116.40s
   [junit4] JVM J2:     0.37 ..   219.85 =   219.49s
   [junit4] Execution time total: 3 minutes 39 seconds
   [junit4] Tests summary: 5 suites, 45 tests
   [junit4] Could not remove temporary path: /home/jenkins/workspace/Lucene-Solr-7.x-Linux/solr/build/solr-core/test/J0 (java.nio.file.DirectoryNotEmptyException: Remaining files: [/home/jenkins/workspace/Lucene-Solr-7.x-Linux/solr/build/solr-core/test/J0/temp])
   [junit4] Could not remove temporary path: /home/jenkins/workspace/Lucene-Solr-7.x-Linux/solr/build/solr-core/test/J1 (java.nio.file.DirectoryNotEmptyException: Remaining files: [/home/jenkins/workspace/Lucene-Solr-7.x-Linux/solr/build/solr-core/test/J1/temp])
   [junit4] Could not remove temporary path: /home/jenkins/workspace/Lucene-Solr-7.x-Linux/solr/build/solr-core/test/J2 (java.nio.file.DirectoryNotEmptyException: Remaining files: [/home/jenkins/workspace/Lucene-Solr-7.x-Linux/solr/build/solr-core/test/J2/temp])
     [echo] 5 slowest tests:
[junit4:tophints] 1406.14s | org.apache.solr.cloud.BasicDistributedZkTest
[junit4:tophints] 518.74s | org.apache.solr.cloud.api.collections.ShardSplitTest
[junit4:tophints] 139.09s | org.apache.solr.cloud.api.collections.CollectionsAPIDistributedZkTest
[junit4:tophints] 118.92s | org.apache.solr.update.SoftAutoCommitTest
[junit4:tophints] 118.19s | org.apache.solr.search.TestStressRecovery

-check-totals:

test-nocompile:

BUILD SUCCESSFUL
Total time: 3 minutes 41 seconds
[repro] Failures:
[repro]   0/5 failed: org.apache.solr.cloud.TestWithCollection
[repro] Exiting with code 0
+ mv lucene/build lucene/build.repro
+ mv solr/build solr/build.repro
+ mv lucene/build.orig lucene/build
+ mv solr/build.orig solr/build
Archiving artifacts
Setting ANT_1_8_2_HOME=/var/lib/jenkins/tools/hudson.tasks.Ant_AntInstallation/ANT_1.8.2
java.lang.InterruptedException: no matches found within 10000
	at hudson.FilePath$ValidateAntFileMask.hasMatch(FilePath.java:2846)
	at hudson.FilePath$ValidateAntFileMask.invoke(FilePath.java:2725)
	at hudson.FilePath$ValidateAntFileMask.invoke(FilePath.java:2706)
	at hudson.FilePath.act(FilePath.java:1077)
	at hudson.FilePath.act(FilePath.java:1060)
	at hudson.FilePath.validateAntFileMask(FilePath.java:2704)
	at hudson.tasks.ArtifactArchiver.perform(ArtifactArchiver.java:243)
	at hudson.tasks.BuildStepCompatibilityLayer.perform(BuildStepCompatibilityLayer.java:81)
	at hudson.tasks.BuildStepMonitor$1.perform(BuildStepMonitor.java:20)
	at hudson.model.AbstractBuild$AbstractBuildExecution.perform(AbstractBuild.java:744)
	at hudson.model.AbstractBuild$AbstractBuildExecution.performAllBuildSteps(AbstractBuild.java:690)
	at hudson.model.Build$BuildExecution.post2(Build.java:186)
	at hudson.model.AbstractBuild$AbstractBuildExecution.post(AbstractBuild.java:635)
	at hudson.model.Run.execute(Run.java:1840)
	at hudson.model.FreeStyleBuild.run(FreeStyleBuild.java:43)
	at hudson.model.ResourceController.execute(ResourceController.java:97)
	at hudson.model.Executor.run(Executor.java:429)
No artifacts found that match the file pattern "**/*.events,heapdumps/**,**/*_pid*.log". Configuration error?
[WARNINGS] Parsing warnings in console log with parser Java Compiler (javac)
Setting ANT_1_8_2_HOME=/var/lib/jenkins/tools/hudson.tasks.Ant_AntInstallation/ANT_1.8.2
Setting ANT_1_8_2_HOME=/var/lib/jenkins/tools/hudson.tasks.Ant_AntInstallation/ANT_1.8.2
<Git Blamer> Using GitBlamer to create author and commit information for all warnings.
<Git Blamer> GIT_COMMIT=6f8383f6cc866891a835e7c6166fe6d2f9e14149, workspace=/var/lib/jenkins/workspace/Lucene-Solr-7.x-Linux
[WARNINGS] Computing warning deltas based on reference build #2572
Recording test results
Setting ANT_1_8_2_HOME=/var/lib/jenkins/tools/hudson.tasks.Ant_AntInstallation/ANT_1.8.2
Build step 'Publish JUnit test result report' changed build result to UNSTABLE
Email was triggered for: Unstable (Test Failures)
Sending email for trigger: Unstable (Test Failures)
Setting ANT_1_8_2_HOME=/var/lib/jenkins/tools/hudson.tasks.Ant_AntInstallation/ANT_1.8.2
Setting ANT_1_8_2_HOME=/var/lib/jenkins/tools/hudson.tasks.Ant_AntInstallation/ANT_1.8.2
Setting ANT_1_8_2_HOME=/var/lib/jenkins/tools/hudson.tasks.Ant_AntInstallation/ANT_1.8.2
Setting ANT_1_8_2_HOME=/var/lib/jenkins/tools/hudson.tasks.Ant_AntInstallation/ANT_1.8.2