You are viewing a plain text version of this content. The canonical link for it is here.
Posted to commits@beam.apache.org by Apache Jenkins Server <je...@builds.apache.org> on 2018/06/03 00:13:47 UTC
Build failed in Jenkins: beam_PerformanceTests_MongoDBIO_IT #252
See <https://builds.apache.org/job/beam_PerformanceTests_MongoDBIO_IT/252/display/redirect>
------------------------------------------
[...truncated 210.77 KB...]
at com.mongodb.operation.OperationHelper.withConnectionSource(OperationHelper.java:230)
at com.mongodb.operation.OperationHelper.withConnection(OperationHelper.java:221)
at com.mongodb.operation.MixedBulkWriteOperation.execute(MixedBulkWriteOperation.java:168)
at com.mongodb.operation.MixedBulkWriteOperation.execute(MixedBulkWriteOperation.java:74)
at com.mongodb.Mongo.execute(Mongo.java:781)
at com.mongodb.Mongo$2.execute(Mongo.java:764)
at com.mongodb.MongoCollectionImpl.insertMany(MongoCollectionImpl.java:323)
at com.mongodb.MongoCollectionImpl.insertMany(MongoCollectionImpl.java:311)
at org.apache.beam.sdk.io.mongodb.MongoDbIO$Write$WriteFn.flush(MongoDbIO.java:667)
at org.apache.beam.sdk.io.mongodb.MongoDbIO$Write$WriteFn.processElement(MongoDbIO.java:652)
at org.apache.beam.sdk.io.mongodb.MongoDbIO$Write$WriteFn$DoFnInvoker.invokeProcessElement(Unknown Source)
at org.apache.beam.runners.core.SimpleDoFnRunner.invokeProcessElement(SimpleDoFnRunner.java:185)
at org.apache.beam.runners.core.SimpleDoFnRunner.processElement(SimpleDoFnRunner.java:149)
at com.google.cloud.dataflow.worker.SimpleParDoFn.processElement(SimpleParDoFn.java:323)
at com.google.cloud.dataflow.worker.util.common.worker.ParDoOperation.process(ParDoOperation.java:43)
at com.google.cloud.dataflow.worker.util.common.worker.OutputReceiver.process(OutputReceiver.java:48)
at com.google.cloud.dataflow.worker.SimpleParDoFn$1.output(SimpleParDoFn.java:271)
at org.apache.beam.runners.core.SimpleDoFnRunner.outputWindowedValue(SimpleDoFnRunner.java:219)
at org.apache.beam.runners.core.SimpleDoFnRunner.access$700(SimpleDoFnRunner.java:69)
at org.apache.beam.runners.core.SimpleDoFnRunner$DoFnProcessContext.output(SimpleDoFnRunner.java:517)
at org.apache.beam.runners.core.SimpleDoFnRunner$DoFnProcessContext.output(SimpleDoFnRunner.java:505)
at org.apache.beam.sdk.transforms.MapElements$1.processElement(MapElements.java:129)
at org.apache.beam.sdk.transforms.MapElements$1$DoFnInvoker.invokeProcessElement(Unknown Source)
at org.apache.beam.runners.core.SimpleDoFnRunner.invokeProcessElement(SimpleDoFnRunner.java:185)
at org.apache.beam.runners.core.SimpleDoFnRunner.processElement(SimpleDoFnRunner.java:149)
at com.google.cloud.dataflow.worker.SimpleParDoFn.processElement(SimpleParDoFn.java:323)
at com.google.cloud.dataflow.worker.util.common.worker.ParDoOperation.process(ParDoOperation.java:43)
at com.google.cloud.dataflow.worker.util.common.worker.OutputReceiver.process(OutputReceiver.java:48)
at com.google.cloud.dataflow.worker.util.common.worker.ReadOperation.runReadLoop(ReadOperation.java:200)
at com.google.cloud.dataflow.worker.util.common.worker.ReadOperation.start(ReadOperation.java:158)
at com.google.cloud.dataflow.worker.util.common.worker.MapTaskExecutor.execute(MapTaskExecutor.java:75)
at com.google.cloud.dataflow.worker.BatchDataflowWorker.executeWork(BatchDataflowWorker.java:391)
at com.google.cloud.dataflow.worker.BatchDataflowWorker.doWork(BatchDataflowWorker.java:360)
at com.google.cloud.dataflow.worker.BatchDataflowWorker.getAndPerformWork(BatchDataflowWorker.java:288)
at com.google.cloud.dataflow.worker.DataflowBatchWorkerHarness$WorkerThread.doWork(DataflowBatchWorkerHarness.java:134)
at com.google.cloud.dataflow.worker.DataflowBatchWorkerHarness$WorkerThread.call(DataflowBatchWorkerHarness.java:114)
at com.google.cloud.dataflow.worker.DataflowBatchWorkerHarness$WorkerThread.call(DataflowBatchWorkerHarness.java:101)
at java.util.concurrent.FutureTask.run(FutureTask.java:266)
at java.util.concurrent.ThreadPoolExecutor.runWorker(ThreadPoolExecutor.java:1142)
at java.util.concurrent.ThreadPoolExecutor$Worker.run(ThreadPoolExecutor.java:617)
at java.lang.Thread.run(Thread.java:745)
com.mongodb.MongoTimeoutException: Timed out after 30000 ms while waiting for a server that matches WritableServerSelector. Client view of cluster state is {type=UNKNOWN, servers=[{address=35.225.188.138:27017, type=UNKNOWN, state=CONNECTING, exception={com.mongodb.MongoSocketOpenException: Exception opening socket}, caused by {java.net.SocketTimeoutException: connect timed out}}]
at com.mongodb.connection.BaseCluster.createTimeoutException(BaseCluster.java:369)
at com.mongodb.connection.BaseCluster.selectServer(BaseCluster.java:101)
at com.mongodb.binding.ClusterBinding$ClusterBindingConnectionSource.<init>(ClusterBinding.java:75)
at com.mongodb.binding.ClusterBinding$ClusterBindingConnectionSource.<init>(ClusterBinding.java:71)
at com.mongodb.binding.ClusterBinding.getWriteConnectionSource(ClusterBinding.java:68)
at com.mongodb.operation.OperationHelper.withConnection(OperationHelper.java:219)
at com.mongodb.operation.MixedBulkWriteOperation.execute(MixedBulkWriteOperation.java:168)
at com.mongodb.operation.MixedBulkWriteOperation.execute(MixedBulkWriteOperation.java:74)
at com.mongodb.Mongo.execute(Mongo.java:781)
at com.mongodb.Mongo$2.execute(Mongo.java:764)
at com.mongodb.MongoCollectionImpl.insertMany(MongoCollectionImpl.java:323)
at com.mongodb.MongoCollectionImpl.insertMany(MongoCollectionImpl.java:311)
at org.apache.beam.sdk.io.mongodb.MongoDbIO$Write$WriteFn.flush(MongoDbIO.java:667)
at org.apache.beam.sdk.io.mongodb.MongoDbIO$Write$WriteFn.processElement(MongoDbIO.java:652)
com.mongodb.MongoTimeoutException: Timed out after 30000 ms while waiting for a server that matches WritableServerSelector. Client view of cluster state is {type=UNKNOWN, servers=[{address=35.225.188.138:27017, type=UNKNOWN, state=CONNECTING, exception={com.mongodb.MongoSocketOpenException: Exception opening socket}, caused by {java.net.SocketTimeoutException: connect timed out}}]
at com.mongodb.connection.BaseCluster.createTimeoutException(BaseCluster.java:369)
at com.mongodb.connection.BaseCluster.selectServer(BaseCluster.java:101)
at com.mongodb.binding.ClusterBinding$ClusterBindingConnectionSource.<init>(ClusterBinding.java:75)
at com.mongodb.binding.ClusterBinding$ClusterBindingConnectionSource.<init>(ClusterBinding.java:71)
at com.mongodb.binding.ClusterBinding.getWriteConnectionSource(ClusterBinding.java:68)
at com.mongodb.operation.OperationHelper.withConnection(OperationHelper.java:219)
at com.mongodb.operation.MixedBulkWriteOperation.execute(MixedBulkWriteOperation.java:168)
at com.mongodb.operation.MixedBulkWriteOperation.execute(MixedBulkWriteOperation.java:74)
at com.mongodb.Mongo.execute(Mongo.java:781)
at com.mongodb.Mongo$2.execute(Mongo.java:764)
at com.mongodb.MongoCollectionImpl.insertMany(MongoCollectionImpl.java:323)
at com.mongodb.MongoCollectionImpl.insertMany(MongoCollectionImpl.java:311)
at org.apache.beam.sdk.io.mongodb.MongoDbIO$Write$WriteFn.flush(MongoDbIO.java:667)
at org.apache.beam.sdk.io.mongodb.MongoDbIO$Write$WriteFn.processElement(MongoDbIO.java:652)
com.mongodb.MongoTimeoutException: Timed out after 30000 ms while waiting for a server that matches WritableServerSelector. Client view of cluster state is {type=UNKNOWN, servers=[{address=35.225.188.138:27017, type=UNKNOWN, state=CONNECTING, exception={com.mongodb.MongoSocketOpenException: Exception opening socket}, caused by {java.net.SocketTimeoutException: connect timed out}}]
at com.mongodb.connection.BaseCluster.createTimeoutException(BaseCluster.java:369)
at com.mongodb.connection.BaseCluster.selectServer(BaseCluster.java:101)
at com.mongodb.binding.ClusterBinding$ClusterBindingConnectionSource.<init>(ClusterBinding.java:75)
at com.mongodb.binding.ClusterBinding$ClusterBindingConnectionSource.<init>(ClusterBinding.java:71)
at com.mongodb.binding.ClusterBinding.getWriteConnectionSource(ClusterBinding.java:68)
at com.mongodb.operation.OperationHelper.withConnection(OperationHelper.java:219)
at com.mongodb.operation.MixedBulkWriteOperation.execute(MixedBulkWriteOperation.java:168)
at com.mongodb.operation.MixedBulkWriteOperation.execute(MixedBulkWriteOperation.java:74)
at com.mongodb.Mongo.execute(Mongo.java:781)
at com.mongodb.Mongo$2.execute(Mongo.java:764)
at com.mongodb.MongoCollectionImpl.insertMany(MongoCollectionImpl.java:323)
at com.mongodb.MongoCollectionImpl.insertMany(MongoCollectionImpl.java:311)
at org.apache.beam.sdk.io.mongodb.MongoDbIO$Write$WriteFn.flush(MongoDbIO.java:667)
at org.apache.beam.sdk.io.mongodb.MongoDbIO$Write$WriteFn.processElement(MongoDbIO.java:652)
com.mongodb.MongoTimeoutException: Timed out after 30000 ms while waiting for a server that matches WritableServerSelector. Client view of cluster state is {type=UNKNOWN, servers=[{address=35.225.188.138:27017, type=UNKNOWN, state=CONNECTING, exception={com.mongodb.MongoSocketOpenException: Exception opening socket}, caused by {java.net.SocketTimeoutException: connect timed out}}]
at com.mongodb.connection.BaseCluster.createTimeoutException(BaseCluster.java:369)
at com.mongodb.connection.BaseCluster.selectServer(BaseCluster.java:101)
at com.mongodb.binding.ClusterBinding$ClusterBindingConnectionSource.<init>(ClusterBinding.java:75)
at com.mongodb.binding.ClusterBinding$ClusterBindingConnectionSource.<init>(ClusterBinding.java:71)
at com.mongodb.binding.ClusterBinding.getWriteConnectionSource(ClusterBinding.java:68)
at com.mongodb.operation.OperationHelper.withConnection(OperationHelper.java:219)
at com.mongodb.operation.MixedBulkWriteOperation.execute(MixedBulkWriteOperation.java:168)
at com.mongodb.operation.MixedBulkWriteOperation.execute(MixedBulkWriteOperation.java:74)
at com.mongodb.Mongo.execute(Mongo.java:781)
at com.mongodb.Mongo$2.execute(Mongo.java:764)
at com.mongodb.MongoCollectionImpl.insertMany(MongoCollectionImpl.java:323)
at com.mongodb.MongoCollectionImpl.insertMany(MongoCollectionImpl.java:311)
at org.apache.beam.sdk.io.mongodb.MongoDbIO$Write$WriteFn.flush(MongoDbIO.java:667)
at org.apache.beam.sdk.io.mongodb.MongoDbIO$Write$WriteFn.processElement(MongoDbIO.java:652)
com.mongodb.MongoTimeoutException: Timed out after 30000 ms while waiting for a server that matches WritableServerSelector. Client view of cluster state is {type=UNKNOWN, servers=[{address=35.225.188.138:27017, type=UNKNOWN, state=CONNECTING, exception={com.mongodb.MongoSocketOpenException: Exception opening socket}, caused by {java.net.SocketTimeoutException: connect timed out}}]
at com.mongodb.connection.BaseCluster.createTimeoutException(BaseCluster.java:369)
at com.mongodb.connection.BaseCluster.selectServer(BaseCluster.java:101)
at com.mongodb.binding.ClusterBinding$ClusterBindingConnectionSource.<init>(ClusterBinding.java:75)
at com.mongodb.binding.ClusterBinding$ClusterBindingConnectionSource.<init>(ClusterBinding.java:71)
at com.mongodb.binding.ClusterBinding.getWriteConnectionSource(ClusterBinding.java:68)
at com.mongodb.operation.OperationHelper.withConnection(OperationHelper.java:219)
at com.mongodb.operation.MixedBulkWriteOperation.execute(MixedBulkWriteOperation.java:168)
at com.mongodb.operation.MixedBulkWriteOperation.execute(MixedBulkWriteOperation.java:74)
at com.mongodb.Mongo.execute(Mongo.java:781)
at com.mongodb.Mongo$2.execute(Mongo.java:764)
at com.mongodb.MongoCollectionImpl.insertMany(MongoCollectionImpl.java:323)
at com.mongodb.MongoCollectionImpl.insertMany(MongoCollectionImpl.java:311)
at org.apache.beam.sdk.io.mongodb.MongoDbIO$Write$WriteFn.flush(MongoDbIO.java:667)
at org.apache.beam.sdk.io.mongodb.MongoDbIO$Write$WriteFn.processElement(MongoDbIO.java:652)
Workflow failed. Causes: S01:Generate sequence/Read(BoundedCountingSource)+Produce documents/Map+Write documents to MongoDB/ParDo(Write) failed., A work item was attempted 4 times without success. Each time the worker eventually lost contact with the service. The work item was attempted on:
mongodbioit0testwriteandr-06021704-qjpw-harness-7nx9,
mongodbioit0testwriteandr-06021704-qjpw-harness-7nx9,
mongodbioit0testwriteandr-06021704-qjpw-harness-7nx9,
mongodbioit0testwriteandr-06021704-qjpw-harness-7nx9
at org.apache.beam.runners.dataflow.TestDataflowRunner.run(TestDataflowRunner.java:134)
at org.apache.beam.runners.dataflow.TestDataflowRunner.run(TestDataflowRunner.java:90)
at org.apache.beam.runners.dataflow.TestDataflowRunner.run(TestDataflowRunner.java:55)
at org.apache.beam.sdk.Pipeline.run(Pipeline.java:311)
at org.apache.beam.sdk.testing.TestPipeline.run(TestPipeline.java:348)
at org.apache.beam.sdk.testing.TestPipeline.run(TestPipeline.java:329)
at org.apache.beam.sdk.io.mongodb.MongoDBIOIT.testWriteAndRead(MongoDBIOIT.java:118)
1 test completed, 1 failed
Finished generating test XML results (0.022 secs) into: <https://builds.apache.org/job/beam_PerformanceTests_MongoDBIO_IT/ws/src/sdks/java/io/mongodb/build/test-results/integrationTest>
Generating HTML test report...
Finished generating test html results (0.032 secs) into: <https://builds.apache.org/job/beam_PerformanceTests_MongoDBIO_IT/ws/src/sdks/java/io/mongodb/build/reports/tests/integrationTest>
:beam-sdks-java-io-mongodb:integrationTest (Thread[Task worker for ':' Thread 11,5,main]) completed. Took 9 mins 32.816 secs.
Deprecated Gradle features were used in this build, making it incompatible with Gradle 5.0.
See https://docs.gradle.org/4.7/userguide/command_line_interface.html#sec:command_line_warnings
BUILD FAILED in 9m 42s
62 actionable tasks: 1 executed, 61 up-to-date
Publishing build scan...
https://gradle.com/s/bxlsmaayqzisg
STDERR:
FAILURE: Build failed with an exception.
* What went wrong:
Execution failed for task ':beam-sdks-java-io-mongodb:integrationTest'.
> There were failing tests. See the report at: file://<https://builds.apache.org/job/beam_PerformanceTests_MongoDBIO_IT/ws/src/sdks/java/io/mongodb/build/reports/tests/integrationTest/index.html>
* Try:
Run with --debug option to get more log output. Run with --scan to get full insights.
* Exception is:
org.gradle.api.tasks.TaskExecutionException: Execution failed for task ':beam-sdks-java-io-mongodb:integrationTest'.
at org.gradle.api.internal.tasks.execution.ExecuteActionsTaskExecuter.executeActions(ExecuteActionsTaskExecuter.java:103)
at org.gradle.api.internal.tasks.execution.ExecuteActionsTaskExecuter.execute(ExecuteActionsTaskExecuter.java:73)
at org.gradle.api.internal.tasks.execution.OutputDirectoryCreatingTaskExecuter.execute(OutputDirectoryCreatingTaskExecuter.java:51)
at org.gradle.api.internal.tasks.execution.SkipCachedTaskExecuter.execute(SkipCachedTaskExecuter.java:105)
at org.gradle.api.internal.tasks.execution.SkipUpToDateTaskExecuter.execute(SkipUpToDateTaskExecuter.java:59)
at org.gradle.api.internal.tasks.execution.ResolveTaskOutputCachingStateExecuter.execute(ResolveTaskOutputCachingStateExecuter.java:54)
at org.gradle.api.internal.tasks.execution.ResolveBuildCacheKeyExecuter.execute(ResolveBuildCacheKeyExecuter.java:66)
at org.gradle.api.internal.tasks.execution.ValidatingTaskExecuter.execute(ValidatingTaskExecuter.java:59)
at org.gradle.api.internal.tasks.execution.SkipEmptySourceFilesTaskExecuter.execute(SkipEmptySourceFilesTaskExecuter.java:101)
at org.gradle.api.internal.tasks.execution.FinalizeInputFilePropertiesTaskExecuter.execute(FinalizeInputFilePropertiesTaskExecuter.java:44)
at org.gradle.api.internal.tasks.execution.CleanupStaleOutputsExecuter.execute(CleanupStaleOutputsExecuter.java:91)
at org.gradle.api.internal.tasks.execution.ResolveTaskArtifactStateTaskExecuter.execute(ResolveTaskArtifactStateTaskExecuter.java:62)
at org.gradle.api.internal.tasks.execution.SkipTaskWithNoActionsExecuter.execute(SkipTaskWithNoActionsExecuter.java:59)
at org.gradle.api.internal.tasks.execution.SkipOnlyIfTaskExecuter.execute(SkipOnlyIfTaskExecuter.java:54)
at org.gradle.api.internal.tasks.execution.ExecuteAtMostOnceTaskExecuter.execute(ExecuteAtMostOnceTaskExecuter.java:43)
at org.gradle.api.internal.tasks.execution.CatchExceptionTaskExecuter.execute(CatchExceptionTaskExecuter.java:34)
at org.gradle.execution.taskgraph.DefaultTaskGraphExecuter$EventFiringTaskWorker$1.run(DefaultTaskGraphExecuter.java:256)
at org.gradle.internal.operations.DefaultBuildOperationExecutor$RunnableBuildOperationWorker.execute(DefaultBuildOperationExecutor.java:317)
at org.gradle.internal.operations.DefaultBuildOperationExecutor$RunnableBuildOperationWorker.execute(DefaultBuildOperationExecutor.java:309)
at org.gradle.internal.operations.DefaultBuildOperationExecutor.execute(DefaultBuildOperationExecutor.java:185)
at org.gradle.internal.operations.DefaultBuildOperationExecutor.run(DefaultBuildOperationExecutor.java:97)
at org.gradle.internal.operations.DelegatingBuildOperationExecutor.run(DelegatingBuildOperationExecutor.java:31)
at org.gradle.execution.taskgraph.DefaultTaskGraphExecuter$EventFiringTaskWorker.execute(DefaultTaskGraphExecuter.java:249)
at org.gradle.execution.taskgraph.DefaultTaskGraphExecuter$EventFiringTaskWorker.execute(DefaultTaskGraphExecuter.java:238)
at org.gradle.execution.taskgraph.DefaultTaskPlanExecutor$TaskExecutorWorker$1.execute(DefaultTaskPlanExecutor.java:104)
at org.gradle.execution.taskgraph.DefaultTaskPlanExecutor$TaskExecutorWorker$1.execute(DefaultTaskPlanExecutor.java:98)
at org.gradle.execution.taskgraph.DefaultTaskExecutionPlan.execute(DefaultTaskExecutionPlan.java:663)
at org.gradle.execution.taskgraph.DefaultTaskExecutionPlan.executeWithTask(DefaultTaskExecutionPlan.java:596)
at org.gradle.execution.taskgraph.DefaultTaskPlanExecutor$TaskExecutorWorker.run(DefaultTaskPlanExecutor.java:98)
at org.gradle.internal.concurrent.ExecutorPolicy$CatchAndRecordFailures.onExecute(ExecutorPolicy.java:63)
at org.gradle.internal.concurrent.ManagedExecutorImpl$1.run(ManagedExecutorImpl.java:46)
at org.gradle.internal.concurrent.ThreadFactoryImpl$ManagedThreadRunnable.run(ThreadFactoryImpl.java:55)
Caused by: org.gradle.api.GradleException: There were failing tests. See the report at: file://<https://builds.apache.org/job/beam_PerformanceTests_MongoDBIO_IT/ws/src/sdks/java/io/mongodb/build/reports/tests/integrationTest/index.html>
at org.gradle.api.tasks.testing.AbstractTestTask.handleTestFailures(AbstractTestTask.java:612)
at org.gradle.api.tasks.testing.AbstractTestTask.executeTests(AbstractTestTask.java:484)
at org.gradle.api.tasks.testing.Test.executeTests(Test.java:583)
at org.gradle.internal.reflect.JavaMethod.invoke(JavaMethod.java:73)
at org.gradle.api.internal.project.taskfactory.StandardTaskAction.doExecute(StandardTaskAction.java:46)
at org.gradle.api.internal.project.taskfactory.StandardTaskAction.execute(StandardTaskAction.java:39)
at org.gradle.api.internal.project.taskfactory.StandardTaskAction.execute(StandardTaskAction.java:26)
at org.gradle.api.internal.AbstractTask$TaskActionWrapper.execute(AbstractTask.java:794)
at org.gradle.api.internal.AbstractTask$TaskActionWrapper.execute(AbstractTask.java:761)
at org.gradle.api.internal.tasks.execution.ExecuteActionsTaskExecuter$1.run(ExecuteActionsTaskExecuter.java:124)
at org.gradle.internal.operations.DefaultBuildOperationExecutor$RunnableBuildOperationWorker.execute(DefaultBuildOperationExecutor.java:317)
at org.gradle.internal.operations.DefaultBuildOperationExecutor$RunnableBuildOperationWorker.execute(DefaultBuildOperationExecutor.java:309)
at org.gradle.internal.operations.DefaultBuildOperationExecutor.execute(DefaultBuildOperationExecutor.java:185)
at org.gradle.internal.operations.DefaultBuildOperationExecutor.run(DefaultBuildOperationExecutor.java:97)
at org.gradle.internal.operations.DelegatingBuildOperationExecutor.run(DelegatingBuildOperationExecutor.java:31)
at org.gradle.api.internal.tasks.execution.ExecuteActionsTaskExecuter.executeAction(ExecuteActionsTaskExecuter.java:113)
at org.gradle.api.internal.tasks.execution.ExecuteActionsTaskExecuter.executeActions(ExecuteActionsTaskExecuter.java:95)
... 31 more
* Get more help at https://help.gradle.org
2018-06-03 00:13:45,977 a213785b MainThread beam_integration_benchmark(1/1) ERROR Error during benchmark beam_integration_benchmark
Traceback (most recent call last):
File "<https://builds.apache.org/job/beam_PerformanceTests_MongoDBIO_IT/ws/PerfKitBenchmarker/perfkitbenchmarker/pkb.py",> line 667, in RunBenchmark
DoRunPhase(spec, collector, detailed_timer)
File "<https://builds.apache.org/job/beam_PerformanceTests_MongoDBIO_IT/ws/PerfKitBenchmarker/perfkitbenchmarker/pkb.py",> line 547, in DoRunPhase
samples = spec.BenchmarkRun(spec)
File "<https://builds.apache.org/job/beam_PerformanceTests_MongoDBIO_IT/ws/PerfKitBenchmarker/perfkitbenchmarker/linux_benchmarks/beam_integration_benchmark.py",> line 159, in Run
job_type=job_type)
File "<https://builds.apache.org/job/beam_PerformanceTests_MongoDBIO_IT/ws/PerfKitBenchmarker/perfkitbenchmarker/providers/gcp/gcp_dpb_dataflow.py",> line 90, in SubmitJob
assert retcode == 0, "Integration Test Failed."
AssertionError: Integration Test Failed.
2018-06-03 00:13:45,978 a213785b MainThread beam_integration_benchmark(1/1) INFO Cleaning up benchmark beam_integration_benchmark
2018-06-03 00:13:45,979 a213785b MainThread beam_integration_benchmark(1/1) INFO Running: kubectl --kubeconfig=<https://builds.apache.org/job/beam_PerformanceTests_MongoDBIO_IT/ws/config-mongodbioit-252> delete -f <https://builds.apache.org/job/beam_PerformanceTests_MongoDBIO_IT/ws/src/.test-infra/kubernetes/mongodb/load-balancer/mongo.yml> --ignore-not-found
2018-06-03 00:13:46,808 a213785b MainThread beam_integration_benchmark(1/1) ERROR Exception running benchmark
Traceback (most recent call last):
File "<https://builds.apache.org/job/beam_PerformanceTests_MongoDBIO_IT/ws/PerfKitBenchmarker/perfkitbenchmarker/pkb.py",> line 801, in RunBenchmarkTask
RunBenchmark(spec, collector)
File "<https://builds.apache.org/job/beam_PerformanceTests_MongoDBIO_IT/ws/PerfKitBenchmarker/perfkitbenchmarker/pkb.py",> line 667, in RunBenchmark
DoRunPhase(spec, collector, detailed_timer)
File "<https://builds.apache.org/job/beam_PerformanceTests_MongoDBIO_IT/ws/PerfKitBenchmarker/perfkitbenchmarker/pkb.py",> line 547, in DoRunPhase
samples = spec.BenchmarkRun(spec)
File "<https://builds.apache.org/job/beam_PerformanceTests_MongoDBIO_IT/ws/PerfKitBenchmarker/perfkitbenchmarker/linux_benchmarks/beam_integration_benchmark.py",> line 159, in Run
job_type=job_type)
File "<https://builds.apache.org/job/beam_PerformanceTests_MongoDBIO_IT/ws/PerfKitBenchmarker/perfkitbenchmarker/providers/gcp/gcp_dpb_dataflow.py",> line 90, in SubmitJob
assert retcode == 0, "Integration Test Failed."
AssertionError: Integration Test Failed.
2018-06-03 00:13:46,809 a213785b MainThread beam_integration_benchmark(1/1) ERROR Benchmark 1/1 beam_integration_benchmark (UID: beam_integration_benchmark0) failed. Execution will continue.
2018-06-03 00:13:46,850 a213785b MainThread INFO Benchmark run statuses:
---------------------------------------------------------------------------------
Name UID Status Failed Substatus
---------------------------------------------------------------------------------
beam_integration_benchmark beam_integration_benchmark0 FAILED
---------------------------------------------------------------------------------
Success rate: 0.00% (0/1)
2018-06-03 00:13:46,850 a213785b MainThread INFO Complete logs can be found at: <https://builds.apache.org/job/beam_PerformanceTests_MongoDBIO_IT/ws/runs/a213785b/pkb.log>
2018-06-03 00:13:46,851 a213785b MainThread INFO Completion statuses can be found at: <https://builds.apache.org/job/beam_PerformanceTests_MongoDBIO_IT/ws/runs/a213785b/completion_statuses.json>
Build step 'Execute shell' marked build as failure
Jenkins build is back to normal :
beam_PerformanceTests_MongoDBIO_IT #261
Posted by Apache Jenkins Server <je...@builds.apache.org>.
See <https://builds.apache.org/job/beam_PerformanceTests_MongoDBIO_IT/261/display/redirect>
Build failed in Jenkins: beam_PerformanceTests_MongoDBIO_IT #260
Posted by Apache Jenkins Server <je...@builds.apache.org>.
See <https://builds.apache.org/job/beam_PerformanceTests_MongoDBIO_IT/260/display/redirect?page=changes>
Changes:
[jhsueh] [BEAM-4320] Enforce ErrorProne analysis in jackson extensions project
------------------------------------------
[...truncated 195.12 KB...]
at com.mongodb.connection.DefaultConnectionPool$PooledConnection.receiveMessage(DefaultConnectionPool.java:435)
at com.mongodb.connection.WriteCommandProtocol.receiveMessage(WriteCommandProtocol.java:234)
at com.mongodb.connection.WriteCommandProtocol.execute(WriteCommandProtocol.java:104)
at com.mongodb.connection.InsertCommandProtocol.execute(InsertCommandProtocol.java:67)
at com.mongodb.connection.InsertCommandProtocol.execute(InsertCommandProtocol.java:37)
at com.mongodb.connection.DefaultServer$DefaultServerProtocolExecutor.execute(DefaultServer.java:159)
at com.mongodb.connection.DefaultServerConnection.executeProtocol(DefaultServerConnection.java:286)
at com.mongodb.connection.DefaultServerConnection.insertCommand(DefaultServerConnection.java:115)
at com.mongodb.operation.MixedBulkWriteOperation$Run$2.executeWriteCommandProtocol(MixedBulkWriteOperation.java:455)
at com.mongodb.operation.MixedBulkWriteOperation$Run$RunExecutor.execute(MixedBulkWriteOperation.java:646)
at com.mongodb.operation.MixedBulkWriteOperation$Run.execute(MixedBulkWriteOperation.java:401)
at com.mongodb.operation.MixedBulkWriteOperation$1.call(MixedBulkWriteOperation.java:179)
at com.mongodb.operation.MixedBulkWriteOperation$1.call(MixedBulkWriteOperation.java:168)
at com.mongodb.operation.OperationHelper.withConnectionSource(OperationHelper.java:230)
at com.mongodb.operation.OperationHelper.withConnection(OperationHelper.java:221)
at com.mongodb.operation.MixedBulkWriteOperation.execute(MixedBulkWriteOperation.java:168)
at com.mongodb.operation.MixedBulkWriteOperation.execute(MixedBulkWriteOperation.java:74)
at com.mongodb.Mongo.execute(Mongo.java:781)
at com.mongodb.Mongo$2.execute(Mongo.java:764)
at com.mongodb.MongoCollectionImpl.insertMany(MongoCollectionImpl.java:323)
at com.mongodb.MongoCollectionImpl.insertMany(MongoCollectionImpl.java:311)
at org.apache.beam.sdk.io.mongodb.MongoDbIO$Write$WriteFn.flush(MongoDbIO.java:667)
at org.apache.beam.sdk.io.mongodb.MongoDbIO$Write$WriteFn.processElement(MongoDbIO.java:652)
com.mongodb.MongoTimeoutException: Timed out after 30000 ms while waiting for a server that matches WritableServerSelector. Client view of cluster state is {type=UNKNOWN, servers=[{address=35.232.0.200:27017, type=UNKNOWN, state=CONNECTING, exception={com.mongodb.MongoSocketOpenException: Exception opening socket}, caused by {java.net.SocketTimeoutException: connect timed out}}]
at com.mongodb.connection.BaseCluster.createTimeoutException(BaseCluster.java:369)
at com.mongodb.connection.BaseCluster.selectServer(BaseCluster.java:101)
at com.mongodb.binding.ClusterBinding$ClusterBindingConnectionSource.<init>(ClusterBinding.java:75)
at com.mongodb.binding.ClusterBinding$ClusterBindingConnectionSource.<init>(ClusterBinding.java:71)
at com.mongodb.binding.ClusterBinding.getWriteConnectionSource(ClusterBinding.java:68)
at com.mongodb.operation.OperationHelper.withConnection(OperationHelper.java:219)
at com.mongodb.operation.MixedBulkWriteOperation.execute(MixedBulkWriteOperation.java:168)
at com.mongodb.operation.MixedBulkWriteOperation.execute(MixedBulkWriteOperation.java:74)
at com.mongodb.Mongo.execute(Mongo.java:781)
at com.mongodb.Mongo$2.execute(Mongo.java:764)
at com.mongodb.MongoCollectionImpl.insertMany(MongoCollectionImpl.java:323)
at com.mongodb.MongoCollectionImpl.insertMany(MongoCollectionImpl.java:311)
at org.apache.beam.sdk.io.mongodb.MongoDbIO$Write$WriteFn.flush(MongoDbIO.java:667)
at org.apache.beam.sdk.io.mongodb.MongoDbIO$Write$WriteFn.processElement(MongoDbIO.java:652)
com.mongodb.MongoTimeoutException: Timed out after 30000 ms while waiting for a server that matches WritableServerSelector. Client view of cluster state is {type=UNKNOWN, servers=[{address=35.232.0.200:27017, type=UNKNOWN, state=CONNECTING, exception={com.mongodb.MongoSocketOpenException: Exception opening socket}, caused by {java.net.SocketTimeoutException: connect timed out}}]
at com.mongodb.connection.BaseCluster.createTimeoutException(BaseCluster.java:369)
at com.mongodb.connection.BaseCluster.selectServer(BaseCluster.java:101)
at com.mongodb.binding.ClusterBinding$ClusterBindingConnectionSource.<init>(ClusterBinding.java:75)
at com.mongodb.binding.ClusterBinding$ClusterBindingConnectionSource.<init>(ClusterBinding.java:71)
at com.mongodb.binding.ClusterBinding.getWriteConnectionSource(ClusterBinding.java:68)
at com.mongodb.operation.OperationHelper.withConnection(OperationHelper.java:219)
at com.mongodb.operation.MixedBulkWriteOperation.execute(MixedBulkWriteOperation.java:168)
at com.mongodb.operation.MixedBulkWriteOperation.execute(MixedBulkWriteOperation.java:74)
at com.mongodb.Mongo.execute(Mongo.java:781)
at com.mongodb.Mongo$2.execute(Mongo.java:764)
at com.mongodb.MongoCollectionImpl.insertMany(MongoCollectionImpl.java:323)
at com.mongodb.MongoCollectionImpl.insertMany(MongoCollectionImpl.java:311)
at org.apache.beam.sdk.io.mongodb.MongoDbIO$Write$WriteFn.flush(MongoDbIO.java:667)
at org.apache.beam.sdk.io.mongodb.MongoDbIO$Write$WriteFn.processElement(MongoDbIO.java:652)
com.mongodb.MongoTimeoutException: Timed out after 30000 ms while waiting for a server that matches WritableServerSelector. Client view of cluster state is {type=UNKNOWN, servers=[{address=35.232.0.200:27017, type=UNKNOWN, state=CONNECTING, exception={com.mongodb.MongoSocketOpenException: Exception opening socket}, caused by {java.net.SocketTimeoutException: connect timed out}}]
at com.mongodb.connection.BaseCluster.createTimeoutException(BaseCluster.java:369)
at com.mongodb.connection.BaseCluster.selectServer(BaseCluster.java:101)
at com.mongodb.binding.ClusterBinding$ClusterBindingConnectionSource.<init>(ClusterBinding.java:75)
at com.mongodb.binding.ClusterBinding$ClusterBindingConnectionSource.<init>(ClusterBinding.java:71)
at com.mongodb.binding.ClusterBinding.getWriteConnectionSource(ClusterBinding.java:68)
at com.mongodb.operation.OperationHelper.withConnection(OperationHelper.java:219)
at com.mongodb.operation.MixedBulkWriteOperation.execute(MixedBulkWriteOperation.java:168)
at com.mongodb.operation.MixedBulkWriteOperation.execute(MixedBulkWriteOperation.java:74)
at com.mongodb.Mongo.execute(Mongo.java:781)
at com.mongodb.Mongo$2.execute(Mongo.java:764)
at com.mongodb.MongoCollectionImpl.insertMany(MongoCollectionImpl.java:323)
at com.mongodb.MongoCollectionImpl.insertMany(MongoCollectionImpl.java:311)
at org.apache.beam.sdk.io.mongodb.MongoDbIO$Write$WriteFn.flush(MongoDbIO.java:667)
at org.apache.beam.sdk.io.mongodb.MongoDbIO$Write$WriteFn.processElement(MongoDbIO.java:652)
com.mongodb.MongoTimeoutException: Timed out after 30000 ms while waiting for a server that matches WritableServerSelector. Client view of cluster state is {type=UNKNOWN, servers=[{address=35.232.0.200:27017, type=UNKNOWN, state=CONNECTING, exception={com.mongodb.MongoSocketOpenException: Exception opening socket}, caused by {java.net.SocketTimeoutException: connect timed out}}]
at com.mongodb.connection.BaseCluster.createTimeoutException(BaseCluster.java:369)
at com.mongodb.connection.BaseCluster.selectServer(BaseCluster.java:101)
at com.mongodb.binding.ClusterBinding$ClusterBindingConnectionSource.<init>(ClusterBinding.java:75)
at com.mongodb.binding.ClusterBinding$ClusterBindingConnectionSource.<init>(ClusterBinding.java:71)
at com.mongodb.binding.ClusterBinding.getWriteConnectionSource(ClusterBinding.java:68)
at com.mongodb.operation.OperationHelper.withConnection(OperationHelper.java:219)
at com.mongodb.operation.MixedBulkWriteOperation.execute(MixedBulkWriteOperation.java:168)
at com.mongodb.operation.MixedBulkWriteOperation.execute(MixedBulkWriteOperation.java:74)
at com.mongodb.Mongo.execute(Mongo.java:781)
at com.mongodb.Mongo$2.execute(Mongo.java:764)
at com.mongodb.MongoCollectionImpl.insertMany(MongoCollectionImpl.java:323)
at com.mongodb.MongoCollectionImpl.insertMany(MongoCollectionImpl.java:311)
at org.apache.beam.sdk.io.mongodb.MongoDbIO$Write$WriteFn.flush(MongoDbIO.java:667)
at org.apache.beam.sdk.io.mongodb.MongoDbIO$Write$WriteFn.processElement(MongoDbIO.java:652)
com.mongodb.MongoTimeoutException: Timed out after 30000 ms while waiting for a server that matches WritableServerSelector. Client view of cluster state is {type=UNKNOWN, servers=[{address=35.232.0.200:27017, type=UNKNOWN, state=CONNECTING, exception={com.mongodb.MongoSocketOpenException: Exception opening socket}, caused by {java.net.SocketTimeoutException: connect timed out}}]
at com.mongodb.connection.BaseCluster.createTimeoutException(BaseCluster.java:369)
at com.mongodb.connection.BaseCluster.selectServer(BaseCluster.java:101)
at com.mongodb.binding.ClusterBinding$ClusterBindingConnectionSource.<init>(ClusterBinding.java:75)
at com.mongodb.binding.ClusterBinding$ClusterBindingConnectionSource.<init>(ClusterBinding.java:71)
at com.mongodb.binding.ClusterBinding.getWriteConnectionSource(ClusterBinding.java:68)
at com.mongodb.operation.OperationHelper.withConnection(OperationHelper.java:219)
at com.mongodb.operation.MixedBulkWriteOperation.execute(MixedBulkWriteOperation.java:168)
at com.mongodb.operation.MixedBulkWriteOperation.execute(MixedBulkWriteOperation.java:74)
at com.mongodb.Mongo.execute(Mongo.java:781)
at com.mongodb.Mongo$2.execute(Mongo.java:764)
at com.mongodb.MongoCollectionImpl.insertMany(MongoCollectionImpl.java:323)
at com.mongodb.MongoCollectionImpl.insertMany(MongoCollectionImpl.java:311)
at org.apache.beam.sdk.io.mongodb.MongoDbIO$Write$WriteFn.flush(MongoDbIO.java:667)
at org.apache.beam.sdk.io.mongodb.MongoDbIO$Write$WriteFn.processElement(MongoDbIO.java:652)
Workflow failed. Causes: S01:Generate sequence/Read(BoundedCountingSource)+Produce documents/Map+Write documents to MongoDB/ParDo(Write) failed., A work item was attempted 4 times without success. Each time the worker eventually lost contact with the service. The work item was attempted on:
mongodbioit0testwriteandr-06040504-ejyg-harness-1ttk,
mongodbioit0testwriteandr-06040504-ejyg-harness-1ttk,
mongodbioit0testwriteandr-06040504-ejyg-harness-1ttk,
mongodbioit0testwriteandr-06040504-ejyg-harness-1ttk
at org.apache.beam.runners.dataflow.TestDataflowRunner.run(TestDataflowRunner.java:134)
at org.apache.beam.runners.dataflow.TestDataflowRunner.run(TestDataflowRunner.java:90)
at org.apache.beam.runners.dataflow.TestDataflowRunner.run(TestDataflowRunner.java:55)
at org.apache.beam.sdk.Pipeline.run(Pipeline.java:311)
at org.apache.beam.sdk.testing.TestPipeline.run(TestPipeline.java:348)
at org.apache.beam.sdk.testing.TestPipeline.run(TestPipeline.java:329)
at org.apache.beam.sdk.io.mongodb.MongoDBIOIT.testWriteAndRead(MongoDBIOIT.java:118)
com.mongodb.MongoTimeoutException: Timed out after 30000 ms while waiting for a server that matches WritableServerSelector. Client view of cluster state is {type=UNKNOWN, servers=[{address=35.232.0.200:27017, type=UNKNOWN, state=CONNECTING, exception={com.mongodb.MongoSocketOpenException: Exception opening socket}, caused by {java.net.SocketTimeoutException: connect timed out}}]
at com.mongodb.connection.BaseCluster.createTimeoutException(BaseCluster.java:369)
at com.mongodb.connection.BaseCluster.selectServer(BaseCluster.java:101)
at com.mongodb.binding.ClusterBinding$ClusterBindingConnectionSource.<init>(ClusterBinding.java:75)
at com.mongodb.binding.ClusterBinding$ClusterBindingConnectionSource.<init>(ClusterBinding.java:71)
at com.mongodb.binding.ClusterBinding.getWriteConnectionSource(ClusterBinding.java:68)
at com.mongodb.operation.CommandOperationHelper.executeWrappedCommandProtocol(CommandOperationHelper.java:158)
at com.mongodb.operation.CommandOperationHelper.executeWrappedCommandProtocol(CommandOperationHelper.java:133)
at com.mongodb.operation.CommandOperationHelper.executeWrappedCommandProtocol(CommandOperationHelper.java:128)
at com.mongodb.operation.DropDatabaseOperation.execute(DropDatabaseOperation.java:51)
at com.mongodb.operation.DropDatabaseOperation.execute(DropDatabaseOperation.java:36)
at com.mongodb.Mongo.execute(Mongo.java:781)
at com.mongodb.Mongo$2.execute(Mongo.java:764)
at com.mongodb.MongoDatabaseImpl.drop(MongoDatabaseImpl.java:136)
at org.apache.beam.sdk.io.mongodb.MongoDBIOIT.tearDown(MongoDBIOIT.java:103)
1 test completed, 1 failed
Finished generating test XML results (0.024 secs) into: <https://builds.apache.org/job/beam_PerformanceTests_MongoDBIO_IT/ws/src/sdks/java/io/mongodb/build/test-results/integrationTest>
Generating HTML test report...
Finished generating test html results (0.033 secs) into: <https://builds.apache.org/job/beam_PerformanceTests_MongoDBIO_IT/ws/src/sdks/java/io/mongodb/build/reports/tests/integrationTest>
> Task :beam-sdks-java-io-mongodb:integrationTest FAILED
:beam-sdks-java-io-mongodb:integrationTest (Thread[Task worker for ':' Thread 10,5,main]) completed. Took 10 mins 4.408 secs.
Deprecated Gradle features were used in this build, making it incompatible with Gradle 5.0.
See https://docs.gradle.org/4.7/userguide/command_line_interface.html#sec:command_line_warnings
BUILD FAILED in 10m 15s
62 actionable tasks: 1 executed, 61 up-to-date
Publishing build scan...
https://gradle.com/s/kf636v6cbiwk6
STDERR:
FAILURE: Build failed with an exception.
* What went wrong:
Execution failed for task ':beam-sdks-java-io-mongodb:integrationTest'.
> There were failing tests. See the report at: file://<https://builds.apache.org/job/beam_PerformanceTests_MongoDBIO_IT/ws/src/sdks/java/io/mongodb/build/reports/tests/integrationTest/index.html>
* Try:
Run with --debug option to get more log output. Run with --scan to get full insights.
* Exception is:
org.gradle.api.tasks.TaskExecutionException: Execution failed for task ':beam-sdks-java-io-mongodb:integrationTest'.
at org.gradle.api.internal.tasks.execution.ExecuteActionsTaskExecuter.executeActions(ExecuteActionsTaskExecuter.java:103)
at org.gradle.api.internal.tasks.execution.ExecuteActionsTaskExecuter.execute(ExecuteActionsTaskExecuter.java:73)
at org.gradle.api.internal.tasks.execution.OutputDirectoryCreatingTaskExecuter.execute(OutputDirectoryCreatingTaskExecuter.java:51)
at org.gradle.api.internal.tasks.execution.SkipCachedTaskExecuter.execute(SkipCachedTaskExecuter.java:105)
at org.gradle.api.internal.tasks.execution.SkipUpToDateTaskExecuter.execute(SkipUpToDateTaskExecuter.java:59)
at org.gradle.api.internal.tasks.execution.ResolveTaskOutputCachingStateExecuter.execute(ResolveTaskOutputCachingStateExecuter.java:54)
at org.gradle.api.internal.tasks.execution.ResolveBuildCacheKeyExecuter.execute(ResolveBuildCacheKeyExecuter.java:66)
at org.gradle.api.internal.tasks.execution.ValidatingTaskExecuter.execute(ValidatingTaskExecuter.java:59)
at org.gradle.api.internal.tasks.execution.SkipEmptySourceFilesTaskExecuter.execute(SkipEmptySourceFilesTaskExecuter.java:101)
at org.gradle.api.internal.tasks.execution.FinalizeInputFilePropertiesTaskExecuter.execute(FinalizeInputFilePropertiesTaskExecuter.java:44)
at org.gradle.api.internal.tasks.execution.CleanupStaleOutputsExecuter.execute(CleanupStaleOutputsExecuter.java:91)
at org.gradle.api.internal.tasks.execution.ResolveTaskArtifactStateTaskExecuter.execute(ResolveTaskArtifactStateTaskExecuter.java:62)
at org.gradle.api.internal.tasks.execution.SkipTaskWithNoActionsExecuter.execute(SkipTaskWithNoActionsExecuter.java:59)
at org.gradle.api.internal.tasks.execution.SkipOnlyIfTaskExecuter.execute(SkipOnlyIfTaskExecuter.java:54)
at org.gradle.api.internal.tasks.execution.ExecuteAtMostOnceTaskExecuter.execute(ExecuteAtMostOnceTaskExecuter.java:43)
at org.gradle.api.internal.tasks.execution.CatchExceptionTaskExecuter.execute(CatchExceptionTaskExecuter.java:34)
at org.gradle.execution.taskgraph.DefaultTaskGraphExecuter$EventFiringTaskWorker$1.run(DefaultTaskGraphExecuter.java:256)
at org.gradle.internal.operations.DefaultBuildOperationExecutor$RunnableBuildOperationWorker.execute(DefaultBuildOperationExecutor.java:317)
at org.gradle.internal.operations.DefaultBuildOperationExecutor$RunnableBuildOperationWorker.execute(DefaultBuildOperationExecutor.java:309)
at org.gradle.internal.operations.DefaultBuildOperationExecutor.execute(DefaultBuildOperationExecutor.java:185)
at org.gradle.internal.operations.DefaultBuildOperationExecutor.run(DefaultBuildOperationExecutor.java:97)
at org.gradle.internal.operations.DelegatingBuildOperationExecutor.run(DelegatingBuildOperationExecutor.java:31)
at org.gradle.execution.taskgraph.DefaultTaskGraphExecuter$EventFiringTaskWorker.execute(DefaultTaskGraphExecuter.java:249)
at org.gradle.execution.taskgraph.DefaultTaskGraphExecuter$EventFiringTaskWorker.execute(DefaultTaskGraphExecuter.java:238)
at org.gradle.execution.taskgraph.DefaultTaskPlanExecutor$TaskExecutorWorker$1.execute(DefaultTaskPlanExecutor.java:104)
at org.gradle.execution.taskgraph.DefaultTaskPlanExecutor$TaskExecutorWorker$1.execute(DefaultTaskPlanExecutor.java:98)
at org.gradle.execution.taskgraph.DefaultTaskExecutionPlan.execute(DefaultTaskExecutionPlan.java:663)
at org.gradle.execution.taskgraph.DefaultTaskExecutionPlan.executeWithTask(DefaultTaskExecutionPlan.java:596)
at org.gradle.execution.taskgraph.DefaultTaskPlanExecutor$TaskExecutorWorker.run(DefaultTaskPlanExecutor.java:98)
at org.gradle.internal.concurrent.ExecutorPolicy$CatchAndRecordFailures.onExecute(ExecutorPolicy.java:63)
at org.gradle.internal.concurrent.ManagedExecutorImpl$1.run(ManagedExecutorImpl.java:46)
at org.gradle.internal.concurrent.ThreadFactoryImpl$ManagedThreadRunnable.run(ThreadFactoryImpl.java:55)
Caused by: org.gradle.api.GradleException: There were failing tests. See the report at: file://<https://builds.apache.org/job/beam_PerformanceTests_MongoDBIO_IT/ws/src/sdks/java/io/mongodb/build/reports/tests/integrationTest/index.html>
at org.gradle.api.tasks.testing.AbstractTestTask.handleTestFailures(AbstractTestTask.java:612)
at org.gradle.api.tasks.testing.AbstractTestTask.executeTests(AbstractTestTask.java:484)
at org.gradle.api.tasks.testing.Test.executeTests(Test.java:583)
at org.gradle.internal.reflect.JavaMethod.invoke(JavaMethod.java:73)
at org.gradle.api.internal.project.taskfactory.StandardTaskAction.doExecute(StandardTaskAction.java:46)
at org.gradle.api.internal.project.taskfactory.StandardTaskAction.execute(StandardTaskAction.java:39)
at org.gradle.api.internal.project.taskfactory.StandardTaskAction.execute(StandardTaskAction.java:26)
at org.gradle.api.internal.AbstractTask$TaskActionWrapper.execute(AbstractTask.java:794)
at org.gradle.api.internal.AbstractTask$TaskActionWrapper.execute(AbstractTask.java:761)
at org.gradle.api.internal.tasks.execution.ExecuteActionsTaskExecuter$1.run(ExecuteActionsTaskExecuter.java:124)
at org.gradle.internal.operations.DefaultBuildOperationExecutor$RunnableBuildOperationWorker.execute(DefaultBuildOperationExecutor.java:317)
at org.gradle.internal.operations.DefaultBuildOperationExecutor$RunnableBuildOperationWorker.execute(DefaultBuildOperationExecutor.java:309)
at org.gradle.internal.operations.DefaultBuildOperationExecutor.execute(DefaultBuildOperationExecutor.java:185)
at org.gradle.internal.operations.DefaultBuildOperationExecutor.run(DefaultBuildOperationExecutor.java:97)
at org.gradle.internal.operations.DelegatingBuildOperationExecutor.run(DelegatingBuildOperationExecutor.java:31)
at org.gradle.api.internal.tasks.execution.ExecuteActionsTaskExecuter.executeAction(ExecuteActionsTaskExecuter.java:113)
at org.gradle.api.internal.tasks.execution.ExecuteActionsTaskExecuter.executeActions(ExecuteActionsTaskExecuter.java:95)
... 31 more
* Get more help at https://help.gradle.org
2018-06-04 12:14:50,570 6d4341bd MainThread beam_integration_benchmark(1/1) ERROR Error during benchmark beam_integration_benchmark
Traceback (most recent call last):
File "<https://builds.apache.org/job/beam_PerformanceTests_MongoDBIO_IT/ws/PerfKitBenchmarker/perfkitbenchmarker/pkb.py",> line 667, in RunBenchmark
DoRunPhase(spec, collector, detailed_timer)
File "<https://builds.apache.org/job/beam_PerformanceTests_MongoDBIO_IT/ws/PerfKitBenchmarker/perfkitbenchmarker/pkb.py",> line 547, in DoRunPhase
samples = spec.BenchmarkRun(spec)
File "<https://builds.apache.org/job/beam_PerformanceTests_MongoDBIO_IT/ws/PerfKitBenchmarker/perfkitbenchmarker/linux_benchmarks/beam_integration_benchmark.py",> line 159, in Run
job_type=job_type)
File "<https://builds.apache.org/job/beam_PerformanceTests_MongoDBIO_IT/ws/PerfKitBenchmarker/perfkitbenchmarker/providers/gcp/gcp_dpb_dataflow.py",> line 90, in SubmitJob
assert retcode == 0, "Integration Test Failed."
AssertionError: Integration Test Failed.
2018-06-04 12:14:50,571 6d4341bd MainThread beam_integration_benchmark(1/1) INFO Cleaning up benchmark beam_integration_benchmark
2018-06-04 12:14:50,572 6d4341bd MainThread beam_integration_benchmark(1/1) INFO Running: kubectl --kubeconfig=<https://builds.apache.org/job/beam_PerformanceTests_MongoDBIO_IT/ws/config-mongodbioit-260> delete -f <https://builds.apache.org/job/beam_PerformanceTests_MongoDBIO_IT/ws/src/.test-infra/kubernetes/mongodb/load-balancer/mongo.yml> --ignore-not-found
2018-06-04 12:14:51,621 6d4341bd MainThread beam_integration_benchmark(1/1) ERROR Exception running benchmark
Traceback (most recent call last):
File "<https://builds.apache.org/job/beam_PerformanceTests_MongoDBIO_IT/ws/PerfKitBenchmarker/perfkitbenchmarker/pkb.py",> line 801, in RunBenchmarkTask
RunBenchmark(spec, collector)
File "<https://builds.apache.org/job/beam_PerformanceTests_MongoDBIO_IT/ws/PerfKitBenchmarker/perfkitbenchmarker/pkb.py",> line 667, in RunBenchmark
DoRunPhase(spec, collector, detailed_timer)
File "<https://builds.apache.org/job/beam_PerformanceTests_MongoDBIO_IT/ws/PerfKitBenchmarker/perfkitbenchmarker/pkb.py",> line 547, in DoRunPhase
samples = spec.BenchmarkRun(spec)
File "<https://builds.apache.org/job/beam_PerformanceTests_MongoDBIO_IT/ws/PerfKitBenchmarker/perfkitbenchmarker/linux_benchmarks/beam_integration_benchmark.py",> line 159, in Run
job_type=job_type)
File "<https://builds.apache.org/job/beam_PerformanceTests_MongoDBIO_IT/ws/PerfKitBenchmarker/perfkitbenchmarker/providers/gcp/gcp_dpb_dataflow.py",> line 90, in SubmitJob
assert retcode == 0, "Integration Test Failed."
AssertionError: Integration Test Failed.
2018-06-04 12:14:51,622 6d4341bd MainThread beam_integration_benchmark(1/1) ERROR Benchmark 1/1 beam_integration_benchmark (UID: beam_integration_benchmark0) failed. Execution will continue.
2018-06-04 12:14:51,658 6d4341bd MainThread INFO Benchmark run statuses:
---------------------------------------------------------------------------------
Name UID Status Failed Substatus
---------------------------------------------------------------------------------
beam_integration_benchmark beam_integration_benchmark0 FAILED
---------------------------------------------------------------------------------
Success rate: 0.00% (0/1)
2018-06-04 12:14:51,659 6d4341bd MainThread INFO Complete logs can be found at: <https://builds.apache.org/job/beam_PerformanceTests_MongoDBIO_IT/ws/runs/6d4341bd/pkb.log>
2018-06-04 12:14:51,659 6d4341bd MainThread INFO Completion statuses can be found at: <https://builds.apache.org/job/beam_PerformanceTests_MongoDBIO_IT/ws/runs/6d4341bd/completion_statuses.json>
Build step 'Execute shell' marked build as failure
Build failed in Jenkins: beam_PerformanceTests_MongoDBIO_IT #259
Posted by Apache Jenkins Server <je...@builds.apache.org>.
See <https://builds.apache.org/job/beam_PerformanceTests_MongoDBIO_IT/259/display/redirect>
------------------------------------------
[...truncated 96.69 KB...]
:beam-runners-direct-java:shadowJar (Thread[Task worker for ':' Thread 13,5,main]) started.
> Task :beam-sdks-java-core:compileTestJava UP-TO-DATE
Build cache key for task ':beam-sdks-java-core:compileTestJava' is df359061e09f2f4c6c11577c8ad07b75
Skipping task ':beam-sdks-java-core:compileTestJava' as it is up-to-date.
:beam-sdks-java-core:compileTestJava (Thread[Task worker for ':' Thread 6,5,main]) completed. Took 0.342 secs.
:beam-sdks-java-core:processTestResources (Thread[Task worker for ':' Thread 6,5,main]) started.
> Task :beam-sdks-java-core:processTestResources NO-SOURCE
file or directory '<https://builds.apache.org/job/beam_PerformanceTests_MongoDBIO_IT/ws/src/sdks/java/core/src/test/resources',> not found
Skipping task ':beam-sdks-java-core:processTestResources' as it has no source files and no previous output files.
:beam-sdks-java-core:processTestResources (Thread[Task worker for ':' Thread 6,5,main]) completed. Took 0.001 secs.
:beam-sdks-java-core:testClasses (Thread[Task worker for ':' Thread 6,5,main]) started.
> Task :beam-sdks-java-core:testClasses UP-TO-DATE
Skipping task ':beam-sdks-java-core:testClasses' as it has no actions.
:beam-sdks-java-core:testClasses (Thread[Task worker for ':' Thread 6,5,main]) completed. Took 0.0 secs.
:beam-sdks-java-core:shadowTestJar (Thread[Task worker for ':' Thread 6,5,main]) started.
> Task :beam-runners-direct-java:shadowJar UP-TO-DATE
Build cache key for task ':beam-runners-direct-java:shadowJar' is 9097f6baab82b162ea2bf539874a2192
Caching disabled for task ':beam-runners-direct-java:shadowJar': Caching has not been enabled for the task
Skipping task ':beam-runners-direct-java:shadowJar' as it is up-to-date.
:beam-runners-direct-java:shadowJar (Thread[Task worker for ':' Thread 13,5,main]) completed. Took 0.017 secs.
> Task :beam-sdks-java-core:shadowTestJar UP-TO-DATE
Build cache key for task ':beam-sdks-java-core:shadowTestJar' is 1250a228dbe5059d25a4d042e3c675e5
Caching disabled for task ':beam-sdks-java-core:shadowTestJar': Caching has not been enabled for the task
Skipping task ':beam-sdks-java-core:shadowTestJar' as it is up-to-date.
:beam-sdks-java-core:shadowTestJar (Thread[Task worker for ':' Thread 6,5,main]) completed. Took 0.033 secs.
:beam-sdks-java-extensions-google-cloud-platform-core:compileTestJava (Thread[Task worker for ':' Thread 6,5,main]) started.
> Task :beam-sdks-java-extensions-google-cloud-platform-core:compileTestJava UP-TO-DATE
Build cache key for task ':beam-sdks-java-extensions-google-cloud-platform-core:compileTestJava' is 9252f2e64549da0dfce1c2331f6d620c
Skipping task ':beam-sdks-java-extensions-google-cloud-platform-core:compileTestJava' as it is up-to-date.
:beam-sdks-java-extensions-google-cloud-platform-core:compileTestJava (Thread[Task worker for ':' Thread 6,5,main]) completed. Took 0.043 secs.
:beam-sdks-java-extensions-google-cloud-platform-core:testClasses (Thread[Task worker for ':' Thread 6,5,main]) started.
> Task :beam-sdks-java-extensions-google-cloud-platform-core:testClasses UP-TO-DATE
Skipping task ':beam-sdks-java-extensions-google-cloud-platform-core:testClasses' as it has no actions.
:beam-sdks-java-extensions-google-cloud-platform-core:testClasses (Thread[Task worker for ':' Thread 6,5,main]) completed. Took 0.0 secs.
:beam-sdks-java-extensions-google-cloud-platform-core:shadowTestJar (Thread[Task worker for ':' Thread 6,5,main]) started.
> Task :beam-sdks-java-extensions-google-cloud-platform-core:shadowTestJar UP-TO-DATE
Build cache key for task ':beam-sdks-java-extensions-google-cloud-platform-core:shadowTestJar' is b5e738c8df5159e1020ceda606ace7dc
Caching disabled for task ':beam-sdks-java-extensions-google-cloud-platform-core:shadowTestJar': Caching has not been enabled for the task
Skipping task ':beam-sdks-java-extensions-google-cloud-platform-core:shadowTestJar' as it is up-to-date.
:beam-sdks-java-extensions-google-cloud-platform-core:shadowTestJar (Thread[Task worker for ':' Thread 6,5,main]) completed. Took 0.023 secs.
:beam-sdks-java-io-google-cloud-platform:compileTestJava (Thread[Task worker for ':' Thread 6,5,main]) started.
> Task :beam-sdks-java-io-google-cloud-platform:compileTestJava UP-TO-DATE
Build cache key for task ':beam-sdks-java-io-google-cloud-platform:compileTestJava' is 4e514787fbbf7dc49ce0542daddce520
Skipping task ':beam-sdks-java-io-google-cloud-platform:compileTestJava' as it is up-to-date.
:beam-sdks-java-io-google-cloud-platform:compileTestJava (Thread[Task worker for ':' Thread 6,5,main]) completed. Took 0.065 secs.
:beam-sdks-java-io-google-cloud-platform:testClasses (Thread[Task worker for ':' Thread 6,5,main]) started.
> Task :beam-sdks-java-io-google-cloud-platform:testClasses UP-TO-DATE
Skipping task ':beam-sdks-java-io-google-cloud-platform:testClasses' as it has no actions.
:beam-sdks-java-io-google-cloud-platform:testClasses (Thread[Task worker for ':' Thread 6,5,main]) completed. Took 0.0 secs.
:beam-sdks-java-io-google-cloud-platform:shadowTestJar (Thread[Task worker for ':' Thread 8,5,main]) started.
> Task :beam-sdks-java-io-google-cloud-platform:shadowTestJar UP-TO-DATE
Build cache key for task ':beam-sdks-java-io-google-cloud-platform:shadowTestJar' is fa2c482c7989eb3089cb0a20614f1f60
Caching disabled for task ':beam-sdks-java-io-google-cloud-platform:shadowTestJar': Caching has not been enabled for the task
Skipping task ':beam-sdks-java-io-google-cloud-platform:shadowTestJar' as it is up-to-date.
:beam-sdks-java-io-google-cloud-platform:shadowTestJar (Thread[Task worker for ':' Thread 8,5,main]) completed. Took 0.037 secs.
:beam-runners-google-cloud-dataflow-java:compileTestJava (Thread[Task worker for ':' Thread 8,5,main]) started.
> Task :beam-runners-google-cloud-dataflow-java:compileTestJava UP-TO-DATE
Build cache key for task ':beam-runners-google-cloud-dataflow-java:compileTestJava' is 0b57784fb594309176463ccdafa1a6a4
Skipping task ':beam-runners-google-cloud-dataflow-java:compileTestJava' as it is up-to-date.
:beam-runners-google-cloud-dataflow-java:compileTestJava (Thread[Task worker for ':' Thread 8,5,main]) completed. Took 0.049 secs.
:beam-runners-google-cloud-dataflow-java:testClasses (Thread[Task worker for ':' Thread 8,5,main]) started.
> Task :beam-runners-google-cloud-dataflow-java:testClasses UP-TO-DATE
Skipping task ':beam-runners-google-cloud-dataflow-java:testClasses' as it has no actions.
:beam-runners-google-cloud-dataflow-java:testClasses (Thread[Task worker for ':' Thread 8,5,main]) completed. Took 0.0 secs.
:beam-runners-google-cloud-dataflow-java:shadowTestJar (Thread[Task worker for ':' Thread 8,5,main]) started.
> Task :beam-runners-google-cloud-dataflow-java:shadowTestJar UP-TO-DATE
Build cache key for task ':beam-runners-google-cloud-dataflow-java:shadowTestJar' is 1d841a4c86440483f8e4406b1abfe913
Caching disabled for task ':beam-runners-google-cloud-dataflow-java:shadowTestJar': Caching has not been enabled for the task
Skipping task ':beam-runners-google-cloud-dataflow-java:shadowTestJar' as it is up-to-date.
:beam-runners-google-cloud-dataflow-java:shadowTestJar (Thread[Task worker for ':' Thread 8,5,main]) completed. Took 0.034 secs.
:beam-sdks-java-io-mongodb:compileTestJava (Thread[Task worker for ':' Thread 8,5,main]) started.
> Task :beam-sdks-java-io-mongodb:compileTestJava UP-TO-DATE
Build cache key for task ':beam-sdks-java-io-mongodb:compileTestJava' is 4149237b59481fb7f2978af412252ed3
Skipping task ':beam-sdks-java-io-mongodb:compileTestJava' as it is up-to-date.
:beam-sdks-java-io-mongodb:compileTestJava (Thread[Task worker for ':' Thread 8,5,main]) completed. Took 0.053 secs.
:beam-sdks-java-io-mongodb:testClasses (Thread[Task worker for ':' Thread 8,5,main]) started.
> Task :beam-sdks-java-io-mongodb:testClasses UP-TO-DATE
Skipping task ':beam-sdks-java-io-mongodb:testClasses' as it has no actions.
:beam-sdks-java-io-mongodb:testClasses (Thread[Task worker for ':' Thread 8,5,main]) completed. Took 0.0 secs.
:beam-sdks-java-io-mongodb:integrationTest (Thread[Task worker for ':' Thread 8,5,main]) started.
Gradle Test Executor 1 started executing tests.
> Task :beam-sdks-java-io-mongodb:integrationTest
Build cache key for task ':beam-sdks-java-io-mongodb:integrationTest' is 41c26aaea773215021530877d14c439e
Task ':beam-sdks-java-io-mongodb:integrationTest' is not up-to-date because:
Task.upToDateWhen is false.
Not loading task ':beam-sdks-java-io-mongodb:integrationTest' from cache because pulling from cache is disabled for this task
Starting process 'Gradle Test Executor 1'. Working directory: <https://builds.apache.org/job/beam_PerformanceTests_MongoDBIO_IT/ws/src/sdks/java/io/mongodb> Command: /usr/local/asfpackages/java/jdk1.8.0_152/bin/java -DbeamTestPipelineOptions=["--tempRoot=gs://temp-storage-for-perf-tests","--project=apache-beam-testing","--numberOfRecords=10000000","--mongoDBHostName=35.202.20.216","--mongoDBDatabaseName=beam","--mongoDBPort=27017","--runner=TestDataflowRunner"] -Djava.security.manager=worker.org.gradle.process.internal.worker.child.BootstrapSecurityManager -Dorg.gradle.native=false -Dfile.encoding=UTF-8 -Duser.country=US -Duser.language=en -Duser.variant -ea -cp /home/jenkins/.gradle/caches/4.7/workerMain/gradle-worker.jar worker.org.gradle.process.internal.worker.GradleWorkerMain 'Gradle Test Executor 1'
Successfully started process 'Gradle Test Executor 1'
Gradle Test Executor 1 finished executing tests.
> Task :beam-sdks-java-io-mongodb:integrationTest FAILED
org.apache.beam.sdk.io.mongodb.MongoDBIOIT > classMethod FAILED
java.lang.IllegalArgumentException: non-public interfaces from different packages
at java.lang.reflect.Proxy$ProxyClassFactory.apply(Proxy.java:619)
at java.lang.reflect.Proxy$ProxyClassFactory.apply(Proxy.java:557)
at java.lang.reflect.WeakCache$Factory.get(WeakCache.java:230)
at java.lang.reflect.WeakCache.get(WeakCache.java:127)
at java.lang.reflect.Proxy.getProxyClass0(Proxy.java:419)
at java.lang.reflect.Proxy.getProxyClass(Proxy.java:371)
at org.apache.beam.sdk.options.PipelineOptionsFactory$Cache.validateWellFormed(PipelineOptionsFactory.java:1764)
at org.apache.beam.sdk.options.PipelineOptionsFactory$Cache.validateWellFormed(PipelineOptionsFactory.java:1709)
at org.apache.beam.sdk.options.PipelineOptionsFactory$Cache.register(PipelineOptionsFactory.java:1704)
at org.apache.beam.sdk.options.PipelineOptionsFactory$Cache.access$500(PipelineOptionsFactory.java:1643)
at org.apache.beam.sdk.options.PipelineOptionsFactory.register(PipelineOptionsFactory.java:523)
at org.apache.beam.sdk.io.mongodb.MongoDBIOIT.setUp(MongoDBIOIT.java:103)
org.apache.beam.sdk.io.mongodb.MongoDBIOIT > classMethod FAILED
java.lang.NullPointerException
at org.apache.beam.sdk.io.mongodb.MongoDBIOIT.tearDown(MongoDBIOIT.java:110)
2 tests completed, 2 failed
Finished generating test XML results (0.014 secs) into: <https://builds.apache.org/job/beam_PerformanceTests_MongoDBIO_IT/ws/src/sdks/java/io/mongodb/build/test-results/integrationTest>
Generating HTML test report...
Finished generating test html results (0.023 secs) into: <https://builds.apache.org/job/beam_PerformanceTests_MongoDBIO_IT/ws/src/sdks/java/io/mongodb/build/reports/tests/integrationTest>
:beam-sdks-java-io-mongodb:integrationTest (Thread[Task worker for ':' Thread 8,5,main]) completed. Took 2.156 secs.
Deprecated Gradle features were used in this build, making it incompatible with Gradle 5.0.
See https://docs.gradle.org/4.7/userguide/command_line_interface.html#sec:command_line_warnings
BUILD FAILED in 12s
62 actionable tasks: 1 executed, 61 up-to-date
Publishing build scan...
https://gradle.com/s/4v44b5sutc44i
STDERR:
FAILURE: Build failed with an exception.
* What went wrong:
Execution failed for task ':beam-sdks-java-io-mongodb:integrationTest'.
> There were failing tests. See the report at: file://<https://builds.apache.org/job/beam_PerformanceTests_MongoDBIO_IT/ws/src/sdks/java/io/mongodb/build/reports/tests/integrationTest/index.html>
* Try:
Run with --debug option to get more log output. Run with --scan to get full insights.
* Exception is:
org.gradle.api.tasks.TaskExecutionException: Execution failed for task ':beam-sdks-java-io-mongodb:integrationTest'.
at org.gradle.api.internal.tasks.execution.ExecuteActionsTaskExecuter.executeActions(ExecuteActionsTaskExecuter.java:103)
at org.gradle.api.internal.tasks.execution.ExecuteActionsTaskExecuter.execute(ExecuteActionsTaskExecuter.java:73)
at org.gradle.api.internal.tasks.execution.OutputDirectoryCreatingTaskExecuter.execute(OutputDirectoryCreatingTaskExecuter.java:51)
at org.gradle.api.internal.tasks.execution.SkipCachedTaskExecuter.execute(SkipCachedTaskExecuter.java:105)
at org.gradle.api.internal.tasks.execution.SkipUpToDateTaskExecuter.execute(SkipUpToDateTaskExecuter.java:59)
at org.gradle.api.internal.tasks.execution.ResolveTaskOutputCachingStateExecuter.execute(ResolveTaskOutputCachingStateExecuter.java:54)
at org.gradle.api.internal.tasks.execution.ResolveBuildCacheKeyExecuter.execute(ResolveBuildCacheKeyExecuter.java:66)
at org.gradle.api.internal.tasks.execution.ValidatingTaskExecuter.execute(ValidatingTaskExecuter.java:59)
at org.gradle.api.internal.tasks.execution.SkipEmptySourceFilesTaskExecuter.execute(SkipEmptySourceFilesTaskExecuter.java:101)
at org.gradle.api.internal.tasks.execution.FinalizeInputFilePropertiesTaskExecuter.execute(FinalizeInputFilePropertiesTaskExecuter.java:44)
at org.gradle.api.internal.tasks.execution.CleanupStaleOutputsExecuter.execute(CleanupStaleOutputsExecuter.java:91)
at org.gradle.api.internal.tasks.execution.ResolveTaskArtifactStateTaskExecuter.execute(ResolveTaskArtifactStateTaskExecuter.java:62)
at org.gradle.api.internal.tasks.execution.SkipTaskWithNoActionsExecuter.execute(SkipTaskWithNoActionsExecuter.java:59)
at org.gradle.api.internal.tasks.execution.SkipOnlyIfTaskExecuter.execute(SkipOnlyIfTaskExecuter.java:54)
at org.gradle.api.internal.tasks.execution.ExecuteAtMostOnceTaskExecuter.execute(ExecuteAtMostOnceTaskExecuter.java:43)
at org.gradle.api.internal.tasks.execution.CatchExceptionTaskExecuter.execute(CatchExceptionTaskExecuter.java:34)
at org.gradle.execution.taskgraph.DefaultTaskGraphExecuter$EventFiringTaskWorker$1.run(DefaultTaskGraphExecuter.java:256)
at org.gradle.internal.operations.DefaultBuildOperationExecutor$RunnableBuildOperationWorker.execute(DefaultBuildOperationExecutor.java:317)
at org.gradle.internal.operations.DefaultBuildOperationExecutor$RunnableBuildOperationWorker.execute(DefaultBuildOperationExecutor.java:309)
at org.gradle.internal.operations.DefaultBuildOperationExecutor.execute(DefaultBuildOperationExecutor.java:185)
at org.gradle.internal.operations.DefaultBuildOperationExecutor.run(DefaultBuildOperationExecutor.java:97)
at org.gradle.internal.operations.DelegatingBuildOperationExecutor.run(DelegatingBuildOperationExecutor.java:31)
at org.gradle.execution.taskgraph.DefaultTaskGraphExecuter$EventFiringTaskWorker.execute(DefaultTaskGraphExecuter.java:249)
at org.gradle.execution.taskgraph.DefaultTaskGraphExecuter$EventFiringTaskWorker.execute(DefaultTaskGraphExecuter.java:238)
at org.gradle.execution.taskgraph.DefaultTaskPlanExecutor$TaskExecutorWorker$1.execute(DefaultTaskPlanExecutor.java:104)
at org.gradle.execution.taskgraph.DefaultTaskPlanExecutor$TaskExecutorWorker$1.execute(DefaultTaskPlanExecutor.java:98)
at org.gradle.execution.taskgraph.DefaultTaskExecutionPlan.execute(DefaultTaskExecutionPlan.java:663)
at org.gradle.execution.taskgraph.DefaultTaskExecutionPlan.executeWithTask(DefaultTaskExecutionPlan.java:596)
at org.gradle.execution.taskgraph.DefaultTaskPlanExecutor$TaskExecutorWorker.run(DefaultTaskPlanExecutor.java:98)
at org.gradle.internal.concurrent.ExecutorPolicy$CatchAndRecordFailures.onExecute(ExecutorPolicy.java:63)
at org.gradle.internal.concurrent.ManagedExecutorImpl$1.run(ManagedExecutorImpl.java:46)
at org.gradle.internal.concurrent.ThreadFactoryImpl$ManagedThreadRunnable.run(ThreadFactoryImpl.java:55)
Caused by: org.gradle.api.GradleException: There were failing tests. See the report at: file://<https://builds.apache.org/job/beam_PerformanceTests_MongoDBIO_IT/ws/src/sdks/java/io/mongodb/build/reports/tests/integrationTest/index.html>
at org.gradle.api.tasks.testing.AbstractTestTask.handleTestFailures(AbstractTestTask.java:612)
at org.gradle.api.tasks.testing.AbstractTestTask.executeTests(AbstractTestTask.java:484)
at org.gradle.api.tasks.testing.Test.executeTests(Test.java:583)
at org.gradle.internal.reflect.JavaMethod.invoke(JavaMethod.java:73)
at org.gradle.api.internal.project.taskfactory.StandardTaskAction.doExecute(StandardTaskAction.java:46)
at org.gradle.api.internal.project.taskfactory.StandardTaskAction.execute(StandardTaskAction.java:39)
at org.gradle.api.internal.project.taskfactory.StandardTaskAction.execute(StandardTaskAction.java:26)
at org.gradle.api.internal.AbstractTask$TaskActionWrapper.execute(AbstractTask.java:794)
at org.gradle.api.internal.AbstractTask$TaskActionWrapper.execute(AbstractTask.java:761)
at org.gradle.api.internal.tasks.execution.ExecuteActionsTaskExecuter$1.run(ExecuteActionsTaskExecuter.java:124)
at org.gradle.internal.operations.DefaultBuildOperationExecutor$RunnableBuildOperationWorker.execute(DefaultBuildOperationExecutor.java:317)
at org.gradle.internal.operations.DefaultBuildOperationExecutor$RunnableBuildOperationWorker.execute(DefaultBuildOperationExecutor.java:309)
at org.gradle.internal.operations.DefaultBuildOperationExecutor.execute(DefaultBuildOperationExecutor.java:185)
at org.gradle.internal.operations.DefaultBuildOperationExecutor.run(DefaultBuildOperationExecutor.java:97)
at org.gradle.internal.operations.DelegatingBuildOperationExecutor.run(DelegatingBuildOperationExecutor.java:31)
at org.gradle.api.internal.tasks.execution.ExecuteActionsTaskExecuter.executeAction(ExecuteActionsTaskExecuter.java:113)
at org.gradle.api.internal.tasks.execution.ExecuteActionsTaskExecuter.executeActions(ExecuteActionsTaskExecuter.java:95)
... 31 more
* Get more help at https://help.gradle.org
2018-06-04 11:22:31,288 572757ca MainThread beam_integration_benchmark(1/1) ERROR Error during benchmark beam_integration_benchmark
Traceback (most recent call last):
File "<https://builds.apache.org/job/beam_PerformanceTests_MongoDBIO_IT/ws/PerfKitBenchmarker/perfkitbenchmarker/pkb.py",> line 667, in RunBenchmark
DoRunPhase(spec, collector, detailed_timer)
File "<https://builds.apache.org/job/beam_PerformanceTests_MongoDBIO_IT/ws/PerfKitBenchmarker/perfkitbenchmarker/pkb.py",> line 547, in DoRunPhase
samples = spec.BenchmarkRun(spec)
File "<https://builds.apache.org/job/beam_PerformanceTests_MongoDBIO_IT/ws/PerfKitBenchmarker/perfkitbenchmarker/linux_benchmarks/beam_integration_benchmark.py",> line 159, in Run
job_type=job_type)
File "<https://builds.apache.org/job/beam_PerformanceTests_MongoDBIO_IT/ws/PerfKitBenchmarker/perfkitbenchmarker/providers/gcp/gcp_dpb_dataflow.py",> line 90, in SubmitJob
assert retcode == 0, "Integration Test Failed."
AssertionError: Integration Test Failed.
2018-06-04 11:22:31,289 572757ca MainThread beam_integration_benchmark(1/1) INFO Cleaning up benchmark beam_integration_benchmark
2018-06-04 11:22:31,289 572757ca MainThread beam_integration_benchmark(1/1) INFO Running: kubectl --kubeconfig=<https://builds.apache.org/job/beam_PerformanceTests_MongoDBIO_IT/ws/config-mongodbioit-259> delete -f <https://builds.apache.org/job/beam_PerformanceTests_MongoDBIO_IT/ws/src/.test-infra/kubernetes/mongodb/load-balancer/mongo.yml> --ignore-not-found
2018-06-04 11:22:31,684 572757ca MainThread beam_integration_benchmark(1/1) ERROR Exception running benchmark
Traceback (most recent call last):
File "<https://builds.apache.org/job/beam_PerformanceTests_MongoDBIO_IT/ws/PerfKitBenchmarker/perfkitbenchmarker/pkb.py",> line 801, in RunBenchmarkTask
RunBenchmark(spec, collector)
File "<https://builds.apache.org/job/beam_PerformanceTests_MongoDBIO_IT/ws/PerfKitBenchmarker/perfkitbenchmarker/pkb.py",> line 667, in RunBenchmark
DoRunPhase(spec, collector, detailed_timer)
File "<https://builds.apache.org/job/beam_PerformanceTests_MongoDBIO_IT/ws/PerfKitBenchmarker/perfkitbenchmarker/pkb.py",> line 547, in DoRunPhase
samples = spec.BenchmarkRun(spec)
File "<https://builds.apache.org/job/beam_PerformanceTests_MongoDBIO_IT/ws/PerfKitBenchmarker/perfkitbenchmarker/linux_benchmarks/beam_integration_benchmark.py",> line 159, in Run
job_type=job_type)
File "<https://builds.apache.org/job/beam_PerformanceTests_MongoDBIO_IT/ws/PerfKitBenchmarker/perfkitbenchmarker/providers/gcp/gcp_dpb_dataflow.py",> line 90, in SubmitJob
assert retcode == 0, "Integration Test Failed."
AssertionError: Integration Test Failed.
2018-06-04 11:22:31,685 572757ca MainThread beam_integration_benchmark(1/1) ERROR Benchmark 1/1 beam_integration_benchmark (UID: beam_integration_benchmark0) failed. Execution will continue.
2018-06-04 11:22:31,717 572757ca MainThread INFO Benchmark run statuses:
---------------------------------------------------------------------------------
Name UID Status Failed Substatus
---------------------------------------------------------------------------------
beam_integration_benchmark beam_integration_benchmark0 FAILED
---------------------------------------------------------------------------------
Success rate: 0.00% (0/1)
2018-06-04 11:22:31,718 572757ca MainThread INFO Complete logs can be found at: <https://builds.apache.org/job/beam_PerformanceTests_MongoDBIO_IT/ws/runs/572757ca/pkb.log>
2018-06-04 11:22:31,718 572757ca MainThread INFO Completion statuses can be found at: <https://builds.apache.org/job/beam_PerformanceTests_MongoDBIO_IT/ws/runs/572757ca/completion_statuses.json>
Build step 'Execute shell' marked build as failure
Build failed in Jenkins: beam_PerformanceTests_MongoDBIO_IT #258
Posted by Apache Jenkins Server <je...@builds.apache.org>.
See <https://builds.apache.org/job/beam_PerformanceTests_MongoDBIO_IT/258/display/redirect>
------------------------------------------
[...truncated 96.02 KB...]
Skipping task ':beam-sdks-java-core:compileTestJava' as it is up-to-date.
:beam-sdks-java-core:compileTestJava (Thread[Task worker for ':' Thread 12,5,main]) completed. Took 0.326 secs.
:beam-sdks-java-core:processTestResources (Thread[Task worker for ':' Thread 12,5,main]) started.
> Task :beam-sdks-java-core:processTestResources NO-SOURCE
file or directory '<https://builds.apache.org/job/beam_PerformanceTests_MongoDBIO_IT/ws/src/sdks/java/core/src/test/resources',> not found
Skipping task ':beam-sdks-java-core:processTestResources' as it has no source files and no previous output files.
:beam-sdks-java-core:processTestResources (Thread[Task worker for ':' Thread 12,5,main]) completed. Took 0.001 secs.
:beam-sdks-java-core:testClasses (Thread[Task worker for ':' Thread 12,5,main]) started.
> Task :beam-sdks-java-core:testClasses UP-TO-DATE
Skipping task ':beam-sdks-java-core:testClasses' as it has no actions.
:beam-sdks-java-core:testClasses (Thread[Task worker for ':' Thread 12,5,main]) completed. Took 0.0 secs.
> Task :beam-runners-direct-java:compileJava UP-TO-DATE
Build cache key for task ':beam-runners-direct-java:compileJava' is c893e5009a6abbf179845692be2853f0
Skipping task ':beam-runners-direct-java:compileJava' as it is up-to-date.
:beam-runners-direct-java:compileJava (Thread[Task worker for ':' Thread 14,5,main]) completed. Took 0.06 secs.
:beam-sdks-java-core:shadowTestJar (Thread[Task worker for ':' Thread 12,5,main]) started.
:beam-runners-direct-java:classes (Thread[Task worker for ':' Thread 14,5,main]) started.
> Task :beam-runners-direct-java:classes UP-TO-DATE
Skipping task ':beam-runners-direct-java:classes' as it has no actions.
:beam-runners-direct-java:classes (Thread[Task worker for ':' Thread 14,5,main]) completed. Took 0.0 secs.
:beam-runners-direct-java:shadowJar (Thread[Task worker for ':' Thread 14,5,main]) started.
> Task :beam-runners-direct-java:shadowJar UP-TO-DATE
Build cache key for task ':beam-runners-direct-java:shadowJar' is 1576e3d82a3ef649703163fa17d4d021
Caching disabled for task ':beam-runners-direct-java:shadowJar': Caching has not been enabled for the task
Skipping task ':beam-runners-direct-java:shadowJar' as it is up-to-date.
:beam-runners-direct-java:shadowJar (Thread[Task worker for ':' Thread 14,5,main]) completed. Took 0.018 secs.
> Task :beam-sdks-java-core:shadowTestJar UP-TO-DATE
Build cache key for task ':beam-sdks-java-core:shadowTestJar' is b853e5a9df8aba2dbe028c438f6bc291
Caching disabled for task ':beam-sdks-java-core:shadowTestJar': Caching has not been enabled for the task
Skipping task ':beam-sdks-java-core:shadowTestJar' as it is up-to-date.
:beam-sdks-java-core:shadowTestJar (Thread[Task worker for ':' Thread 12,5,main]) completed. Took 0.031 secs.
:beam-sdks-java-extensions-google-cloud-platform-core:compileTestJava (Thread[Task worker for ':' Thread 12,5,main]) started.
> Task :beam-sdks-java-extensions-google-cloud-platform-core:compileTestJava UP-TO-DATE
Build cache key for task ':beam-sdks-java-extensions-google-cloud-platform-core:compileTestJava' is 9923c4f9d976eead9424dbd9e67b42ef
Skipping task ':beam-sdks-java-extensions-google-cloud-platform-core:compileTestJava' as it is up-to-date.
:beam-sdks-java-extensions-google-cloud-platform-core:compileTestJava (Thread[Task worker for ':' Thread 12,5,main]) completed. Took 0.041 secs.
:beam-sdks-java-extensions-google-cloud-platform-core:testClasses (Thread[Task worker for ':' Thread 12,5,main]) started.
> Task :beam-sdks-java-extensions-google-cloud-platform-core:testClasses UP-TO-DATE
Skipping task ':beam-sdks-java-extensions-google-cloud-platform-core:testClasses' as it has no actions.
:beam-sdks-java-extensions-google-cloud-platform-core:testClasses (Thread[Task worker for ':' Thread 12,5,main]) completed. Took 0.0 secs.
:beam-sdks-java-extensions-google-cloud-platform-core:shadowTestJar (Thread[Task worker for ':' Thread 12,5,main]) started.
> Task :beam-sdks-java-extensions-google-cloud-platform-core:shadowTestJar UP-TO-DATE
Build cache key for task ':beam-sdks-java-extensions-google-cloud-platform-core:shadowTestJar' is 8f06bd1a79bedc5d22f592c2bd915a03
Caching disabled for task ':beam-sdks-java-extensions-google-cloud-platform-core:shadowTestJar': Caching has not been enabled for the task
Skipping task ':beam-sdks-java-extensions-google-cloud-platform-core:shadowTestJar' as it is up-to-date.
:beam-sdks-java-extensions-google-cloud-platform-core:shadowTestJar (Thread[Task worker for ':' Thread 12,5,main]) completed. Took 0.024 secs.
:beam-sdks-java-io-google-cloud-platform:compileTestJava (Thread[Task worker for ':' Thread 12,5,main]) started.
> Task :beam-sdks-java-io-google-cloud-platform:compileTestJava UP-TO-DATE
Build cache key for task ':beam-sdks-java-io-google-cloud-platform:compileTestJava' is f6d8cd384b8ba15c06305e7221a8b38b
Skipping task ':beam-sdks-java-io-google-cloud-platform:compileTestJava' as it is up-to-date.
:beam-sdks-java-io-google-cloud-platform:compileTestJava (Thread[Task worker for ':' Thread 12,5,main]) completed. Took 0.062 secs.
:beam-sdks-java-io-google-cloud-platform:testClasses (Thread[Task worker for ':' Thread 12,5,main]) started.
> Task :beam-sdks-java-io-google-cloud-platform:testClasses UP-TO-DATE
Skipping task ':beam-sdks-java-io-google-cloud-platform:testClasses' as it has no actions.
:beam-sdks-java-io-google-cloud-platform:testClasses (Thread[Task worker for ':' Thread 12,5,main]) completed. Took 0.0 secs.
:beam-sdks-java-io-google-cloud-platform:shadowTestJar (Thread[Task worker for ':' Thread 12,5,main]) started.
> Task :beam-sdks-java-io-google-cloud-platform:shadowTestJar UP-TO-DATE
Build cache key for task ':beam-sdks-java-io-google-cloud-platform:shadowTestJar' is 77b54c4b8266ef3db7e4fdccd2a924d7
Caching disabled for task ':beam-sdks-java-io-google-cloud-platform:shadowTestJar': Caching has not been enabled for the task
Skipping task ':beam-sdks-java-io-google-cloud-platform:shadowTestJar' as it is up-to-date.
:beam-sdks-java-io-google-cloud-platform:shadowTestJar (Thread[Task worker for ':' Thread 12,5,main]) completed. Took 0.034 secs.
:beam-runners-google-cloud-dataflow-java:compileTestJava (Thread[Task worker for ':' Thread 12,5,main]) started.
> Task :beam-runners-google-cloud-dataflow-java:compileTestJava UP-TO-DATE
Build cache key for task ':beam-runners-google-cloud-dataflow-java:compileTestJava' is 880577598c0976cf6bd0cc18537f8f31
Skipping task ':beam-runners-google-cloud-dataflow-java:compileTestJava' as it is up-to-date.
:beam-runners-google-cloud-dataflow-java:compileTestJava (Thread[Task worker for ':' Thread 12,5,main]) completed. Took 0.056 secs.
:beam-runners-google-cloud-dataflow-java:testClasses (Thread[Task worker for ':' Thread 12,5,main]) started.
> Task :beam-runners-google-cloud-dataflow-java:testClasses UP-TO-DATE
Skipping task ':beam-runners-google-cloud-dataflow-java:testClasses' as it has no actions.
:beam-runners-google-cloud-dataflow-java:testClasses (Thread[Task worker for ':' Thread 12,5,main]) completed. Took 0.0 secs.
:beam-runners-google-cloud-dataflow-java:shadowTestJar (Thread[Task worker for ':' Thread 2,5,main]) started.
> Task :beam-runners-google-cloud-dataflow-java:shadowTestJar UP-TO-DATE
Build cache key for task ':beam-runners-google-cloud-dataflow-java:shadowTestJar' is 2a61f1b76e2f84bab7efed31b76b896f
Caching disabled for task ':beam-runners-google-cloud-dataflow-java:shadowTestJar': Caching has not been enabled for the task
Skipping task ':beam-runners-google-cloud-dataflow-java:shadowTestJar' as it is up-to-date.
:beam-runners-google-cloud-dataflow-java:shadowTestJar (Thread[Task worker for ':' Thread 2,5,main]) completed. Took 0.034 secs.
:beam-sdks-java-io-mongodb:compileTestJava (Thread[Task worker for ':' Thread 2,5,main]) started.
> Task :beam-sdks-java-io-mongodb:compileTestJava UP-TO-DATE
Build cache key for task ':beam-sdks-java-io-mongodb:compileTestJava' is 6810ce146d25619b67e07e4dd89c59a3
Skipping task ':beam-sdks-java-io-mongodb:compileTestJava' as it is up-to-date.
:beam-sdks-java-io-mongodb:compileTestJava (Thread[Task worker for ':' Thread 2,5,main]) completed. Took 0.055 secs.
:beam-sdks-java-io-mongodb:testClasses (Thread[Task worker for ':' Thread 2,5,main]) started.
> Task :beam-sdks-java-io-mongodb:testClasses UP-TO-DATE
Skipping task ':beam-sdks-java-io-mongodb:testClasses' as it has no actions.
:beam-sdks-java-io-mongodb:testClasses (Thread[Task worker for ':' Thread 2,5,main]) completed. Took 0.0 secs.
:beam-sdks-java-io-mongodb:integrationTest (Thread[Task worker for ':' Thread 15,5,main]) started.
Gradle Test Executor 1 started executing tests.
> Task :beam-sdks-java-io-mongodb:integrationTest
Build cache key for task ':beam-sdks-java-io-mongodb:integrationTest' is 80953fe18fc3c1bbcafd90a8de42533c
Task ':beam-sdks-java-io-mongodb:integrationTest' is not up-to-date because:
Task.upToDateWhen is false.
Not loading task ':beam-sdks-java-io-mongodb:integrationTest' from cache because pulling from cache is disabled for this task
Starting process 'Gradle Test Executor 1'. Working directory: <https://builds.apache.org/job/beam_PerformanceTests_MongoDBIO_IT/ws/src/sdks/java/io/mongodb> Command: /usr/local/asfpackages/java/jdk1.8.0_152/bin/java -DbeamTestPipelineOptions=["--tempRoot=gs://temp-storage-for-perf-tests","--project=apache-beam-testing","--numberOfRecords=10000000","--mongoDBHostName=35.232.160.85","--mongoDBDatabaseName=beam","--mongoDBPort=27017","--runner=TestDataflowRunner"] -Djava.security.manager=worker.org.gradle.process.internal.worker.child.BootstrapSecurityManager -Dorg.gradle.native=false -Dfile.encoding=UTF-8 -Duser.country=US -Duser.language=en -Duser.variant -ea -cp /home/jenkins/.gradle/caches/4.7/workerMain/gradle-worker.jar worker.org.gradle.process.internal.worker.GradleWorkerMain 'Gradle Test Executor 1'
Successfully started process 'Gradle Test Executor 1'
Gradle Test Executor 1 finished executing tests.
> Task :beam-sdks-java-io-mongodb:integrationTest FAILED
org.apache.beam.sdk.io.mongodb.MongoDBIOIT > classMethod FAILED
java.lang.IllegalArgumentException: Class interface org.apache.beam.sdk.testing.TestPipelineOptions missing a property named 'mongoDBHostName'.
at org.apache.beam.sdk.options.PipelineOptionsFactory.parseObjects(PipelineOptionsFactory.java:1488)
at org.apache.beam.sdk.options.PipelineOptionsFactory.access$400(PipelineOptionsFactory.java:110)
at org.apache.beam.sdk.options.PipelineOptionsFactory$Builder.as(PipelineOptionsFactory.java:297)
at org.apache.beam.sdk.testing.TestPipeline.testingPipelineOptions(TestPipeline.java:446)
at org.apache.beam.sdk.io.mongodb.MongoDBIOIT.setUp(MongoDBIOIT.java:104)
org.apache.beam.sdk.io.mongodb.MongoDBIOIT > classMethod FAILED
java.lang.NullPointerException
at org.apache.beam.sdk.io.mongodb.MongoDBIOIT.tearDown(MongoDBIOIT.java:110)
2 tests completed, 2 failed
Finished generating test XML results (0.014 secs) into: <https://builds.apache.org/job/beam_PerformanceTests_MongoDBIO_IT/ws/src/sdks/java/io/mongodb/build/test-results/integrationTest>
Generating HTML test report...
Finished generating test html results (0.026 secs) into: <https://builds.apache.org/job/beam_PerformanceTests_MongoDBIO_IT/ws/src/sdks/java/io/mongodb/build/reports/tests/integrationTest>
:beam-sdks-java-io-mongodb:integrationTest (Thread[Task worker for ':' Thread 15,5,main]) completed. Took 2.429 secs.
Deprecated Gradle features were used in this build, making it incompatible with Gradle 5.0.
See https://docs.gradle.org/4.7/userguide/command_line_interface.html#sec:command_line_warnings
BUILD FAILED in 12s
62 actionable tasks: 1 executed, 61 up-to-date
Publishing build scan...
https://gradle.com/s/5ywrigig3ln36
STDERR:
FAILURE: Build failed with an exception.
* What went wrong:
Execution failed for task ':beam-sdks-java-io-mongodb:integrationTest'.
> There were failing tests. See the report at: file://<https://builds.apache.org/job/beam_PerformanceTests_MongoDBIO_IT/ws/src/sdks/java/io/mongodb/build/reports/tests/integrationTest/index.html>
* Try:
Run with --debug option to get more log output. Run with --scan to get full insights.
* Exception is:
org.gradle.api.tasks.TaskExecutionException: Execution failed for task ':beam-sdks-java-io-mongodb:integrationTest'.
at org.gradle.api.internal.tasks.execution.ExecuteActionsTaskExecuter.executeActions(ExecuteActionsTaskExecuter.java:103)
at org.gradle.api.internal.tasks.execution.ExecuteActionsTaskExecuter.execute(ExecuteActionsTaskExecuter.java:73)
at org.gradle.api.internal.tasks.execution.OutputDirectoryCreatingTaskExecuter.execute(OutputDirectoryCreatingTaskExecuter.java:51)
at org.gradle.api.internal.tasks.execution.SkipCachedTaskExecuter.execute(SkipCachedTaskExecuter.java:105)
at org.gradle.api.internal.tasks.execution.SkipUpToDateTaskExecuter.execute(SkipUpToDateTaskExecuter.java:59)
at org.gradle.api.internal.tasks.execution.ResolveTaskOutputCachingStateExecuter.execute(ResolveTaskOutputCachingStateExecuter.java:54)
at org.gradle.api.internal.tasks.execution.ResolveBuildCacheKeyExecuter.execute(ResolveBuildCacheKeyExecuter.java:66)
at org.gradle.api.internal.tasks.execution.ValidatingTaskExecuter.execute(ValidatingTaskExecuter.java:59)
at org.gradle.api.internal.tasks.execution.SkipEmptySourceFilesTaskExecuter.execute(SkipEmptySourceFilesTaskExecuter.java:101)
at org.gradle.api.internal.tasks.execution.FinalizeInputFilePropertiesTaskExecuter.execute(FinalizeInputFilePropertiesTaskExecuter.java:44)
at org.gradle.api.internal.tasks.execution.CleanupStaleOutputsExecuter.execute(CleanupStaleOutputsExecuter.java:91)
at org.gradle.api.internal.tasks.execution.ResolveTaskArtifactStateTaskExecuter.execute(ResolveTaskArtifactStateTaskExecuter.java:62)
at org.gradle.api.internal.tasks.execution.SkipTaskWithNoActionsExecuter.execute(SkipTaskWithNoActionsExecuter.java:59)
at org.gradle.api.internal.tasks.execution.SkipOnlyIfTaskExecuter.execute(SkipOnlyIfTaskExecuter.java:54)
at org.gradle.api.internal.tasks.execution.ExecuteAtMostOnceTaskExecuter.execute(ExecuteAtMostOnceTaskExecuter.java:43)
at org.gradle.api.internal.tasks.execution.CatchExceptionTaskExecuter.execute(CatchExceptionTaskExecuter.java:34)
at org.gradle.execution.taskgraph.DefaultTaskGraphExecuter$EventFiringTaskWorker$1.run(DefaultTaskGraphExecuter.java:256)
at org.gradle.internal.operations.DefaultBuildOperationExecutor$RunnableBuildOperationWorker.execute(DefaultBuildOperationExecutor.java:317)
at org.gradle.internal.operations.DefaultBuildOperationExecutor$RunnableBuildOperationWorker.execute(DefaultBuildOperationExecutor.java:309)
at org.gradle.internal.operations.DefaultBuildOperationExecutor.execute(DefaultBuildOperationExecutor.java:185)
at org.gradle.internal.operations.DefaultBuildOperationExecutor.run(DefaultBuildOperationExecutor.java:97)
at org.gradle.internal.operations.DelegatingBuildOperationExecutor.run(DelegatingBuildOperationExecutor.java:31)
at org.gradle.execution.taskgraph.DefaultTaskGraphExecuter$EventFiringTaskWorker.execute(DefaultTaskGraphExecuter.java:249)
at org.gradle.execution.taskgraph.DefaultTaskGraphExecuter$EventFiringTaskWorker.execute(DefaultTaskGraphExecuter.java:238)
at org.gradle.execution.taskgraph.DefaultTaskPlanExecutor$TaskExecutorWorker$1.execute(DefaultTaskPlanExecutor.java:104)
at org.gradle.execution.taskgraph.DefaultTaskPlanExecutor$TaskExecutorWorker$1.execute(DefaultTaskPlanExecutor.java:98)
at org.gradle.execution.taskgraph.DefaultTaskExecutionPlan.execute(DefaultTaskExecutionPlan.java:663)
at org.gradle.execution.taskgraph.DefaultTaskExecutionPlan.executeWithTask(DefaultTaskExecutionPlan.java:596)
at org.gradle.execution.taskgraph.DefaultTaskPlanExecutor$TaskExecutorWorker.run(DefaultTaskPlanExecutor.java:98)
at org.gradle.internal.concurrent.ExecutorPolicy$CatchAndRecordFailures.onExecute(ExecutorPolicy.java:63)
at org.gradle.internal.concurrent.ManagedExecutorImpl$1.run(ManagedExecutorImpl.java:46)
at org.gradle.internal.concurrent.ThreadFactoryImpl$ManagedThreadRunnable.run(ThreadFactoryImpl.java:55)
Caused by: org.gradle.api.GradleException: There were failing tests. See the report at: file://<https://builds.apache.org/job/beam_PerformanceTests_MongoDBIO_IT/ws/src/sdks/java/io/mongodb/build/reports/tests/integrationTest/index.html>
at org.gradle.api.tasks.testing.AbstractTestTask.handleTestFailures(AbstractTestTask.java:612)
at org.gradle.api.tasks.testing.AbstractTestTask.executeTests(AbstractTestTask.java:484)
at org.gradle.api.tasks.testing.Test.executeTests(Test.java:583)
at org.gradle.internal.reflect.JavaMethod.invoke(JavaMethod.java:73)
at org.gradle.api.internal.project.taskfactory.StandardTaskAction.doExecute(StandardTaskAction.java:46)
at org.gradle.api.internal.project.taskfactory.StandardTaskAction.execute(StandardTaskAction.java:39)
at org.gradle.api.internal.project.taskfactory.StandardTaskAction.execute(StandardTaskAction.java:26)
at org.gradle.api.internal.AbstractTask$TaskActionWrapper.execute(AbstractTask.java:794)
at org.gradle.api.internal.AbstractTask$TaskActionWrapper.execute(AbstractTask.java:761)
at org.gradle.api.internal.tasks.execution.ExecuteActionsTaskExecuter$1.run(ExecuteActionsTaskExecuter.java:124)
at org.gradle.internal.operations.DefaultBuildOperationExecutor$RunnableBuildOperationWorker.execute(DefaultBuildOperationExecutor.java:317)
at org.gradle.internal.operations.DefaultBuildOperationExecutor$RunnableBuildOperationWorker.execute(DefaultBuildOperationExecutor.java:309)
at org.gradle.internal.operations.DefaultBuildOperationExecutor.execute(DefaultBuildOperationExecutor.java:185)
at org.gradle.internal.operations.DefaultBuildOperationExecutor.run(DefaultBuildOperationExecutor.java:97)
at org.gradle.internal.operations.DelegatingBuildOperationExecutor.run(DelegatingBuildOperationExecutor.java:31)
at org.gradle.api.internal.tasks.execution.ExecuteActionsTaskExecuter.executeAction(ExecuteActionsTaskExecuter.java:113)
at org.gradle.api.internal.tasks.execution.ExecuteActionsTaskExecuter.executeActions(ExecuteActionsTaskExecuter.java:95)
... 31 more
* Get more help at https://help.gradle.org
2018-06-04 09:47:42,384 0daee873 MainThread beam_integration_benchmark(1/1) ERROR Error during benchmark beam_integration_benchmark
Traceback (most recent call last):
File "<https://builds.apache.org/job/beam_PerformanceTests_MongoDBIO_IT/ws/PerfKitBenchmarker/perfkitbenchmarker/pkb.py",> line 667, in RunBenchmark
DoRunPhase(spec, collector, detailed_timer)
File "<https://builds.apache.org/job/beam_PerformanceTests_MongoDBIO_IT/ws/PerfKitBenchmarker/perfkitbenchmarker/pkb.py",> line 547, in DoRunPhase
samples = spec.BenchmarkRun(spec)
File "<https://builds.apache.org/job/beam_PerformanceTests_MongoDBIO_IT/ws/PerfKitBenchmarker/perfkitbenchmarker/linux_benchmarks/beam_integration_benchmark.py",> line 159, in Run
job_type=job_type)
File "<https://builds.apache.org/job/beam_PerformanceTests_MongoDBIO_IT/ws/PerfKitBenchmarker/perfkitbenchmarker/providers/gcp/gcp_dpb_dataflow.py",> line 90, in SubmitJob
assert retcode == 0, "Integration Test Failed."
AssertionError: Integration Test Failed.
2018-06-04 09:47:42,385 0daee873 MainThread beam_integration_benchmark(1/1) INFO Cleaning up benchmark beam_integration_benchmark
2018-06-04 09:47:42,386 0daee873 MainThread beam_integration_benchmark(1/1) INFO Running: kubectl --kubeconfig=<https://builds.apache.org/job/beam_PerformanceTests_MongoDBIO_IT/ws/config-mongodbioit-258> delete -f <https://builds.apache.org/job/beam_PerformanceTests_MongoDBIO_IT/ws/src/.test-infra/kubernetes/mongodb/load-balancer/mongo.yml> --ignore-not-found
2018-06-04 09:47:42,750 0daee873 MainThread beam_integration_benchmark(1/1) ERROR Exception running benchmark
Traceback (most recent call last):
File "<https://builds.apache.org/job/beam_PerformanceTests_MongoDBIO_IT/ws/PerfKitBenchmarker/perfkitbenchmarker/pkb.py",> line 801, in RunBenchmarkTask
RunBenchmark(spec, collector)
File "<https://builds.apache.org/job/beam_PerformanceTests_MongoDBIO_IT/ws/PerfKitBenchmarker/perfkitbenchmarker/pkb.py",> line 667, in RunBenchmark
DoRunPhase(spec, collector, detailed_timer)
File "<https://builds.apache.org/job/beam_PerformanceTests_MongoDBIO_IT/ws/PerfKitBenchmarker/perfkitbenchmarker/pkb.py",> line 547, in DoRunPhase
samples = spec.BenchmarkRun(spec)
File "<https://builds.apache.org/job/beam_PerformanceTests_MongoDBIO_IT/ws/PerfKitBenchmarker/perfkitbenchmarker/linux_benchmarks/beam_integration_benchmark.py",> line 159, in Run
job_type=job_type)
File "<https://builds.apache.org/job/beam_PerformanceTests_MongoDBIO_IT/ws/PerfKitBenchmarker/perfkitbenchmarker/providers/gcp/gcp_dpb_dataflow.py",> line 90, in SubmitJob
assert retcode == 0, "Integration Test Failed."
AssertionError: Integration Test Failed.
2018-06-04 09:47:42,751 0daee873 MainThread beam_integration_benchmark(1/1) ERROR Benchmark 1/1 beam_integration_benchmark (UID: beam_integration_benchmark0) failed. Execution will continue.
2018-06-04 09:47:42,810 0daee873 MainThread INFO Benchmark run statuses:
---------------------------------------------------------------------------------
Name UID Status Failed Substatus
---------------------------------------------------------------------------------
beam_integration_benchmark beam_integration_benchmark0 FAILED
---------------------------------------------------------------------------------
Success rate: 0.00% (0/1)
2018-06-04 09:47:42,810 0daee873 MainThread INFO Complete logs can be found at: <https://builds.apache.org/job/beam_PerformanceTests_MongoDBIO_IT/ws/runs/0daee873/pkb.log>
2018-06-04 09:47:42,811 0daee873 MainThread INFO Completion statuses can be found at: <https://builds.apache.org/job/beam_PerformanceTests_MongoDBIO_IT/ws/runs/0daee873/completion_statuses.json>
Build step 'Execute shell' marked build as failure
Build failed in Jenkins: beam_PerformanceTests_MongoDBIO_IT #257
Posted by Apache Jenkins Server <je...@builds.apache.org>.
See <https://builds.apache.org/job/beam_PerformanceTests_MongoDBIO_IT/257/display/redirect>
------------------------------------------
[...truncated 291.15 KB...]
java.lang.RuntimeException: com.mongodb.MongoTimeoutException: Timed out after 30000 ms while waiting for a server that matches ReadPreferenceServerSelector{readPreference=primary}. Client view of cluster state is {type=UNKNOWN, servers=[{address=35.225.2.104:27017, type=UNKNOWN, state=CONNECTING, exception={com.mongodb.MongoSocketOpenException: Exception opening socket}, caused by {java.net.SocketTimeoutException: connect timed out}}]
at com.mongodb.connection.BaseCluster.createTimeoutException(BaseCluster.java:369)
at com.mongodb.connection.BaseCluster.selectServer(BaseCluster.java:101)
at com.mongodb.binding.ClusterBinding$ClusterBindingConnectionSource.<init>(ClusterBinding.java:75)
at com.mongodb.binding.ClusterBinding$ClusterBindingConnectionSource.<init>(ClusterBinding.java:71)
at com.mongodb.binding.ClusterBinding.getReadConnectionSource(ClusterBinding.java:63)
at com.mongodb.operation.CommandOperationHelper.executeWrappedCommandProtocol(CommandOperationHelper.java:89)
at com.mongodb.operation.CommandOperationHelper.executeWrappedCommandProtocol(CommandOperationHelper.java:84)
at com.mongodb.operation.CommandReadOperation.execute(CommandReadOperation.java:55)
at com.mongodb.Mongo.execute(Mongo.java:772)
at com.mongodb.Mongo$2.execute(Mongo.java:759)
at com.mongodb.MongoDatabaseImpl.runCommand(MongoDatabaseImpl.java:130)
at com.mongodb.MongoDatabaseImpl.runCommand(MongoDatabaseImpl.java:124)
at com.mongodb.MongoDatabaseImpl.runCommand(MongoDatabaseImpl.java:114)
at org.apache.beam.sdk.io.mongodb.MongoDbIO$BoundedMongoDbSource.split(MongoDbIO.java:332)
at com.google.cloud.dataflow.worker.WorkerCustomSources.splitAndValidate(WorkerCustomSources.java:275)
at com.google.cloud.dataflow.worker.WorkerCustomSources.performSplitTyped(WorkerCustomSources.java:197)
at com.google.cloud.dataflow.worker.WorkerCustomSources.performSplitWithApiLimit(WorkerCustomSources.java:181)
at com.google.cloud.dataflow.worker.WorkerCustomSources.performSplit(WorkerCustomSources.java:160)
at com.google.cloud.dataflow.worker.WorkerCustomSourceOperationExecutor.execute(WorkerCustomSourceOperationExecutor.java:77)
at com.google.cloud.dataflow.worker.BatchDataflowWorker.executeWork(BatchDataflowWorker.java:391)
at com.google.cloud.dataflow.worker.BatchDataflowWorker.doWork(BatchDataflowWorker.java:360)
at com.google.cloud.dataflow.worker.BatchDataflowWorker.getAndPerformWork(BatchDataflowWorker.java:288)
at com.google.cloud.dataflow.worker.DataflowBatchWorkerHarness$WorkerThread.doWork(DataflowBatchWorkerHarness.java:134)
at com.google.cloud.dataflow.worker.DataflowBatchWorkerHarness$WorkerThread.call(DataflowBatchWorkerHarness.java:114)
at com.google.cloud.dataflow.worker.DataflowBatchWorkerHarness$WorkerThread.call(DataflowBatchWorkerHarness.java:101)
at java.util.concurrent.FutureTask.run(FutureTask.java:266)
at java.util.concurrent.ThreadPoolExecutor.runWorker(ThreadPoolExecutor.java:1142)
at java.util.concurrent.ThreadPoolExecutor$Worker.run(ThreadPoolExecutor.java:617)
at java.lang.Thread.run(Thread.java:745)
com.mongodb.MongoTimeoutException: Timed out after 30000 ms while waiting for a server that matches ReadPreferenceServerSelector{readPreference=primary}. Client view of cluster state is {type=UNKNOWN, servers=[{address=35.225.2.104:27017, type=UNKNOWN, state=CONNECTING, exception={com.mongodb.MongoSocketOpenException: Exception opening socket}, caused by {java.net.SocketTimeoutException: connect timed out}}]
at com.mongodb.connection.BaseCluster.createTimeoutException(BaseCluster.java:369)
at com.mongodb.connection.BaseCluster.selectServer(BaseCluster.java:101)
at com.mongodb.binding.ClusterBinding$ClusterBindingConnectionSource.<init>(ClusterBinding.java:75)
at com.mongodb.binding.ClusterBinding$ClusterBindingConnectionSource.<init>(ClusterBinding.java:71)
at com.mongodb.binding.ClusterBinding.getReadConnectionSource(ClusterBinding.java:63)
at com.mongodb.operation.CommandOperationHelper.executeWrappedCommandProtocol(CommandOperationHelper.java:89)
at com.mongodb.operation.CommandOperationHelper.executeWrappedCommandProtocol(CommandOperationHelper.java:84)
at com.mongodb.operation.CommandReadOperation.execute(CommandReadOperation.java:55)
at com.mongodb.Mongo.execute(Mongo.java:772)
at com.mongodb.Mongo$2.execute(Mongo.java:759)
at com.mongodb.MongoDatabaseImpl.runCommand(MongoDatabaseImpl.java:130)
at com.mongodb.MongoDatabaseImpl.runCommand(MongoDatabaseImpl.java:124)
at com.mongodb.MongoDatabaseImpl.runCommand(MongoDatabaseImpl.java:114)
at org.apache.beam.sdk.io.mongodb.MongoDbIO$BoundedMongoDbSource.split(MongoDbIO.java:332)
at com.google.cloud.dataflow.worker.WorkerCustomSources.splitAndValidate(WorkerCustomSources.java:275)
at com.google.cloud.dataflow.worker.WorkerCustomSources.performSplitTyped(WorkerCustomSources.java:197)
at com.google.cloud.dataflow.worker.WorkerCustomSources.performSplitWithApiLimit(WorkerCustomSources.java:181)
at com.google.cloud.dataflow.worker.WorkerCustomSources.performSplit(WorkerCustomSources.java:160)
at com.google.cloud.dataflow.worker.WorkerCustomSourceOperationExecutor.execute(WorkerCustomSourceOperationExecutor.java:77)
at com.google.cloud.dataflow.worker.BatchDataflowWorker.executeWork(BatchDataflowWorker.java:391)
at com.google.cloud.dataflow.worker.BatchDataflowWorker.doWork(BatchDataflowWorker.java:360)
at com.google.cloud.dataflow.worker.BatchDataflowWorker.getAndPerformWork(BatchDataflowWorker.java:288)
at com.google.cloud.dataflow.worker.DataflowBatchWorkerHarness$WorkerThread.doWork(DataflowBatchWorkerHarness.java:134)
at com.google.cloud.dataflow.worker.DataflowBatchWorkerHarness$WorkerThread.call(DataflowBatchWorkerHarness.java:114)
at com.google.cloud.dataflow.worker.DataflowBatchWorkerHarness$WorkerThread.call(DataflowBatchWorkerHarness.java:101)
at java.util.concurrent.FutureTask.run(FutureTask.java:266)
at java.util.concurrent.ThreadPoolExecutor.runWorker(ThreadPoolExecutor.java:1142)
at java.util.concurrent.ThreadPoolExecutor$Worker.run(ThreadPoolExecutor.java:617)
at java.lang.Thread.run(Thread.java:745)
com.mongodb.MongoTimeoutException: Timed out after 30000 ms while waiting for a server that matches ReadPreferenceServerSelector{readPreference=primary}. Client view of cluster state is {type=UNKNOWN, servers=[{address=35.225.2.104:27017, type=UNKNOWN, state=CONNECTING, exception={com.mongodb.MongoSocketOpenException: Exception opening socket}, caused by {java.net.SocketTimeoutException: connect timed out}}]
at com.mongodb.connection.BaseCluster.createTimeoutException(BaseCluster.java:369)
at com.mongodb.connection.BaseCluster.selectServer(BaseCluster.java:101)
at com.mongodb.binding.ClusterBinding$ClusterBindingConnectionSource.<init>(ClusterBinding.java:75)
at com.mongodb.binding.ClusterBinding$ClusterBindingConnectionSource.<init>(ClusterBinding.java:71)
at com.mongodb.binding.ClusterBinding.getReadConnectionSource(ClusterBinding.java:63)
at com.mongodb.operation.CommandOperationHelper.executeWrappedCommandProtocol(CommandOperationHelper.java:89)
at com.mongodb.operation.CommandOperationHelper.executeWrappedCommandProtocol(CommandOperationHelper.java:84)
at com.mongodb.operation.CommandReadOperation.execute(CommandReadOperation.java:55)
at com.mongodb.Mongo.execute(Mongo.java:772)
at com.mongodb.Mongo$2.execute(Mongo.java:759)
at com.mongodb.MongoDatabaseImpl.runCommand(MongoDatabaseImpl.java:130)
at com.mongodb.MongoDatabaseImpl.runCommand(MongoDatabaseImpl.java:124)
at com.mongodb.MongoDatabaseImpl.runCommand(MongoDatabaseImpl.java:114)
at org.apache.beam.sdk.io.mongodb.MongoDbIO$BoundedMongoDbSource.split(MongoDbIO.java:332)
at com.google.cloud.dataflow.worker.WorkerCustomSources.splitAndValidate(WorkerCustomSources.java:275)
at com.google.cloud.dataflow.worker.WorkerCustomSources.performSplitTyped(WorkerCustomSources.java:197)
at com.google.cloud.dataflow.worker.WorkerCustomSources.performSplitWithApiLimit(WorkerCustomSources.java:181)
at com.google.cloud.dataflow.worker.WorkerCustomSources.performSplit(WorkerCustomSources.java:160)
at com.google.cloud.dataflow.worker.WorkerCustomSourceOperationExecutor.execute(WorkerCustomSourceOperationExecutor.java:77)
at com.google.cloud.dataflow.worker.BatchDataflowWorker.executeWork(BatchDataflowWorker.java:391)
at com.google.cloud.dataflow.worker.BatchDataflowWorker.doWork(BatchDataflowWorker.java:360)
at com.google.cloud.dataflow.worker.BatchDataflowWorker.getAndPerformWork(BatchDataflowWorker.java:288)
at com.google.cloud.dataflow.worker.DataflowBatchWorkerHarness$WorkerThread.doWork(DataflowBatchWorkerHarness.java:134)
at com.google.cloud.dataflow.worker.DataflowBatchWorkerHarness$WorkerThread.call(DataflowBatchWorkerHarness.java:114)
at com.google.cloud.dataflow.worker.DataflowBatchWorkerHarness$WorkerThread.call(DataflowBatchWorkerHarness.java:101)
at java.util.concurrent.FutureTask.run(FutureTask.java:266)
at java.util.concurrent.ThreadPoolExecutor.runWorker(ThreadPoolExecutor.java:1142)
at java.util.concurrent.ThreadPoolExecutor$Worker.run(ThreadPoolExecutor.java:617)
at java.lang.Thread.run(Thread.java:745)
com.mongodb.MongoTimeoutException: Timed out after 30000 ms while waiting for a server that matches ReadPreferenceServerSelector{readPreference=primary}. Client view of cluster state is {type=UNKNOWN, servers=[{address=35.225.2.104:27017, type=UNKNOWN, state=CONNECTING, exception={com.mongodb.MongoSocketOpenException: Exception opening socket}, caused by {java.net.SocketTimeoutException: connect timed out}}]
at com.mongodb.connection.BaseCluster.createTimeoutException(BaseCluster.java:369)
at com.mongodb.connection.BaseCluster.selectServer(BaseCluster.java:101)
at com.mongodb.binding.ClusterBinding$ClusterBindingConnectionSource.<init>(ClusterBinding.java:75)
at com.mongodb.binding.ClusterBinding$ClusterBindingConnectionSource.<init>(ClusterBinding.java:71)
at com.mongodb.binding.ClusterBinding.getReadConnectionSource(ClusterBinding.java:63)
at com.mongodb.operation.CommandOperationHelper.executeWrappedCommandProtocol(CommandOperationHelper.java:89)
at com.mongodb.operation.CommandOperationHelper.executeWrappedCommandProtocol(CommandOperationHelper.java:84)
at com.mongodb.operation.CommandReadOperation.execute(CommandReadOperation.java:55)
at com.mongodb.Mongo.execute(Mongo.java:772)
at com.mongodb.Mongo$2.execute(Mongo.java:759)
at com.mongodb.MongoDatabaseImpl.runCommand(MongoDatabaseImpl.java:130)
at com.mongodb.MongoDatabaseImpl.runCommand(MongoDatabaseImpl.java:124)
at com.mongodb.MongoDatabaseImpl.runCommand(MongoDatabaseImpl.java:114)
at org.apache.beam.sdk.io.mongodb.MongoDbIO$BoundedMongoDbSource.split(MongoDbIO.java:332)
at com.google.cloud.dataflow.worker.WorkerCustomSources.splitAndValidate(WorkerCustomSources.java:275)
at com.google.cloud.dataflow.worker.WorkerCustomSources.performSplitTyped(WorkerCustomSources.java:197)
at com.google.cloud.dataflow.worker.WorkerCustomSources.performSplitWithApiLimit(WorkerCustomSources.java:181)
at com.google.cloud.dataflow.worker.WorkerCustomSources.performSplit(WorkerCustomSources.java:160)
at com.google.cloud.dataflow.worker.WorkerCustomSourceOperationExecutor.execute(WorkerCustomSourceOperationExecutor.java:77)
at com.google.cloud.dataflow.worker.BatchDataflowWorker.executeWork(BatchDataflowWorker.java:391)
at com.google.cloud.dataflow.worker.BatchDataflowWorker.doWork(BatchDataflowWorker.java:360)
at com.google.cloud.dataflow.worker.BatchDataflowWorker.getAndPerformWork(BatchDataflowWorker.java:288)
at com.google.cloud.dataflow.worker.DataflowBatchWorkerHarness$WorkerThread.doWork(DataflowBatchWorkerHarness.java:134)
at com.google.cloud.dataflow.worker.DataflowBatchWorkerHarness$WorkerThread.call(DataflowBatchWorkerHarness.java:114)
at com.google.cloud.dataflow.worker.DataflowBatchWorkerHarness$WorkerThread.call(DataflowBatchWorkerHarness.java:101)
at java.util.concurrent.FutureTask.run(FutureTask.java:266)
at java.util.concurrent.ThreadPoolExecutor.runWorker(ThreadPoolExecutor.java:1142)
at java.util.concurrent.ThreadPoolExecutor$Worker.run(ThreadPoolExecutor.java:617)
at java.lang.Thread.run(Thread.java:745)
Workflow failed. Causes: S03:Read all documents/Read(BoundedMongoDbSource)+Map documents to Strings/Map+Calculate hashcode/WithKeys/AddKeys/Map+Calculate hashcode/Combine.perKey(Hashing)/GroupByKey+Calculate hashcode/Combine.perKey(Hashing)/Combine.GroupedValues/Partial+Calculate hashcode/Combine.perKey(Hashing)/GroupByKey/Reify+Calculate hashcode/Combine.perKey(Hashing)/GroupByKey/Write failed.
at org.apache.beam.runners.dataflow.TestDataflowRunner.run(TestDataflowRunner.java:134)
at org.apache.beam.runners.dataflow.TestDataflowRunner.run(TestDataflowRunner.java:90)
at org.apache.beam.runners.dataflow.TestDataflowRunner.run(TestDataflowRunner.java:55)
at org.apache.beam.sdk.Pipeline.run(Pipeline.java:311)
at org.apache.beam.sdk.testing.TestPipeline.run(TestPipeline.java:348)
at org.apache.beam.sdk.testing.TestPipeline.run(TestPipeline.java:329)
at org.apache.beam.sdk.io.mongodb.MongoDBIOIT.testWriteAndRead(MongoDBIOIT.java:131)
1 test completed, 1 failed
Finished generating test XML results (0.023 secs) into: <https://builds.apache.org/job/beam_PerformanceTests_MongoDBIO_IT/ws/src/sdks/java/io/mongodb/build/test-results/integrationTest>
Generating HTML test report...
Finished generating test html results (0.033 secs) into: <https://builds.apache.org/job/beam_PerformanceTests_MongoDBIO_IT/ws/src/sdks/java/io/mongodb/build/reports/tests/integrationTest>
:beam-sdks-java-io-mongodb:integrationTest (Thread[Task worker for ':' Thread 15,5,main]) completed. Took 11 mins 31.986 secs.
Deprecated Gradle features were used in this build, making it incompatible with Gradle 5.0.
See https://docs.gradle.org/4.7/userguide/command_line_interface.html#sec:command_line_warnings
BUILD FAILED in 11m 41s
62 actionable tasks: 1 executed, 61 up-to-date
Publishing build scan...
https://gradle.com/s/dvt7ut3lghkfa
STDERR:
FAILURE: Build failed with an exception.
* What went wrong:
Execution failed for task ':beam-sdks-java-io-mongodb:integrationTest'.
> There were failing tests. See the report at: file://<https://builds.apache.org/job/beam_PerformanceTests_MongoDBIO_IT/ws/src/sdks/java/io/mongodb/build/reports/tests/integrationTest/index.html>
* Try:
Run with --debug option to get more log output. Run with --scan to get full insights.
* Exception is:
org.gradle.api.tasks.TaskExecutionException: Execution failed for task ':beam-sdks-java-io-mongodb:integrationTest'.
at org.gradle.api.internal.tasks.execution.ExecuteActionsTaskExecuter.executeActions(ExecuteActionsTaskExecuter.java:103)
at org.gradle.api.internal.tasks.execution.ExecuteActionsTaskExecuter.execute(ExecuteActionsTaskExecuter.java:73)
at org.gradle.api.internal.tasks.execution.OutputDirectoryCreatingTaskExecuter.execute(OutputDirectoryCreatingTaskExecuter.java:51)
at org.gradle.api.internal.tasks.execution.SkipCachedTaskExecuter.execute(SkipCachedTaskExecuter.java:105)
at org.gradle.api.internal.tasks.execution.SkipUpToDateTaskExecuter.execute(SkipUpToDateTaskExecuter.java:59)
at org.gradle.api.internal.tasks.execution.ResolveTaskOutputCachingStateExecuter.execute(ResolveTaskOutputCachingStateExecuter.java:54)
at org.gradle.api.internal.tasks.execution.ResolveBuildCacheKeyExecuter.execute(ResolveBuildCacheKeyExecuter.java:66)
at org.gradle.api.internal.tasks.execution.ValidatingTaskExecuter.execute(ValidatingTaskExecuter.java:59)
at org.gradle.api.internal.tasks.execution.SkipEmptySourceFilesTaskExecuter.execute(SkipEmptySourceFilesTaskExecuter.java:101)
at org.gradle.api.internal.tasks.execution.FinalizeInputFilePropertiesTaskExecuter.execute(FinalizeInputFilePropertiesTaskExecuter.java:44)
at org.gradle.api.internal.tasks.execution.CleanupStaleOutputsExecuter.execute(CleanupStaleOutputsExecuter.java:91)
at org.gradle.api.internal.tasks.execution.ResolveTaskArtifactStateTaskExecuter.execute(ResolveTaskArtifactStateTaskExecuter.java:62)
at org.gradle.api.internal.tasks.execution.SkipTaskWithNoActionsExecuter.execute(SkipTaskWithNoActionsExecuter.java:59)
at org.gradle.api.internal.tasks.execution.SkipOnlyIfTaskExecuter.execute(SkipOnlyIfTaskExecuter.java:54)
at org.gradle.api.internal.tasks.execution.ExecuteAtMostOnceTaskExecuter.execute(ExecuteAtMostOnceTaskExecuter.java:43)
at org.gradle.api.internal.tasks.execution.CatchExceptionTaskExecuter.execute(CatchExceptionTaskExecuter.java:34)
at org.gradle.execution.taskgraph.DefaultTaskGraphExecuter$EventFiringTaskWorker$1.run(DefaultTaskGraphExecuter.java:256)
at org.gradle.internal.operations.DefaultBuildOperationExecutor$RunnableBuildOperationWorker.execute(DefaultBuildOperationExecutor.java:317)
at org.gradle.internal.operations.DefaultBuildOperationExecutor$RunnableBuildOperationWorker.execute(DefaultBuildOperationExecutor.java:309)
at org.gradle.internal.operations.DefaultBuildOperationExecutor.execute(DefaultBuildOperationExecutor.java:185)
at org.gradle.internal.operations.DefaultBuildOperationExecutor.run(DefaultBuildOperationExecutor.java:97)
at org.gradle.internal.operations.DelegatingBuildOperationExecutor.run(DelegatingBuildOperationExecutor.java:31)
at org.gradle.execution.taskgraph.DefaultTaskGraphExecuter$EventFiringTaskWorker.execute(DefaultTaskGraphExecuter.java:249)
at org.gradle.execution.taskgraph.DefaultTaskGraphExecuter$EventFiringTaskWorker.execute(DefaultTaskGraphExecuter.java:238)
at org.gradle.execution.taskgraph.DefaultTaskPlanExecutor$TaskExecutorWorker$1.execute(DefaultTaskPlanExecutor.java:104)
at org.gradle.execution.taskgraph.DefaultTaskPlanExecutor$TaskExecutorWorker$1.execute(DefaultTaskPlanExecutor.java:98)
at org.gradle.execution.taskgraph.DefaultTaskExecutionPlan.execute(DefaultTaskExecutionPlan.java:663)
at org.gradle.execution.taskgraph.DefaultTaskExecutionPlan.executeWithTask(DefaultTaskExecutionPlan.java:596)
at org.gradle.execution.taskgraph.DefaultTaskPlanExecutor$TaskExecutorWorker.run(DefaultTaskPlanExecutor.java:98)
at org.gradle.internal.concurrent.ExecutorPolicy$CatchAndRecordFailures.onExecute(ExecutorPolicy.java:63)
at org.gradle.internal.concurrent.ManagedExecutorImpl$1.run(ManagedExecutorImpl.java:46)
at org.gradle.internal.concurrent.ThreadFactoryImpl$ManagedThreadRunnable.run(ThreadFactoryImpl.java:55)
Caused by: org.gradle.api.GradleException: There were failing tests. See the report at: file://<https://builds.apache.org/job/beam_PerformanceTests_MongoDBIO_IT/ws/src/sdks/java/io/mongodb/build/reports/tests/integrationTest/index.html>
at org.gradle.api.tasks.testing.AbstractTestTask.handleTestFailures(AbstractTestTask.java:612)
at org.gradle.api.tasks.testing.AbstractTestTask.executeTests(AbstractTestTask.java:484)
at org.gradle.api.tasks.testing.Test.executeTests(Test.java:583)
at org.gradle.internal.reflect.JavaMethod.invoke(JavaMethod.java:73)
at org.gradle.api.internal.project.taskfactory.StandardTaskAction.doExecute(StandardTaskAction.java:46)
at org.gradle.api.internal.project.taskfactory.StandardTaskAction.execute(StandardTaskAction.java:39)
at org.gradle.api.internal.project.taskfactory.StandardTaskAction.execute(StandardTaskAction.java:26)
at org.gradle.api.internal.AbstractTask$TaskActionWrapper.execute(AbstractTask.java:794)
at org.gradle.api.internal.AbstractTask$TaskActionWrapper.execute(AbstractTask.java:761)
at org.gradle.api.internal.tasks.execution.ExecuteActionsTaskExecuter$1.run(ExecuteActionsTaskExecuter.java:124)
at org.gradle.internal.operations.DefaultBuildOperationExecutor$RunnableBuildOperationWorker.execute(DefaultBuildOperationExecutor.java:317)
at org.gradle.internal.operations.DefaultBuildOperationExecutor$RunnableBuildOperationWorker.execute(DefaultBuildOperationExecutor.java:309)
at org.gradle.internal.operations.DefaultBuildOperationExecutor.execute(DefaultBuildOperationExecutor.java:185)
at org.gradle.internal.operations.DefaultBuildOperationExecutor.run(DefaultBuildOperationExecutor.java:97)
at org.gradle.internal.operations.DelegatingBuildOperationExecutor.run(DelegatingBuildOperationExecutor.java:31)
at org.gradle.api.internal.tasks.execution.ExecuteActionsTaskExecuter.executeAction(ExecuteActionsTaskExecuter.java:113)
at org.gradle.api.internal.tasks.execution.ExecuteActionsTaskExecuter.executeActions(ExecuteActionsTaskExecuter.java:95)
... 31 more
* Get more help at https://help.gradle.org
2018-06-04 06:15:41,566 f1735208 MainThread beam_integration_benchmark(1/1) ERROR Error during benchmark beam_integration_benchmark
Traceback (most recent call last):
File "<https://builds.apache.org/job/beam_PerformanceTests_MongoDBIO_IT/ws/PerfKitBenchmarker/perfkitbenchmarker/pkb.py",> line 667, in RunBenchmark
DoRunPhase(spec, collector, detailed_timer)
File "<https://builds.apache.org/job/beam_PerformanceTests_MongoDBIO_IT/ws/PerfKitBenchmarker/perfkitbenchmarker/pkb.py",> line 547, in DoRunPhase
samples = spec.BenchmarkRun(spec)
File "<https://builds.apache.org/job/beam_PerformanceTests_MongoDBIO_IT/ws/PerfKitBenchmarker/perfkitbenchmarker/linux_benchmarks/beam_integration_benchmark.py",> line 159, in Run
job_type=job_type)
File "<https://builds.apache.org/job/beam_PerformanceTests_MongoDBIO_IT/ws/PerfKitBenchmarker/perfkitbenchmarker/providers/gcp/gcp_dpb_dataflow.py",> line 90, in SubmitJob
assert retcode == 0, "Integration Test Failed."
AssertionError: Integration Test Failed.
2018-06-04 06:15:41,567 f1735208 MainThread beam_integration_benchmark(1/1) INFO Cleaning up benchmark beam_integration_benchmark
2018-06-04 06:15:41,567 f1735208 MainThread beam_integration_benchmark(1/1) INFO Running: kubectl --kubeconfig=<https://builds.apache.org/job/beam_PerformanceTests_MongoDBIO_IT/ws/config-mongodbioit-257> delete -f <https://builds.apache.org/job/beam_PerformanceTests_MongoDBIO_IT/ws/src/.test-infra/kubernetes/mongodb/load-balancer/mongo.yml> --ignore-not-found
2018-06-04 06:15:42,263 f1735208 MainThread beam_integration_benchmark(1/1) ERROR Exception running benchmark
Traceback (most recent call last):
File "<https://builds.apache.org/job/beam_PerformanceTests_MongoDBIO_IT/ws/PerfKitBenchmarker/perfkitbenchmarker/pkb.py",> line 801, in RunBenchmarkTask
RunBenchmark(spec, collector)
File "<https://builds.apache.org/job/beam_PerformanceTests_MongoDBIO_IT/ws/PerfKitBenchmarker/perfkitbenchmarker/pkb.py",> line 667, in RunBenchmark
DoRunPhase(spec, collector, detailed_timer)
File "<https://builds.apache.org/job/beam_PerformanceTests_MongoDBIO_IT/ws/PerfKitBenchmarker/perfkitbenchmarker/pkb.py",> line 547, in DoRunPhase
samples = spec.BenchmarkRun(spec)
File "<https://builds.apache.org/job/beam_PerformanceTests_MongoDBIO_IT/ws/PerfKitBenchmarker/perfkitbenchmarker/linux_benchmarks/beam_integration_benchmark.py",> line 159, in Run
job_type=job_type)
File "<https://builds.apache.org/job/beam_PerformanceTests_MongoDBIO_IT/ws/PerfKitBenchmarker/perfkitbenchmarker/providers/gcp/gcp_dpb_dataflow.py",> line 90, in SubmitJob
assert retcode == 0, "Integration Test Failed."
AssertionError: Integration Test Failed.
2018-06-04 06:15:42,263 f1735208 MainThread beam_integration_benchmark(1/1) ERROR Benchmark 1/1 beam_integration_benchmark (UID: beam_integration_benchmark0) failed. Execution will continue.
2018-06-04 06:15:42,297 f1735208 MainThread INFO Benchmark run statuses:
---------------------------------------------------------------------------------
Name UID Status Failed Substatus
---------------------------------------------------------------------------------
beam_integration_benchmark beam_integration_benchmark0 FAILED
---------------------------------------------------------------------------------
Success rate: 0.00% (0/1)
2018-06-04 06:15:42,298 f1735208 MainThread INFO Complete logs can be found at: <https://builds.apache.org/job/beam_PerformanceTests_MongoDBIO_IT/ws/runs/f1735208/pkb.log>
2018-06-04 06:15:42,298 f1735208 MainThread INFO Completion statuses can be found at: <https://builds.apache.org/job/beam_PerformanceTests_MongoDBIO_IT/ws/runs/f1735208/completion_statuses.json>
Build step 'Execute shell' marked build as failure
Build failed in Jenkins: beam_PerformanceTests_MongoDBIO_IT #256
Posted by Apache Jenkins Server <je...@builds.apache.org>.
See <https://builds.apache.org/job/beam_PerformanceTests_MongoDBIO_IT/256/display/redirect>
------------------------------------------
[...truncated 194.68 KB...]
at com.mongodb.connection.DefaultConnectionPool$PooledConnection.receiveMessage(DefaultConnectionPool.java:435)
at com.mongodb.connection.WriteCommandProtocol.receiveMessage(WriteCommandProtocol.java:234)
at com.mongodb.connection.WriteCommandProtocol.execute(WriteCommandProtocol.java:104)
at com.mongodb.connection.InsertCommandProtocol.execute(InsertCommandProtocol.java:67)
at com.mongodb.connection.InsertCommandProtocol.execute(InsertCommandProtocol.java:37)
at com.mongodb.connection.DefaultServer$DefaultServerProtocolExecutor.execute(DefaultServer.java:159)
at com.mongodb.connection.DefaultServerConnection.executeProtocol(DefaultServerConnection.java:286)
at com.mongodb.connection.DefaultServerConnection.insertCommand(DefaultServerConnection.java:115)
at com.mongodb.operation.MixedBulkWriteOperation$Run$2.executeWriteCommandProtocol(MixedBulkWriteOperation.java:455)
at com.mongodb.operation.MixedBulkWriteOperation$Run$RunExecutor.execute(MixedBulkWriteOperation.java:646)
at com.mongodb.operation.MixedBulkWriteOperation$Run.execute(MixedBulkWriteOperation.java:401)
at com.mongodb.operation.MixedBulkWriteOperation$1.call(MixedBulkWriteOperation.java:179)
at com.mongodb.operation.MixedBulkWriteOperation$1.call(MixedBulkWriteOperation.java:168)
at com.mongodb.operation.OperationHelper.withConnectionSource(OperationHelper.java:230)
at com.mongodb.operation.OperationHelper.withConnection(OperationHelper.java:221)
at com.mongodb.operation.MixedBulkWriteOperation.execute(MixedBulkWriteOperation.java:168)
at com.mongodb.operation.MixedBulkWriteOperation.execute(MixedBulkWriteOperation.java:74)
at com.mongodb.Mongo.execute(Mongo.java:781)
at com.mongodb.Mongo$2.execute(Mongo.java:764)
at com.mongodb.MongoCollectionImpl.insertMany(MongoCollectionImpl.java:323)
at com.mongodb.MongoCollectionImpl.insertMany(MongoCollectionImpl.java:311)
at org.apache.beam.sdk.io.mongodb.MongoDbIO$Write$WriteFn.flush(MongoDbIO.java:667)
at org.apache.beam.sdk.io.mongodb.MongoDbIO$Write$WriteFn.processElement(MongoDbIO.java:652)
com.mongodb.MongoTimeoutException: Timed out after 30000 ms while waiting for a server that matches WritableServerSelector. Client view of cluster state is {type=UNKNOWN, servers=[{address=104.154.153.52:27017, type=UNKNOWN, state=CONNECTING, exception={com.mongodb.MongoSocketOpenException: Exception opening socket}, caused by {java.net.SocketTimeoutException: connect timed out}}]
at com.mongodb.connection.BaseCluster.createTimeoutException(BaseCluster.java:369)
at com.mongodb.connection.BaseCluster.selectServer(BaseCluster.java:101)
at com.mongodb.binding.ClusterBinding$ClusterBindingConnectionSource.<init>(ClusterBinding.java:75)
at com.mongodb.binding.ClusterBinding$ClusterBindingConnectionSource.<init>(ClusterBinding.java:71)
at com.mongodb.binding.ClusterBinding.getWriteConnectionSource(ClusterBinding.java:68)
at com.mongodb.operation.OperationHelper.withConnection(OperationHelper.java:219)
at com.mongodb.operation.MixedBulkWriteOperation.execute(MixedBulkWriteOperation.java:168)
at com.mongodb.operation.MixedBulkWriteOperation.execute(MixedBulkWriteOperation.java:74)
at com.mongodb.Mongo.execute(Mongo.java:781)
at com.mongodb.Mongo$2.execute(Mongo.java:764)
at com.mongodb.MongoCollectionImpl.insertMany(MongoCollectionImpl.java:323)
at com.mongodb.MongoCollectionImpl.insertMany(MongoCollectionImpl.java:311)
at org.apache.beam.sdk.io.mongodb.MongoDbIO$Write$WriteFn.flush(MongoDbIO.java:667)
at org.apache.beam.sdk.io.mongodb.MongoDbIO$Write$WriteFn.processElement(MongoDbIO.java:652)
com.mongodb.MongoTimeoutException: Timed out after 30000 ms while waiting for a server that matches WritableServerSelector. Client view of cluster state is {type=UNKNOWN, servers=[{address=104.154.153.52:27017, type=UNKNOWN, state=CONNECTING, exception={com.mongodb.MongoSocketOpenException: Exception opening socket}, caused by {java.net.SocketTimeoutException: connect timed out}}]
at com.mongodb.connection.BaseCluster.createTimeoutException(BaseCluster.java:369)
at com.mongodb.connection.BaseCluster.selectServer(BaseCluster.java:101)
at com.mongodb.binding.ClusterBinding$ClusterBindingConnectionSource.<init>(ClusterBinding.java:75)
at com.mongodb.binding.ClusterBinding$ClusterBindingConnectionSource.<init>(ClusterBinding.java:71)
at com.mongodb.binding.ClusterBinding.getWriteConnectionSource(ClusterBinding.java:68)
at com.mongodb.operation.OperationHelper.withConnection(OperationHelper.java:219)
at com.mongodb.operation.MixedBulkWriteOperation.execute(MixedBulkWriteOperation.java:168)
at com.mongodb.operation.MixedBulkWriteOperation.execute(MixedBulkWriteOperation.java:74)
at com.mongodb.Mongo.execute(Mongo.java:781)
at com.mongodb.Mongo$2.execute(Mongo.java:764)
at com.mongodb.MongoCollectionImpl.insertMany(MongoCollectionImpl.java:323)
at com.mongodb.MongoCollectionImpl.insertMany(MongoCollectionImpl.java:311)
at org.apache.beam.sdk.io.mongodb.MongoDbIO$Write$WriteFn.flush(MongoDbIO.java:667)
at org.apache.beam.sdk.io.mongodb.MongoDbIO$Write$WriteFn.processElement(MongoDbIO.java:652)
com.mongodb.MongoTimeoutException: Timed out after 30000 ms while waiting for a server that matches WritableServerSelector. Client view of cluster state is {type=UNKNOWN, servers=[{address=104.154.153.52:27017, type=UNKNOWN, state=CONNECTING, exception={com.mongodb.MongoSocketOpenException: Exception opening socket}, caused by {java.net.SocketTimeoutException: connect timed out}}]
at com.mongodb.connection.BaseCluster.createTimeoutException(BaseCluster.java:369)
at com.mongodb.connection.BaseCluster.selectServer(BaseCluster.java:101)
at com.mongodb.binding.ClusterBinding$ClusterBindingConnectionSource.<init>(ClusterBinding.java:75)
at com.mongodb.binding.ClusterBinding$ClusterBindingConnectionSource.<init>(ClusterBinding.java:71)
at com.mongodb.binding.ClusterBinding.getWriteConnectionSource(ClusterBinding.java:68)
at com.mongodb.operation.OperationHelper.withConnection(OperationHelper.java:219)
at com.mongodb.operation.MixedBulkWriteOperation.execute(MixedBulkWriteOperation.java:168)
at com.mongodb.operation.MixedBulkWriteOperation.execute(MixedBulkWriteOperation.java:74)
at com.mongodb.Mongo.execute(Mongo.java:781)
at com.mongodb.Mongo$2.execute(Mongo.java:764)
at com.mongodb.MongoCollectionImpl.insertMany(MongoCollectionImpl.java:323)
at com.mongodb.MongoCollectionImpl.insertMany(MongoCollectionImpl.java:311)
at org.apache.beam.sdk.io.mongodb.MongoDbIO$Write$WriteFn.flush(MongoDbIO.java:667)
at org.apache.beam.sdk.io.mongodb.MongoDbIO$Write$WriteFn.processElement(MongoDbIO.java:652)
com.mongodb.MongoTimeoutException: Timed out after 30000 ms while waiting for a server that matches WritableServerSelector. Client view of cluster state is {type=UNKNOWN, servers=[{address=104.154.153.52:27017, type=UNKNOWN, state=CONNECTING, exception={com.mongodb.MongoSocketOpenException: Exception opening socket}, caused by {java.net.SocketTimeoutException: connect timed out}}]
at com.mongodb.connection.BaseCluster.createTimeoutException(BaseCluster.java:369)
at com.mongodb.connection.BaseCluster.selectServer(BaseCluster.java:101)
at com.mongodb.binding.ClusterBinding$ClusterBindingConnectionSource.<init>(ClusterBinding.java:75)
at com.mongodb.binding.ClusterBinding$ClusterBindingConnectionSource.<init>(ClusterBinding.java:71)
at com.mongodb.binding.ClusterBinding.getWriteConnectionSource(ClusterBinding.java:68)
at com.mongodb.operation.OperationHelper.withConnection(OperationHelper.java:219)
at com.mongodb.operation.MixedBulkWriteOperation.execute(MixedBulkWriteOperation.java:168)
at com.mongodb.operation.MixedBulkWriteOperation.execute(MixedBulkWriteOperation.java:74)
at com.mongodb.Mongo.execute(Mongo.java:781)
at com.mongodb.Mongo$2.execute(Mongo.java:764)
at com.mongodb.MongoCollectionImpl.insertMany(MongoCollectionImpl.java:323)
at com.mongodb.MongoCollectionImpl.insertMany(MongoCollectionImpl.java:311)
at org.apache.beam.sdk.io.mongodb.MongoDbIO$Write$WriteFn.flush(MongoDbIO.java:667)
at org.apache.beam.sdk.io.mongodb.MongoDbIO$Write$WriteFn.processElement(MongoDbIO.java:652)
com.mongodb.MongoTimeoutException: Timed out after 30000 ms while waiting for a server that matches WritableServerSelector. Client view of cluster state is {type=UNKNOWN, servers=[{address=104.154.153.52:27017, type=UNKNOWN, state=CONNECTING, exception={com.mongodb.MongoSocketOpenException: Exception opening socket}, caused by {java.net.SocketTimeoutException: connect timed out}}]
at com.mongodb.connection.BaseCluster.createTimeoutException(BaseCluster.java:369)
at com.mongodb.connection.BaseCluster.selectServer(BaseCluster.java:101)
at com.mongodb.binding.ClusterBinding$ClusterBindingConnectionSource.<init>(ClusterBinding.java:75)
at com.mongodb.binding.ClusterBinding$ClusterBindingConnectionSource.<init>(ClusterBinding.java:71)
at com.mongodb.binding.ClusterBinding.getWriteConnectionSource(ClusterBinding.java:68)
at com.mongodb.operation.OperationHelper.withConnection(OperationHelper.java:219)
at com.mongodb.operation.MixedBulkWriteOperation.execute(MixedBulkWriteOperation.java:168)
at com.mongodb.operation.MixedBulkWriteOperation.execute(MixedBulkWriteOperation.java:74)
at com.mongodb.Mongo.execute(Mongo.java:781)
at com.mongodb.Mongo$2.execute(Mongo.java:764)
at com.mongodb.MongoCollectionImpl.insertMany(MongoCollectionImpl.java:323)
at com.mongodb.MongoCollectionImpl.insertMany(MongoCollectionImpl.java:311)
at org.apache.beam.sdk.io.mongodb.MongoDbIO$Write$WriteFn.flush(MongoDbIO.java:667)
at org.apache.beam.sdk.io.mongodb.MongoDbIO$Write$WriteFn.processElement(MongoDbIO.java:652)
Workflow failed. Causes: S01:Generate sequence/Read(BoundedCountingSource)+Produce documents/Map+Write documents to MongoDB/ParDo(Write) failed., A work item was attempted 4 times without success. Each time the worker eventually lost contact with the service. The work item was attempted on:
mongodbioit0testwriteandr-06031704-d661-harness-xswk,
mongodbioit0testwriteandr-06031704-d661-harness-xswk,
mongodbioit0testwriteandr-06031704-d661-harness-xswk,
mongodbioit0testwriteandr-06031704-d661-harness-xswk
at org.apache.beam.runners.dataflow.TestDataflowRunner.run(TestDataflowRunner.java:134)
at org.apache.beam.runners.dataflow.TestDataflowRunner.run(TestDataflowRunner.java:90)
at org.apache.beam.runners.dataflow.TestDataflowRunner.run(TestDataflowRunner.java:55)
at org.apache.beam.sdk.Pipeline.run(Pipeline.java:311)
at org.apache.beam.sdk.testing.TestPipeline.run(TestPipeline.java:348)
at org.apache.beam.sdk.testing.TestPipeline.run(TestPipeline.java:329)
at org.apache.beam.sdk.io.mongodb.MongoDBIOIT.testWriteAndRead(MongoDBIOIT.java:118)
com.mongodb.MongoTimeoutException: Timed out after 30000 ms while waiting for a server that matches WritableServerSelector. Client view of cluster state is {type=UNKNOWN, servers=[{address=104.154.153.52:27017, type=UNKNOWN, state=CONNECTING, exception={com.mongodb.MongoSocketOpenException: Exception opening socket}, caused by {java.net.SocketTimeoutException: connect timed out}}]
at com.mongodb.connection.BaseCluster.createTimeoutException(BaseCluster.java:369)
at com.mongodb.connection.BaseCluster.selectServer(BaseCluster.java:101)
at com.mongodb.binding.ClusterBinding$ClusterBindingConnectionSource.<init>(ClusterBinding.java:75)
at com.mongodb.binding.ClusterBinding$ClusterBindingConnectionSource.<init>(ClusterBinding.java:71)
at com.mongodb.binding.ClusterBinding.getWriteConnectionSource(ClusterBinding.java:68)
at com.mongodb.operation.CommandOperationHelper.executeWrappedCommandProtocol(CommandOperationHelper.java:158)
at com.mongodb.operation.CommandOperationHelper.executeWrappedCommandProtocol(CommandOperationHelper.java:133)
at com.mongodb.operation.CommandOperationHelper.executeWrappedCommandProtocol(CommandOperationHelper.java:128)
at com.mongodb.operation.DropDatabaseOperation.execute(DropDatabaseOperation.java:51)
at com.mongodb.operation.DropDatabaseOperation.execute(DropDatabaseOperation.java:36)
at com.mongodb.Mongo.execute(Mongo.java:781)
at com.mongodb.Mongo$2.execute(Mongo.java:764)
at com.mongodb.MongoDatabaseImpl.drop(MongoDatabaseImpl.java:136)
at org.apache.beam.sdk.io.mongodb.MongoDBIOIT.tearDown(MongoDBIOIT.java:103)
1 test completed, 1 failed
Finished generating test XML results (0.022 secs) into: <https://builds.apache.org/job/beam_PerformanceTests_MongoDBIO_IT/ws/src/sdks/java/io/mongodb/build/test-results/integrationTest>
Generating HTML test report...
Finished generating test html results (0.032 secs) into: <https://builds.apache.org/job/beam_PerformanceTests_MongoDBIO_IT/ws/src/sdks/java/io/mongodb/build/reports/tests/integrationTest>
> Task :beam-sdks-java-io-mongodb:integrationTest FAILED
:beam-sdks-java-io-mongodb:integrationTest (Thread[Task worker for ':' Thread 10,5,main]) completed. Took 10 mins 1.393 secs.
Deprecated Gradle features were used in this build, making it incompatible with Gradle 5.0.
See https://docs.gradle.org/4.7/userguide/command_line_interface.html#sec:command_line_warnings
BUILD FAILED in 10m 11s
62 actionable tasks: 1 executed, 61 up-to-date
Publishing build scan...
https://gradle.com/s/znb45xcnt2en2
STDERR:
FAILURE: Build failed with an exception.
* What went wrong:
Execution failed for task ':beam-sdks-java-io-mongodb:integrationTest'.
> There were failing tests. See the report at: file://<https://builds.apache.org/job/beam_PerformanceTests_MongoDBIO_IT/ws/src/sdks/java/io/mongodb/build/reports/tests/integrationTest/index.html>
* Try:
Run with --debug option to get more log output. Run with --scan to get full insights.
* Exception is:
org.gradle.api.tasks.TaskExecutionException: Execution failed for task ':beam-sdks-java-io-mongodb:integrationTest'.
at org.gradle.api.internal.tasks.execution.ExecuteActionsTaskExecuter.executeActions(ExecuteActionsTaskExecuter.java:103)
at org.gradle.api.internal.tasks.execution.ExecuteActionsTaskExecuter.execute(ExecuteActionsTaskExecuter.java:73)
at org.gradle.api.internal.tasks.execution.OutputDirectoryCreatingTaskExecuter.execute(OutputDirectoryCreatingTaskExecuter.java:51)
at org.gradle.api.internal.tasks.execution.SkipCachedTaskExecuter.execute(SkipCachedTaskExecuter.java:105)
at org.gradle.api.internal.tasks.execution.SkipUpToDateTaskExecuter.execute(SkipUpToDateTaskExecuter.java:59)
at org.gradle.api.internal.tasks.execution.ResolveTaskOutputCachingStateExecuter.execute(ResolveTaskOutputCachingStateExecuter.java:54)
at org.gradle.api.internal.tasks.execution.ResolveBuildCacheKeyExecuter.execute(ResolveBuildCacheKeyExecuter.java:66)
at org.gradle.api.internal.tasks.execution.ValidatingTaskExecuter.execute(ValidatingTaskExecuter.java:59)
at org.gradle.api.internal.tasks.execution.SkipEmptySourceFilesTaskExecuter.execute(SkipEmptySourceFilesTaskExecuter.java:101)
at org.gradle.api.internal.tasks.execution.FinalizeInputFilePropertiesTaskExecuter.execute(FinalizeInputFilePropertiesTaskExecuter.java:44)
at org.gradle.api.internal.tasks.execution.CleanupStaleOutputsExecuter.execute(CleanupStaleOutputsExecuter.java:91)
at org.gradle.api.internal.tasks.execution.ResolveTaskArtifactStateTaskExecuter.execute(ResolveTaskArtifactStateTaskExecuter.java:62)
at org.gradle.api.internal.tasks.execution.SkipTaskWithNoActionsExecuter.execute(SkipTaskWithNoActionsExecuter.java:59)
at org.gradle.api.internal.tasks.execution.SkipOnlyIfTaskExecuter.execute(SkipOnlyIfTaskExecuter.java:54)
at org.gradle.api.internal.tasks.execution.ExecuteAtMostOnceTaskExecuter.execute(ExecuteAtMostOnceTaskExecuter.java:43)
at org.gradle.api.internal.tasks.execution.CatchExceptionTaskExecuter.execute(CatchExceptionTaskExecuter.java:34)
at org.gradle.execution.taskgraph.DefaultTaskGraphExecuter$EventFiringTaskWorker$1.run(DefaultTaskGraphExecuter.java:256)
at org.gradle.internal.operations.DefaultBuildOperationExecutor$RunnableBuildOperationWorker.execute(DefaultBuildOperationExecutor.java:317)
at org.gradle.internal.operations.DefaultBuildOperationExecutor$RunnableBuildOperationWorker.execute(DefaultBuildOperationExecutor.java:309)
at org.gradle.internal.operations.DefaultBuildOperationExecutor.execute(DefaultBuildOperationExecutor.java:185)
at org.gradle.internal.operations.DefaultBuildOperationExecutor.run(DefaultBuildOperationExecutor.java:97)
at org.gradle.internal.operations.DelegatingBuildOperationExecutor.run(DelegatingBuildOperationExecutor.java:31)
at org.gradle.execution.taskgraph.DefaultTaskGraphExecuter$EventFiringTaskWorker.execute(DefaultTaskGraphExecuter.java:249)
at org.gradle.execution.taskgraph.DefaultTaskGraphExecuter$EventFiringTaskWorker.execute(DefaultTaskGraphExecuter.java:238)
at org.gradle.execution.taskgraph.DefaultTaskPlanExecutor$TaskExecutorWorker$1.execute(DefaultTaskPlanExecutor.java:104)
at org.gradle.execution.taskgraph.DefaultTaskPlanExecutor$TaskExecutorWorker$1.execute(DefaultTaskPlanExecutor.java:98)
at org.gradle.execution.taskgraph.DefaultTaskExecutionPlan.execute(DefaultTaskExecutionPlan.java:663)
at org.gradle.execution.taskgraph.DefaultTaskExecutionPlan.executeWithTask(DefaultTaskExecutionPlan.java:596)
at org.gradle.execution.taskgraph.DefaultTaskPlanExecutor$TaskExecutorWorker.run(DefaultTaskPlanExecutor.java:98)
at org.gradle.internal.concurrent.ExecutorPolicy$CatchAndRecordFailures.onExecute(ExecutorPolicy.java:63)
at org.gradle.internal.concurrent.ManagedExecutorImpl$1.run(ManagedExecutorImpl.java:46)
at org.gradle.internal.concurrent.ThreadFactoryImpl$ManagedThreadRunnable.run(ThreadFactoryImpl.java:55)
Caused by: org.gradle.api.GradleException: There were failing tests. See the report at: file://<https://builds.apache.org/job/beam_PerformanceTests_MongoDBIO_IT/ws/src/sdks/java/io/mongodb/build/reports/tests/integrationTest/index.html>
at org.gradle.api.tasks.testing.AbstractTestTask.handleTestFailures(AbstractTestTask.java:612)
at org.gradle.api.tasks.testing.AbstractTestTask.executeTests(AbstractTestTask.java:484)
at org.gradle.api.tasks.testing.Test.executeTests(Test.java:583)
at org.gradle.internal.reflect.JavaMethod.invoke(JavaMethod.java:73)
at org.gradle.api.internal.project.taskfactory.StandardTaskAction.doExecute(StandardTaskAction.java:46)
at org.gradle.api.internal.project.taskfactory.StandardTaskAction.execute(StandardTaskAction.java:39)
at org.gradle.api.internal.project.taskfactory.StandardTaskAction.execute(StandardTaskAction.java:26)
at org.gradle.api.internal.AbstractTask$TaskActionWrapper.execute(AbstractTask.java:794)
at org.gradle.api.internal.AbstractTask$TaskActionWrapper.execute(AbstractTask.java:761)
at org.gradle.api.internal.tasks.execution.ExecuteActionsTaskExecuter$1.run(ExecuteActionsTaskExecuter.java:124)
at org.gradle.internal.operations.DefaultBuildOperationExecutor$RunnableBuildOperationWorker.execute(DefaultBuildOperationExecutor.java:317)
at org.gradle.internal.operations.DefaultBuildOperationExecutor$RunnableBuildOperationWorker.execute(DefaultBuildOperationExecutor.java:309)
at org.gradle.internal.operations.DefaultBuildOperationExecutor.execute(DefaultBuildOperationExecutor.java:185)
at org.gradle.internal.operations.DefaultBuildOperationExecutor.run(DefaultBuildOperationExecutor.java:97)
at org.gradle.internal.operations.DelegatingBuildOperationExecutor.run(DelegatingBuildOperationExecutor.java:31)
at org.gradle.api.internal.tasks.execution.ExecuteActionsTaskExecuter.executeAction(ExecuteActionsTaskExecuter.java:113)
at org.gradle.api.internal.tasks.execution.ExecuteActionsTaskExecuter.executeActions(ExecuteActionsTaskExecuter.java:95)
... 31 more
* Get more help at https://help.gradle.org
2018-06-04 00:14:35,974 ed8332ea MainThread beam_integration_benchmark(1/1) ERROR Error during benchmark beam_integration_benchmark
Traceback (most recent call last):
File "<https://builds.apache.org/job/beam_PerformanceTests_MongoDBIO_IT/ws/PerfKitBenchmarker/perfkitbenchmarker/pkb.py",> line 667, in RunBenchmark
DoRunPhase(spec, collector, detailed_timer)
File "<https://builds.apache.org/job/beam_PerformanceTests_MongoDBIO_IT/ws/PerfKitBenchmarker/perfkitbenchmarker/pkb.py",> line 547, in DoRunPhase
samples = spec.BenchmarkRun(spec)
File "<https://builds.apache.org/job/beam_PerformanceTests_MongoDBIO_IT/ws/PerfKitBenchmarker/perfkitbenchmarker/linux_benchmarks/beam_integration_benchmark.py",> line 159, in Run
job_type=job_type)
File "<https://builds.apache.org/job/beam_PerformanceTests_MongoDBIO_IT/ws/PerfKitBenchmarker/perfkitbenchmarker/providers/gcp/gcp_dpb_dataflow.py",> line 90, in SubmitJob
assert retcode == 0, "Integration Test Failed."
AssertionError: Integration Test Failed.
2018-06-04 00:14:35,975 ed8332ea MainThread beam_integration_benchmark(1/1) INFO Cleaning up benchmark beam_integration_benchmark
2018-06-04 00:14:35,975 ed8332ea MainThread beam_integration_benchmark(1/1) INFO Running: kubectl --kubeconfig=<https://builds.apache.org/job/beam_PerformanceTests_MongoDBIO_IT/ws/config-mongodbioit-256> delete -f <https://builds.apache.org/job/beam_PerformanceTests_MongoDBIO_IT/ws/src/.test-infra/kubernetes/mongodb/load-balancer/mongo.yml> --ignore-not-found
2018-06-04 00:14:36,698 ed8332ea MainThread beam_integration_benchmark(1/1) ERROR Exception running benchmark
Traceback (most recent call last):
File "<https://builds.apache.org/job/beam_PerformanceTests_MongoDBIO_IT/ws/PerfKitBenchmarker/perfkitbenchmarker/pkb.py",> line 801, in RunBenchmarkTask
RunBenchmark(spec, collector)
File "<https://builds.apache.org/job/beam_PerformanceTests_MongoDBIO_IT/ws/PerfKitBenchmarker/perfkitbenchmarker/pkb.py",> line 667, in RunBenchmark
DoRunPhase(spec, collector, detailed_timer)
File "<https://builds.apache.org/job/beam_PerformanceTests_MongoDBIO_IT/ws/PerfKitBenchmarker/perfkitbenchmarker/pkb.py",> line 547, in DoRunPhase
samples = spec.BenchmarkRun(spec)
File "<https://builds.apache.org/job/beam_PerformanceTests_MongoDBIO_IT/ws/PerfKitBenchmarker/perfkitbenchmarker/linux_benchmarks/beam_integration_benchmark.py",> line 159, in Run
job_type=job_type)
File "<https://builds.apache.org/job/beam_PerformanceTests_MongoDBIO_IT/ws/PerfKitBenchmarker/perfkitbenchmarker/providers/gcp/gcp_dpb_dataflow.py",> line 90, in SubmitJob
assert retcode == 0, "Integration Test Failed."
AssertionError: Integration Test Failed.
2018-06-04 00:14:36,699 ed8332ea MainThread beam_integration_benchmark(1/1) ERROR Benchmark 1/1 beam_integration_benchmark (UID: beam_integration_benchmark0) failed. Execution will continue.
2018-06-04 00:14:36,736 ed8332ea MainThread INFO Benchmark run statuses:
---------------------------------------------------------------------------------
Name UID Status Failed Substatus
---------------------------------------------------------------------------------
beam_integration_benchmark beam_integration_benchmark0 FAILED
---------------------------------------------------------------------------------
Success rate: 0.00% (0/1)
2018-06-04 00:14:36,737 ed8332ea MainThread INFO Complete logs can be found at: <https://builds.apache.org/job/beam_PerformanceTests_MongoDBIO_IT/ws/runs/ed8332ea/pkb.log>
2018-06-04 00:14:36,737 ed8332ea MainThread INFO Completion statuses can be found at: <https://builds.apache.org/job/beam_PerformanceTests_MongoDBIO_IT/ws/runs/ed8332ea/completion_statuses.json>
Build step 'Execute shell' marked build as failure
Build failed in Jenkins: beam_PerformanceTests_MongoDBIO_IT #255
Posted by Apache Jenkins Server <je...@builds.apache.org>.
See <https://builds.apache.org/job/beam_PerformanceTests_MongoDBIO_IT/255/display/redirect>
------------------------------------------
[...truncated 242.09 KB...]
at com.google.cloud.dataflow.worker.BatchDataflowWorker.getAndPerformWork(BatchDataflowWorker.java:288)
at com.google.cloud.dataflow.worker.DataflowBatchWorkerHarness$WorkerThread.doWork(DataflowBatchWorkerHarness.java:134)
at com.google.cloud.dataflow.worker.DataflowBatchWorkerHarness$WorkerThread.call(DataflowBatchWorkerHarness.java:114)
at com.google.cloud.dataflow.worker.DataflowBatchWorkerHarness$WorkerThread.call(DataflowBatchWorkerHarness.java:101)
at java.util.concurrent.FutureTask.run(FutureTask.java:266)
at java.util.concurrent.ThreadPoolExecutor.runWorker(ThreadPoolExecutor.java:1142)
at java.util.concurrent.ThreadPoolExecutor$Worker.run(ThreadPoolExecutor.java:617)
at java.lang.Thread.run(Thread.java:745)
com.mongodb.MongoTimeoutException: Timed out after 30000 ms while waiting for a server that matches WritableServerSelector. Client view of cluster state is {type=UNKNOWN, servers=[{address=35.184.44.201:27017, type=UNKNOWN, state=CONNECTING, exception={com.mongodb.MongoSocketOpenException: Exception opening socket}, caused by {java.net.SocketTimeoutException: connect timed out}}]
at com.mongodb.connection.BaseCluster.createTimeoutException(BaseCluster.java:369)
at com.mongodb.connection.BaseCluster.selectServer(BaseCluster.java:101)
at com.mongodb.binding.ClusterBinding$ClusterBindingConnectionSource.<init>(ClusterBinding.java:75)
at com.mongodb.binding.ClusterBinding$ClusterBindingConnectionSource.<init>(ClusterBinding.java:71)
at com.mongodb.binding.ClusterBinding.getWriteConnectionSource(ClusterBinding.java:68)
at com.mongodb.operation.OperationHelper.withConnection(OperationHelper.java:219)
at com.mongodb.operation.MixedBulkWriteOperation.execute(MixedBulkWriteOperation.java:168)
at com.mongodb.operation.MixedBulkWriteOperation.execute(MixedBulkWriteOperation.java:74)
at com.mongodb.Mongo.execute(Mongo.java:781)
at com.mongodb.Mongo$2.execute(Mongo.java:764)
at com.mongodb.MongoCollectionImpl.insertMany(MongoCollectionImpl.java:323)
at com.mongodb.MongoCollectionImpl.insertMany(MongoCollectionImpl.java:311)
at org.apache.beam.sdk.io.mongodb.MongoDbIO$Write$WriteFn.flush(MongoDbIO.java:667)
at org.apache.beam.sdk.io.mongodb.MongoDbIO$Write$WriteFn.processElement(MongoDbIO.java:652)
com.mongodb.MongoTimeoutException: Timed out after 30000 ms while waiting for a server that matches WritableServerSelector. Client view of cluster state is {type=UNKNOWN, servers=[{address=35.184.44.201:27017, type=UNKNOWN, state=CONNECTING, exception={com.mongodb.MongoSocketOpenException: Exception opening socket}, caused by {java.net.SocketTimeoutException: connect timed out}}]
at com.mongodb.connection.BaseCluster.createTimeoutException(BaseCluster.java:369)
at com.mongodb.connection.BaseCluster.selectServer(BaseCluster.java:101)
at com.mongodb.binding.ClusterBinding$ClusterBindingConnectionSource.<init>(ClusterBinding.java:75)
at com.mongodb.binding.ClusterBinding$ClusterBindingConnectionSource.<init>(ClusterBinding.java:71)
at com.mongodb.binding.ClusterBinding.getWriteConnectionSource(ClusterBinding.java:68)
at com.mongodb.operation.OperationHelper.withConnection(OperationHelper.java:219)
at com.mongodb.operation.MixedBulkWriteOperation.execute(MixedBulkWriteOperation.java:168)
at com.mongodb.operation.MixedBulkWriteOperation.execute(MixedBulkWriteOperation.java:74)
at com.mongodb.Mongo.execute(Mongo.java:781)
at com.mongodb.Mongo$2.execute(Mongo.java:764)
at com.mongodb.MongoCollectionImpl.insertMany(MongoCollectionImpl.java:323)
at com.mongodb.MongoCollectionImpl.insertMany(MongoCollectionImpl.java:311)
at org.apache.beam.sdk.io.mongodb.MongoDbIO$Write$WriteFn.flush(MongoDbIO.java:667)
at org.apache.beam.sdk.io.mongodb.MongoDbIO$Write$WriteFn.processElement(MongoDbIO.java:652)
com.mongodb.MongoTimeoutException: Timed out after 30000 ms while waiting for a server that matches WritableServerSelector. Client view of cluster state is {type=UNKNOWN, servers=[{address=35.184.44.201:27017, type=UNKNOWN, state=CONNECTING, exception={com.mongodb.MongoSocketOpenException: Exception opening socket}, caused by {java.net.SocketTimeoutException: connect timed out}}]
at com.mongodb.connection.BaseCluster.createTimeoutException(BaseCluster.java:369)
at com.mongodb.connection.BaseCluster.selectServer(BaseCluster.java:101)
at com.mongodb.binding.ClusterBinding$ClusterBindingConnectionSource.<init>(ClusterBinding.java:75)
at com.mongodb.binding.ClusterBinding$ClusterBindingConnectionSource.<init>(ClusterBinding.java:71)
at com.mongodb.binding.ClusterBinding.getWriteConnectionSource(ClusterBinding.java:68)
at com.mongodb.operation.OperationHelper.withConnection(OperationHelper.java:219)
at com.mongodb.operation.MixedBulkWriteOperation.execute(MixedBulkWriteOperation.java:168)
at com.mongodb.operation.MixedBulkWriteOperation.execute(MixedBulkWriteOperation.java:74)
at com.mongodb.Mongo.execute(Mongo.java:781)
at com.mongodb.Mongo$2.execute(Mongo.java:764)
at com.mongodb.MongoCollectionImpl.insertMany(MongoCollectionImpl.java:323)
at com.mongodb.MongoCollectionImpl.insertMany(MongoCollectionImpl.java:311)
at org.apache.beam.sdk.io.mongodb.MongoDbIO$Write$WriteFn.flush(MongoDbIO.java:667)
at org.apache.beam.sdk.io.mongodb.MongoDbIO$Write$WriteFn.processElement(MongoDbIO.java:652)
com.mongodb.MongoTimeoutException: Timed out after 30000 ms while waiting for a server that matches WritableServerSelector. Client view of cluster state is {type=UNKNOWN, servers=[{address=35.184.44.201:27017, type=UNKNOWN, state=CONNECTING, exception={com.mongodb.MongoSocketOpenException: Exception opening socket}, caused by {java.net.SocketTimeoutException: connect timed out}}]
at com.mongodb.connection.BaseCluster.createTimeoutException(BaseCluster.java:369)
at com.mongodb.connection.BaseCluster.selectServer(BaseCluster.java:101)
at com.mongodb.binding.ClusterBinding$ClusterBindingConnectionSource.<init>(ClusterBinding.java:75)
at com.mongodb.binding.ClusterBinding$ClusterBindingConnectionSource.<init>(ClusterBinding.java:71)
at com.mongodb.binding.ClusterBinding.getWriteConnectionSource(ClusterBinding.java:68)
at com.mongodb.operation.OperationHelper.withConnection(OperationHelper.java:219)
at com.mongodb.operation.MixedBulkWriteOperation.execute(MixedBulkWriteOperation.java:168)
at com.mongodb.operation.MixedBulkWriteOperation.execute(MixedBulkWriteOperation.java:74)
at com.mongodb.Mongo.execute(Mongo.java:781)
at com.mongodb.Mongo$2.execute(Mongo.java:764)
at com.mongodb.MongoCollectionImpl.insertMany(MongoCollectionImpl.java:323)
at com.mongodb.MongoCollectionImpl.insertMany(MongoCollectionImpl.java:311)
at org.apache.beam.sdk.io.mongodb.MongoDbIO$Write$WriteFn.flush(MongoDbIO.java:667)
at org.apache.beam.sdk.io.mongodb.MongoDbIO$Write$WriteFn.processElement(MongoDbIO.java:652)
com.mongodb.MongoTimeoutException: Timed out after 30000 ms while waiting for a server that matches WritableServerSelector. Client view of cluster state is {type=UNKNOWN, servers=[{address=35.184.44.201:27017, type=UNKNOWN, state=CONNECTING, exception={com.mongodb.MongoSocketOpenException: Exception opening socket}, caused by {java.net.SocketTimeoutException: connect timed out}}]
at com.mongodb.connection.BaseCluster.createTimeoutException(BaseCluster.java:369)
at com.mongodb.connection.BaseCluster.selectServer(BaseCluster.java:101)
at com.mongodb.binding.ClusterBinding$ClusterBindingConnectionSource.<init>(ClusterBinding.java:75)
at com.mongodb.binding.ClusterBinding$ClusterBindingConnectionSource.<init>(ClusterBinding.java:71)
at com.mongodb.binding.ClusterBinding.getWriteConnectionSource(ClusterBinding.java:68)
at com.mongodb.operation.OperationHelper.withConnection(OperationHelper.java:219)
at com.mongodb.operation.MixedBulkWriteOperation.execute(MixedBulkWriteOperation.java:168)
at com.mongodb.operation.MixedBulkWriteOperation.execute(MixedBulkWriteOperation.java:74)
at com.mongodb.Mongo.execute(Mongo.java:781)
at com.mongodb.Mongo$2.execute(Mongo.java:764)
at com.mongodb.MongoCollectionImpl.insertMany(MongoCollectionImpl.java:323)
at com.mongodb.MongoCollectionImpl.insertMany(MongoCollectionImpl.java:311)
at org.apache.beam.sdk.io.mongodb.MongoDbIO$Write$WriteFn.flush(MongoDbIO.java:667)
at org.apache.beam.sdk.io.mongodb.MongoDbIO$Write$WriteFn.processElement(MongoDbIO.java:652)
com.mongodb.MongoTimeoutException: Timed out after 30000 ms while waiting for a server that matches WritableServerSelector. Client view of cluster state is {type=UNKNOWN, servers=[{address=35.184.44.201:27017, type=UNKNOWN, state=CONNECTING, exception={com.mongodb.MongoSocketOpenException: Exception opening socket}, caused by {java.net.SocketTimeoutException: connect timed out}}]
at com.mongodb.connection.BaseCluster.createTimeoutException(BaseCluster.java:369)
at com.mongodb.connection.BaseCluster.selectServer(BaseCluster.java:101)
at com.mongodb.binding.ClusterBinding$ClusterBindingConnectionSource.<init>(ClusterBinding.java:75)
at com.mongodb.binding.ClusterBinding$ClusterBindingConnectionSource.<init>(ClusterBinding.java:71)
at com.mongodb.binding.ClusterBinding.getWriteConnectionSource(ClusterBinding.java:68)
at com.mongodb.operation.OperationHelper.withConnection(OperationHelper.java:219)
at com.mongodb.operation.MixedBulkWriteOperation.execute(MixedBulkWriteOperation.java:168)
at com.mongodb.operation.MixedBulkWriteOperation.execute(MixedBulkWriteOperation.java:74)
at com.mongodb.Mongo.execute(Mongo.java:781)
at com.mongodb.Mongo$2.execute(Mongo.java:764)
at com.mongodb.MongoCollectionImpl.insertMany(MongoCollectionImpl.java:323)
at com.mongodb.MongoCollectionImpl.insertMany(MongoCollectionImpl.java:311)
at org.apache.beam.sdk.io.mongodb.MongoDbIO$Write$WriteFn.flush(MongoDbIO.java:667)
at org.apache.beam.sdk.io.mongodb.MongoDbIO$Write$WriteFn.processElement(MongoDbIO.java:652)
Workflow failed. Causes: S01:Generate sequence/Read(BoundedCountingSource)+Produce documents/Map+Write documents to MongoDB/ParDo(Write) failed., A work item was attempted 4 times without success. Each time the worker eventually lost contact with the service. The work item was attempted on:
mongodbioit0testwriteandr-06031104-ums4-harness-7nnt,
mongodbioit0testwriteandr-06031104-ums4-harness-fhwq,
mongodbioit0testwriteandr-06031104-ums4-harness-fhwq,
mongodbioit0testwriteandr-06031104-ums4-harness-fhwq
at org.apache.beam.runners.dataflow.TestDataflowRunner.run(TestDataflowRunner.java:134)
at org.apache.beam.runners.dataflow.TestDataflowRunner.run(TestDataflowRunner.java:90)
at org.apache.beam.runners.dataflow.TestDataflowRunner.run(TestDataflowRunner.java:55)
at org.apache.beam.sdk.Pipeline.run(Pipeline.java:311)
at org.apache.beam.sdk.testing.TestPipeline.run(TestPipeline.java:348)
at org.apache.beam.sdk.testing.TestPipeline.run(TestPipeline.java:329)
at org.apache.beam.sdk.io.mongodb.MongoDBIOIT.testWriteAndRead(MongoDBIOIT.java:118)
com.mongodb.MongoTimeoutException: Timed out after 30000 ms while waiting for a server that matches WritableServerSelector. Client view of cluster state is {type=UNKNOWN, servers=[{address=35.184.44.201:27017, type=UNKNOWN, state=CONNECTING, exception={com.mongodb.MongoSocketOpenException: Exception opening socket}, caused by {java.net.SocketTimeoutException: connect timed out}}]
at com.mongodb.connection.BaseCluster.createTimeoutException(BaseCluster.java:369)
at com.mongodb.connection.BaseCluster.selectServer(BaseCluster.java:101)
at com.mongodb.binding.ClusterBinding$ClusterBindingConnectionSource.<init>(ClusterBinding.java:75)
at com.mongodb.binding.ClusterBinding$ClusterBindingConnectionSource.<init>(ClusterBinding.java:71)
at com.mongodb.binding.ClusterBinding.getWriteConnectionSource(ClusterBinding.java:68)
at com.mongodb.operation.CommandOperationHelper.executeWrappedCommandProtocol(CommandOperationHelper.java:158)
at com.mongodb.operation.CommandOperationHelper.executeWrappedCommandProtocol(CommandOperationHelper.java:133)
at com.mongodb.operation.CommandOperationHelper.executeWrappedCommandProtocol(CommandOperationHelper.java:128)
at com.mongodb.operation.DropDatabaseOperation.execute(DropDatabaseOperation.java:51)
at com.mongodb.operation.DropDatabaseOperation.execute(DropDatabaseOperation.java:36)
at com.mongodb.Mongo.execute(Mongo.java:781)
at com.mongodb.Mongo$2.execute(Mongo.java:764)
at com.mongodb.MongoDatabaseImpl.drop(MongoDatabaseImpl.java:136)
at org.apache.beam.sdk.io.mongodb.MongoDBIOIT.tearDown(MongoDBIOIT.java:103)
1 test completed, 1 failed
Finished generating test XML results (0.023 secs) into: <https://builds.apache.org/job/beam_PerformanceTests_MongoDBIO_IT/ws/src/sdks/java/io/mongodb/build/test-results/integrationTest>
Generating HTML test report...
Finished generating test html results (0.029 secs) into: <https://builds.apache.org/job/beam_PerformanceTests_MongoDBIO_IT/ws/src/sdks/java/io/mongodb/build/reports/tests/integrationTest>
> Task :beam-sdks-java-io-mongodb:integrationTest FAILED
:beam-sdks-java-io-mongodb:integrationTest (Thread[Task worker for ':' Thread 10,5,main]) completed. Took 9 mins 17.224 secs.
Deprecated Gradle features were used in this build, making it incompatible with Gradle 5.0.
See https://docs.gradle.org/4.7/userguide/command_line_interface.html#sec:command_line_warnings
BUILD FAILED in 9m 27s
62 actionable tasks: 1 executed, 61 up-to-date
Publishing build scan...
https://gradle.com/s/6oz3igtt7fhx2
STDERR:
FAILURE: Build failed with an exception.
* What went wrong:
Execution failed for task ':beam-sdks-java-io-mongodb:integrationTest'.
> There were failing tests. See the report at: file://<https://builds.apache.org/job/beam_PerformanceTests_MongoDBIO_IT/ws/src/sdks/java/io/mongodb/build/reports/tests/integrationTest/index.html>
* Try:
Run with --debug option to get more log output. Run with --scan to get full insights.
* Exception is:
org.gradle.api.tasks.TaskExecutionException: Execution failed for task ':beam-sdks-java-io-mongodb:integrationTest'.
at org.gradle.api.internal.tasks.execution.ExecuteActionsTaskExecuter.executeActions(ExecuteActionsTaskExecuter.java:103)
at org.gradle.api.internal.tasks.execution.ExecuteActionsTaskExecuter.execute(ExecuteActionsTaskExecuter.java:73)
at org.gradle.api.internal.tasks.execution.OutputDirectoryCreatingTaskExecuter.execute(OutputDirectoryCreatingTaskExecuter.java:51)
at org.gradle.api.internal.tasks.execution.SkipCachedTaskExecuter.execute(SkipCachedTaskExecuter.java:105)
at org.gradle.api.internal.tasks.execution.SkipUpToDateTaskExecuter.execute(SkipUpToDateTaskExecuter.java:59)
at org.gradle.api.internal.tasks.execution.ResolveTaskOutputCachingStateExecuter.execute(ResolveTaskOutputCachingStateExecuter.java:54)
at org.gradle.api.internal.tasks.execution.ResolveBuildCacheKeyExecuter.execute(ResolveBuildCacheKeyExecuter.java:66)
at org.gradle.api.internal.tasks.execution.ValidatingTaskExecuter.execute(ValidatingTaskExecuter.java:59)
at org.gradle.api.internal.tasks.execution.SkipEmptySourceFilesTaskExecuter.execute(SkipEmptySourceFilesTaskExecuter.java:101)
at org.gradle.api.internal.tasks.execution.FinalizeInputFilePropertiesTaskExecuter.execute(FinalizeInputFilePropertiesTaskExecuter.java:44)
at org.gradle.api.internal.tasks.execution.CleanupStaleOutputsExecuter.execute(CleanupStaleOutputsExecuter.java:91)
at org.gradle.api.internal.tasks.execution.ResolveTaskArtifactStateTaskExecuter.execute(ResolveTaskArtifactStateTaskExecuter.java:62)
at org.gradle.api.internal.tasks.execution.SkipTaskWithNoActionsExecuter.execute(SkipTaskWithNoActionsExecuter.java:59)
at org.gradle.api.internal.tasks.execution.SkipOnlyIfTaskExecuter.execute(SkipOnlyIfTaskExecuter.java:54)
at org.gradle.api.internal.tasks.execution.ExecuteAtMostOnceTaskExecuter.execute(ExecuteAtMostOnceTaskExecuter.java:43)
at org.gradle.api.internal.tasks.execution.CatchExceptionTaskExecuter.execute(CatchExceptionTaskExecuter.java:34)
at org.gradle.execution.taskgraph.DefaultTaskGraphExecuter$EventFiringTaskWorker$1.run(DefaultTaskGraphExecuter.java:256)
at org.gradle.internal.operations.DefaultBuildOperationExecutor$RunnableBuildOperationWorker.execute(DefaultBuildOperationExecutor.java:317)
at org.gradle.internal.operations.DefaultBuildOperationExecutor$RunnableBuildOperationWorker.execute(DefaultBuildOperationExecutor.java:309)
at org.gradle.internal.operations.DefaultBuildOperationExecutor.execute(DefaultBuildOperationExecutor.java:185)
at org.gradle.internal.operations.DefaultBuildOperationExecutor.run(DefaultBuildOperationExecutor.java:97)
at org.gradle.internal.operations.DelegatingBuildOperationExecutor.run(DelegatingBuildOperationExecutor.java:31)
at org.gradle.execution.taskgraph.DefaultTaskGraphExecuter$EventFiringTaskWorker.execute(DefaultTaskGraphExecuter.java:249)
at org.gradle.execution.taskgraph.DefaultTaskGraphExecuter$EventFiringTaskWorker.execute(DefaultTaskGraphExecuter.java:238)
at org.gradle.execution.taskgraph.DefaultTaskPlanExecutor$TaskExecutorWorker$1.execute(DefaultTaskPlanExecutor.java:104)
at org.gradle.execution.taskgraph.DefaultTaskPlanExecutor$TaskExecutorWorker$1.execute(DefaultTaskPlanExecutor.java:98)
at org.gradle.execution.taskgraph.DefaultTaskExecutionPlan.execute(DefaultTaskExecutionPlan.java:663)
at org.gradle.execution.taskgraph.DefaultTaskExecutionPlan.executeWithTask(DefaultTaskExecutionPlan.java:596)
at org.gradle.execution.taskgraph.DefaultTaskPlanExecutor$TaskExecutorWorker.run(DefaultTaskPlanExecutor.java:98)
at org.gradle.internal.concurrent.ExecutorPolicy$CatchAndRecordFailures.onExecute(ExecutorPolicy.java:63)
at org.gradle.internal.concurrent.ManagedExecutorImpl$1.run(ManagedExecutorImpl.java:46)
at org.gradle.internal.concurrent.ThreadFactoryImpl$ManagedThreadRunnable.run(ThreadFactoryImpl.java:55)
Caused by: org.gradle.api.GradleException: There were failing tests. See the report at: file://<https://builds.apache.org/job/beam_PerformanceTests_MongoDBIO_IT/ws/src/sdks/java/io/mongodb/build/reports/tests/integrationTest/index.html>
at org.gradle.api.tasks.testing.AbstractTestTask.handleTestFailures(AbstractTestTask.java:612)
at org.gradle.api.tasks.testing.AbstractTestTask.executeTests(AbstractTestTask.java:484)
at org.gradle.api.tasks.testing.Test.executeTests(Test.java:583)
at org.gradle.internal.reflect.JavaMethod.invoke(JavaMethod.java:73)
at org.gradle.api.internal.project.taskfactory.StandardTaskAction.doExecute(StandardTaskAction.java:46)
at org.gradle.api.internal.project.taskfactory.StandardTaskAction.execute(StandardTaskAction.java:39)
at org.gradle.api.internal.project.taskfactory.StandardTaskAction.execute(StandardTaskAction.java:26)
at org.gradle.api.internal.AbstractTask$TaskActionWrapper.execute(AbstractTask.java:794)
at org.gradle.api.internal.AbstractTask$TaskActionWrapper.execute(AbstractTask.java:761)
at org.gradle.api.internal.tasks.execution.ExecuteActionsTaskExecuter$1.run(ExecuteActionsTaskExecuter.java:124)
at org.gradle.internal.operations.DefaultBuildOperationExecutor$RunnableBuildOperationWorker.execute(DefaultBuildOperationExecutor.java:317)
at org.gradle.internal.operations.DefaultBuildOperationExecutor$RunnableBuildOperationWorker.execute(DefaultBuildOperationExecutor.java:309)
at org.gradle.internal.operations.DefaultBuildOperationExecutor.execute(DefaultBuildOperationExecutor.java:185)
at org.gradle.internal.operations.DefaultBuildOperationExecutor.run(DefaultBuildOperationExecutor.java:97)
at org.gradle.internal.operations.DelegatingBuildOperationExecutor.run(DelegatingBuildOperationExecutor.java:31)
at org.gradle.api.internal.tasks.execution.ExecuteActionsTaskExecuter.executeAction(ExecuteActionsTaskExecuter.java:113)
at org.gradle.api.internal.tasks.execution.ExecuteActionsTaskExecuter.executeActions(ExecuteActionsTaskExecuter.java:95)
... 31 more
* Get more help at https://help.gradle.org
2018-06-03 18:13:30,326 cb27093b MainThread beam_integration_benchmark(1/1) ERROR Error during benchmark beam_integration_benchmark
Traceback (most recent call last):
File "<https://builds.apache.org/job/beam_PerformanceTests_MongoDBIO_IT/ws/PerfKitBenchmarker/perfkitbenchmarker/pkb.py",> line 667, in RunBenchmark
DoRunPhase(spec, collector, detailed_timer)
File "<https://builds.apache.org/job/beam_PerformanceTests_MongoDBIO_IT/ws/PerfKitBenchmarker/perfkitbenchmarker/pkb.py",> line 547, in DoRunPhase
samples = spec.BenchmarkRun(spec)
File "<https://builds.apache.org/job/beam_PerformanceTests_MongoDBIO_IT/ws/PerfKitBenchmarker/perfkitbenchmarker/linux_benchmarks/beam_integration_benchmark.py",> line 159, in Run
job_type=job_type)
File "<https://builds.apache.org/job/beam_PerformanceTests_MongoDBIO_IT/ws/PerfKitBenchmarker/perfkitbenchmarker/providers/gcp/gcp_dpb_dataflow.py",> line 90, in SubmitJob
assert retcode == 0, "Integration Test Failed."
AssertionError: Integration Test Failed.
2018-06-03 18:13:30,327 cb27093b MainThread beam_integration_benchmark(1/1) INFO Cleaning up benchmark beam_integration_benchmark
2018-06-03 18:13:30,327 cb27093b MainThread beam_integration_benchmark(1/1) INFO Running: kubectl --kubeconfig=<https://builds.apache.org/job/beam_PerformanceTests_MongoDBIO_IT/ws/config-mongodbioit-255> delete -f <https://builds.apache.org/job/beam_PerformanceTests_MongoDBIO_IT/ws/src/.test-infra/kubernetes/mongodb/load-balancer/mongo.yml> --ignore-not-found
2018-06-03 18:13:31,101 cb27093b MainThread beam_integration_benchmark(1/1) ERROR Exception running benchmark
Traceback (most recent call last):
File "<https://builds.apache.org/job/beam_PerformanceTests_MongoDBIO_IT/ws/PerfKitBenchmarker/perfkitbenchmarker/pkb.py",> line 801, in RunBenchmarkTask
RunBenchmark(spec, collector)
File "<https://builds.apache.org/job/beam_PerformanceTests_MongoDBIO_IT/ws/PerfKitBenchmarker/perfkitbenchmarker/pkb.py",> line 667, in RunBenchmark
DoRunPhase(spec, collector, detailed_timer)
File "<https://builds.apache.org/job/beam_PerformanceTests_MongoDBIO_IT/ws/PerfKitBenchmarker/perfkitbenchmarker/pkb.py",> line 547, in DoRunPhase
samples = spec.BenchmarkRun(spec)
File "<https://builds.apache.org/job/beam_PerformanceTests_MongoDBIO_IT/ws/PerfKitBenchmarker/perfkitbenchmarker/linux_benchmarks/beam_integration_benchmark.py",> line 159, in Run
job_type=job_type)
File "<https://builds.apache.org/job/beam_PerformanceTests_MongoDBIO_IT/ws/PerfKitBenchmarker/perfkitbenchmarker/providers/gcp/gcp_dpb_dataflow.py",> line 90, in SubmitJob
assert retcode == 0, "Integration Test Failed."
AssertionError: Integration Test Failed.
2018-06-03 18:13:31,102 cb27093b MainThread beam_integration_benchmark(1/1) ERROR Benchmark 1/1 beam_integration_benchmark (UID: beam_integration_benchmark0) failed. Execution will continue.
2018-06-03 18:13:31,156 cb27093b MainThread INFO Benchmark run statuses:
---------------------------------------------------------------------------------
Name UID Status Failed Substatus
---------------------------------------------------------------------------------
beam_integration_benchmark beam_integration_benchmark0 FAILED
---------------------------------------------------------------------------------
Success rate: 0.00% (0/1)
2018-06-03 18:13:31,157 cb27093b MainThread INFO Complete logs can be found at: <https://builds.apache.org/job/beam_PerformanceTests_MongoDBIO_IT/ws/runs/cb27093b/pkb.log>
2018-06-03 18:13:31,157 cb27093b MainThread INFO Completion statuses can be found at: <https://builds.apache.org/job/beam_PerformanceTests_MongoDBIO_IT/ws/runs/cb27093b/completion_statuses.json>
Build step 'Execute shell' marked build as failure
Build failed in Jenkins: beam_PerformanceTests_MongoDBIO_IT #254
Posted by Apache Jenkins Server <je...@builds.apache.org>.
See <https://builds.apache.org/job/beam_PerformanceTests_MongoDBIO_IT/254/display/redirect>
------------------------------------------
[...truncated 200.30 KB...]
at com.mongodb.connection.DefaultConnectionPool$PooledConnection.receiveMessage(DefaultConnectionPool.java:435)
at com.mongodb.connection.WriteCommandProtocol.receiveMessage(WriteCommandProtocol.java:234)
at com.mongodb.connection.WriteCommandProtocol.execute(WriteCommandProtocol.java:104)
at com.mongodb.connection.InsertCommandProtocol.execute(InsertCommandProtocol.java:67)
at com.mongodb.connection.InsertCommandProtocol.execute(InsertCommandProtocol.java:37)
at com.mongodb.connection.DefaultServer$DefaultServerProtocolExecutor.execute(DefaultServer.java:159)
at com.mongodb.connection.DefaultServerConnection.executeProtocol(DefaultServerConnection.java:286)
at com.mongodb.connection.DefaultServerConnection.insertCommand(DefaultServerConnection.java:115)
at com.mongodb.operation.MixedBulkWriteOperation$Run$2.executeWriteCommandProtocol(MixedBulkWriteOperation.java:455)
at com.mongodb.operation.MixedBulkWriteOperation$Run$RunExecutor.execute(MixedBulkWriteOperation.java:646)
at com.mongodb.operation.MixedBulkWriteOperation$Run.execute(MixedBulkWriteOperation.java:401)
at com.mongodb.operation.MixedBulkWriteOperation$1.call(MixedBulkWriteOperation.java:179)
at com.mongodb.operation.MixedBulkWriteOperation$1.call(MixedBulkWriteOperation.java:168)
at com.mongodb.operation.OperationHelper.withConnectionSource(OperationHelper.java:230)
at com.mongodb.operation.OperationHelper.withConnection(OperationHelper.java:221)
at com.mongodb.operation.MixedBulkWriteOperation.execute(MixedBulkWriteOperation.java:168)
at com.mongodb.operation.MixedBulkWriteOperation.execute(MixedBulkWriteOperation.java:74)
at com.mongodb.Mongo.execute(Mongo.java:781)
at com.mongodb.Mongo$2.execute(Mongo.java:764)
at com.mongodb.MongoCollectionImpl.insertMany(MongoCollectionImpl.java:323)
at com.mongodb.MongoCollectionImpl.insertMany(MongoCollectionImpl.java:311)
at org.apache.beam.sdk.io.mongodb.MongoDbIO$Write$WriteFn.flush(MongoDbIO.java:667)
at org.apache.beam.sdk.io.mongodb.MongoDbIO$Write$WriteFn.processElement(MongoDbIO.java:652)
com.mongodb.MongoTimeoutException: Timed out after 30000 ms while waiting for a server that matches WritableServerSelector. Client view of cluster state is {type=UNKNOWN, servers=[{address=35.232.66.204:27017, type=UNKNOWN, state=CONNECTING, exception={com.mongodb.MongoSocketOpenException: Exception opening socket}, caused by {java.net.SocketTimeoutException: connect timed out}}]
at com.mongodb.connection.BaseCluster.createTimeoutException(BaseCluster.java:369)
at com.mongodb.connection.BaseCluster.selectServer(BaseCluster.java:101)
at com.mongodb.binding.ClusterBinding$ClusterBindingConnectionSource.<init>(ClusterBinding.java:75)
at com.mongodb.binding.ClusterBinding$ClusterBindingConnectionSource.<init>(ClusterBinding.java:71)
at com.mongodb.binding.ClusterBinding.getWriteConnectionSource(ClusterBinding.java:68)
at com.mongodb.operation.OperationHelper.withConnection(OperationHelper.java:219)
at com.mongodb.operation.MixedBulkWriteOperation.execute(MixedBulkWriteOperation.java:168)
at com.mongodb.operation.MixedBulkWriteOperation.execute(MixedBulkWriteOperation.java:74)
at com.mongodb.Mongo.execute(Mongo.java:781)
at com.mongodb.Mongo$2.execute(Mongo.java:764)
at com.mongodb.MongoCollectionImpl.insertMany(MongoCollectionImpl.java:323)
at com.mongodb.MongoCollectionImpl.insertMany(MongoCollectionImpl.java:311)
at org.apache.beam.sdk.io.mongodb.MongoDbIO$Write$WriteFn.flush(MongoDbIO.java:667)
at org.apache.beam.sdk.io.mongodb.MongoDbIO$Write$WriteFn.processElement(MongoDbIO.java:652)
com.mongodb.MongoTimeoutException: Timed out after 30000 ms while waiting for a server that matches WritableServerSelector. Client view of cluster state is {type=UNKNOWN, servers=[{address=35.232.66.204:27017, type=UNKNOWN, state=CONNECTING, exception={com.mongodb.MongoSocketOpenException: Exception opening socket}, caused by {java.net.SocketTimeoutException: connect timed out}}]
at com.mongodb.connection.BaseCluster.createTimeoutException(BaseCluster.java:369)
at com.mongodb.connection.BaseCluster.selectServer(BaseCluster.java:101)
at com.mongodb.binding.ClusterBinding$ClusterBindingConnectionSource.<init>(ClusterBinding.java:75)
at com.mongodb.binding.ClusterBinding$ClusterBindingConnectionSource.<init>(ClusterBinding.java:71)
at com.mongodb.binding.ClusterBinding.getWriteConnectionSource(ClusterBinding.java:68)
at com.mongodb.operation.OperationHelper.withConnection(OperationHelper.java:219)
at com.mongodb.operation.MixedBulkWriteOperation.execute(MixedBulkWriteOperation.java:168)
at com.mongodb.operation.MixedBulkWriteOperation.execute(MixedBulkWriteOperation.java:74)
at com.mongodb.Mongo.execute(Mongo.java:781)
at com.mongodb.Mongo$2.execute(Mongo.java:764)
at com.mongodb.MongoCollectionImpl.insertMany(MongoCollectionImpl.java:323)
at com.mongodb.MongoCollectionImpl.insertMany(MongoCollectionImpl.java:311)
at org.apache.beam.sdk.io.mongodb.MongoDbIO$Write$WriteFn.flush(MongoDbIO.java:667)
at org.apache.beam.sdk.io.mongodb.MongoDbIO$Write$WriteFn.processElement(MongoDbIO.java:652)
com.mongodb.MongoTimeoutException: Timed out after 30000 ms while waiting for a server that matches WritableServerSelector. Client view of cluster state is {type=UNKNOWN, servers=[{address=35.232.66.204:27017, type=UNKNOWN, state=CONNECTING, exception={com.mongodb.MongoSocketOpenException: Exception opening socket}, caused by {java.net.SocketTimeoutException: connect timed out}}]
at com.mongodb.connection.BaseCluster.createTimeoutException(BaseCluster.java:369)
at com.mongodb.connection.BaseCluster.selectServer(BaseCluster.java:101)
at com.mongodb.binding.ClusterBinding$ClusterBindingConnectionSource.<init>(ClusterBinding.java:75)
at com.mongodb.binding.ClusterBinding$ClusterBindingConnectionSource.<init>(ClusterBinding.java:71)
at com.mongodb.binding.ClusterBinding.getWriteConnectionSource(ClusterBinding.java:68)
at com.mongodb.operation.OperationHelper.withConnection(OperationHelper.java:219)
at com.mongodb.operation.MixedBulkWriteOperation.execute(MixedBulkWriteOperation.java:168)
at com.mongodb.operation.MixedBulkWriteOperation.execute(MixedBulkWriteOperation.java:74)
at com.mongodb.Mongo.execute(Mongo.java:781)
at com.mongodb.Mongo$2.execute(Mongo.java:764)
at com.mongodb.MongoCollectionImpl.insertMany(MongoCollectionImpl.java:323)
at com.mongodb.MongoCollectionImpl.insertMany(MongoCollectionImpl.java:311)
at org.apache.beam.sdk.io.mongodb.MongoDbIO$Write$WriteFn.flush(MongoDbIO.java:667)
at org.apache.beam.sdk.io.mongodb.MongoDbIO$Write$WriteFn.processElement(MongoDbIO.java:652)
com.mongodb.MongoTimeoutException: Timed out after 30000 ms while waiting for a server that matches WritableServerSelector. Client view of cluster state is {type=UNKNOWN, servers=[{address=35.232.66.204:27017, type=UNKNOWN, state=CONNECTING, exception={com.mongodb.MongoSocketOpenException: Exception opening socket}, caused by {java.net.SocketTimeoutException: connect timed out}}]
at com.mongodb.connection.BaseCluster.createTimeoutException(BaseCluster.java:369)
at com.mongodb.connection.BaseCluster.selectServer(BaseCluster.java:101)
at com.mongodb.binding.ClusterBinding$ClusterBindingConnectionSource.<init>(ClusterBinding.java:75)
at com.mongodb.binding.ClusterBinding$ClusterBindingConnectionSource.<init>(ClusterBinding.java:71)
at com.mongodb.binding.ClusterBinding.getWriteConnectionSource(ClusterBinding.java:68)
at com.mongodb.operation.OperationHelper.withConnection(OperationHelper.java:219)
at com.mongodb.operation.MixedBulkWriteOperation.execute(MixedBulkWriteOperation.java:168)
at com.mongodb.operation.MixedBulkWriteOperation.execute(MixedBulkWriteOperation.java:74)
at com.mongodb.Mongo.execute(Mongo.java:781)
at com.mongodb.Mongo$2.execute(Mongo.java:764)
at com.mongodb.MongoCollectionImpl.insertMany(MongoCollectionImpl.java:323)
at com.mongodb.MongoCollectionImpl.insertMany(MongoCollectionImpl.java:311)
at org.apache.beam.sdk.io.mongodb.MongoDbIO$Write$WriteFn.flush(MongoDbIO.java:667)
at org.apache.beam.sdk.io.mongodb.MongoDbIO$Write$WriteFn.processElement(MongoDbIO.java:652)
com.mongodb.MongoTimeoutException: Timed out after 30000 ms while waiting for a server that matches WritableServerSelector. Client view of cluster state is {type=UNKNOWN, servers=[{address=35.232.66.204:27017, type=UNKNOWN, state=CONNECTING, exception={com.mongodb.MongoSocketOpenException: Exception opening socket}, caused by {java.net.SocketTimeoutException: connect timed out}}]
at com.mongodb.connection.BaseCluster.createTimeoutException(BaseCluster.java:369)
at com.mongodb.connection.BaseCluster.selectServer(BaseCluster.java:101)
at com.mongodb.binding.ClusterBinding$ClusterBindingConnectionSource.<init>(ClusterBinding.java:75)
at com.mongodb.binding.ClusterBinding$ClusterBindingConnectionSource.<init>(ClusterBinding.java:71)
at com.mongodb.binding.ClusterBinding.getWriteConnectionSource(ClusterBinding.java:68)
at com.mongodb.operation.OperationHelper.withConnection(OperationHelper.java:219)
at com.mongodb.operation.MixedBulkWriteOperation.execute(MixedBulkWriteOperation.java:168)
at com.mongodb.operation.MixedBulkWriteOperation.execute(MixedBulkWriteOperation.java:74)
at com.mongodb.Mongo.execute(Mongo.java:781)
at com.mongodb.Mongo$2.execute(Mongo.java:764)
at com.mongodb.MongoCollectionImpl.insertMany(MongoCollectionImpl.java:323)
at com.mongodb.MongoCollectionImpl.insertMany(MongoCollectionImpl.java:311)
at org.apache.beam.sdk.io.mongodb.MongoDbIO$Write$WriteFn.flush(MongoDbIO.java:667)
at org.apache.beam.sdk.io.mongodb.MongoDbIO$Write$WriteFn.processElement(MongoDbIO.java:652)
Workflow failed. Causes: S01:Generate sequence/Read(BoundedCountingSource)+Produce documents/Map+Write documents to MongoDB/ParDo(Write) failed., A work item was attempted 4 times without success. Each time the worker eventually lost contact with the service. The work item was attempted on:
mongodbioit0testwriteandr-06030504-mhqm-harness-bkw9,
mongodbioit0testwriteandr-06030504-mhqm-harness-bkw9,
mongodbioit0testwriteandr-06030504-mhqm-harness-bkw9,
mongodbioit0testwriteandr-06030504-mhqm-harness-bkw9
at org.apache.beam.runners.dataflow.TestDataflowRunner.run(TestDataflowRunner.java:134)
at org.apache.beam.runners.dataflow.TestDataflowRunner.run(TestDataflowRunner.java:90)
at org.apache.beam.runners.dataflow.TestDataflowRunner.run(TestDataflowRunner.java:55)
at org.apache.beam.sdk.Pipeline.run(Pipeline.java:311)
at org.apache.beam.sdk.testing.TestPipeline.run(TestPipeline.java:348)
at org.apache.beam.sdk.testing.TestPipeline.run(TestPipeline.java:329)
at org.apache.beam.sdk.io.mongodb.MongoDBIOIT.testWriteAndRead(MongoDBIOIT.java:118)
com.mongodb.MongoTimeoutException: Timed out after 30000 ms while waiting for a server that matches WritableServerSelector. Client view of cluster state is {type=UNKNOWN, servers=[{address=35.232.66.204:27017, type=UNKNOWN, state=CONNECTING, exception={com.mongodb.MongoSocketOpenException: Exception opening socket}, caused by {java.net.SocketTimeoutException: connect timed out}}]
at com.mongodb.connection.BaseCluster.createTimeoutException(BaseCluster.java:369)
at com.mongodb.connection.BaseCluster.selectServer(BaseCluster.java:101)
at com.mongodb.binding.ClusterBinding$ClusterBindingConnectionSource.<init>(ClusterBinding.java:75)
at com.mongodb.binding.ClusterBinding$ClusterBindingConnectionSource.<init>(ClusterBinding.java:71)
at com.mongodb.binding.ClusterBinding.getWriteConnectionSource(ClusterBinding.java:68)
at com.mongodb.operation.CommandOperationHelper.executeWrappedCommandProtocol(CommandOperationHelper.java:158)
at com.mongodb.operation.CommandOperationHelper.executeWrappedCommandProtocol(CommandOperationHelper.java:133)
at com.mongodb.operation.CommandOperationHelper.executeWrappedCommandProtocol(CommandOperationHelper.java:128)
at com.mongodb.operation.DropDatabaseOperation.execute(DropDatabaseOperation.java:51)
at com.mongodb.operation.DropDatabaseOperation.execute(DropDatabaseOperation.java:36)
at com.mongodb.Mongo.execute(Mongo.java:781)
at com.mongodb.Mongo$2.execute(Mongo.java:764)
at com.mongodb.MongoDatabaseImpl.drop(MongoDatabaseImpl.java:136)
at org.apache.beam.sdk.io.mongodb.MongoDBIOIT.tearDown(MongoDBIOIT.java:103)
1 test completed, 1 failed
Finished generating test XML results (0.021 secs) into: <https://builds.apache.org/job/beam_PerformanceTests_MongoDBIO_IT/ws/src/sdks/java/io/mongodb/build/test-results/integrationTest>
Generating HTML test report...
Finished generating test html results (0.03 secs) into: <https://builds.apache.org/job/beam_PerformanceTests_MongoDBIO_IT/ws/src/sdks/java/io/mongodb/build/reports/tests/integrationTest>
> Task :beam-sdks-java-io-mongodb:integrationTest FAILED
:beam-sdks-java-io-mongodb:integrationTest (Thread[Task worker for ':',5,main]) completed. Took 10 mins 9.08 secs.
Deprecated Gradle features were used in this build, making it incompatible with Gradle 5.0.
See https://docs.gradle.org/4.7/userguide/command_line_interface.html#sec:command_line_warnings
BUILD FAILED in 10m 18s
62 actionable tasks: 1 executed, 61 up-to-date
Publishing build scan...
https://gradle.com/s/vqzawx6hs57vq
STDERR:
FAILURE: Build failed with an exception.
* What went wrong:
Execution failed for task ':beam-sdks-java-io-mongodb:integrationTest'.
> There were failing tests. See the report at: file://<https://builds.apache.org/job/beam_PerformanceTests_MongoDBIO_IT/ws/src/sdks/java/io/mongodb/build/reports/tests/integrationTest/index.html>
* Try:
Run with --debug option to get more log output. Run with --scan to get full insights.
* Exception is:
org.gradle.api.tasks.TaskExecutionException: Execution failed for task ':beam-sdks-java-io-mongodb:integrationTest'.
at org.gradle.api.internal.tasks.execution.ExecuteActionsTaskExecuter.executeActions(ExecuteActionsTaskExecuter.java:103)
at org.gradle.api.internal.tasks.execution.ExecuteActionsTaskExecuter.execute(ExecuteActionsTaskExecuter.java:73)
at org.gradle.api.internal.tasks.execution.OutputDirectoryCreatingTaskExecuter.execute(OutputDirectoryCreatingTaskExecuter.java:51)
at org.gradle.api.internal.tasks.execution.SkipCachedTaskExecuter.execute(SkipCachedTaskExecuter.java:105)
at org.gradle.api.internal.tasks.execution.SkipUpToDateTaskExecuter.execute(SkipUpToDateTaskExecuter.java:59)
at org.gradle.api.internal.tasks.execution.ResolveTaskOutputCachingStateExecuter.execute(ResolveTaskOutputCachingStateExecuter.java:54)
at org.gradle.api.internal.tasks.execution.ResolveBuildCacheKeyExecuter.execute(ResolveBuildCacheKeyExecuter.java:66)
at org.gradle.api.internal.tasks.execution.ValidatingTaskExecuter.execute(ValidatingTaskExecuter.java:59)
at org.gradle.api.internal.tasks.execution.SkipEmptySourceFilesTaskExecuter.execute(SkipEmptySourceFilesTaskExecuter.java:101)
at org.gradle.api.internal.tasks.execution.FinalizeInputFilePropertiesTaskExecuter.execute(FinalizeInputFilePropertiesTaskExecuter.java:44)
at org.gradle.api.internal.tasks.execution.CleanupStaleOutputsExecuter.execute(CleanupStaleOutputsExecuter.java:91)
at org.gradle.api.internal.tasks.execution.ResolveTaskArtifactStateTaskExecuter.execute(ResolveTaskArtifactStateTaskExecuter.java:62)
at org.gradle.api.internal.tasks.execution.SkipTaskWithNoActionsExecuter.execute(SkipTaskWithNoActionsExecuter.java:59)
at org.gradle.api.internal.tasks.execution.SkipOnlyIfTaskExecuter.execute(SkipOnlyIfTaskExecuter.java:54)
at org.gradle.api.internal.tasks.execution.ExecuteAtMostOnceTaskExecuter.execute(ExecuteAtMostOnceTaskExecuter.java:43)
at org.gradle.api.internal.tasks.execution.CatchExceptionTaskExecuter.execute(CatchExceptionTaskExecuter.java:34)
at org.gradle.execution.taskgraph.DefaultTaskGraphExecuter$EventFiringTaskWorker$1.run(DefaultTaskGraphExecuter.java:256)
at org.gradle.internal.operations.DefaultBuildOperationExecutor$RunnableBuildOperationWorker.execute(DefaultBuildOperationExecutor.java:317)
at org.gradle.internal.operations.DefaultBuildOperationExecutor$RunnableBuildOperationWorker.execute(DefaultBuildOperationExecutor.java:309)
at org.gradle.internal.operations.DefaultBuildOperationExecutor.execute(DefaultBuildOperationExecutor.java:185)
at org.gradle.internal.operations.DefaultBuildOperationExecutor.run(DefaultBuildOperationExecutor.java:97)
at org.gradle.internal.operations.DelegatingBuildOperationExecutor.run(DelegatingBuildOperationExecutor.java:31)
at org.gradle.execution.taskgraph.DefaultTaskGraphExecuter$EventFiringTaskWorker.execute(DefaultTaskGraphExecuter.java:249)
at org.gradle.execution.taskgraph.DefaultTaskGraphExecuter$EventFiringTaskWorker.execute(DefaultTaskGraphExecuter.java:238)
at org.gradle.execution.taskgraph.DefaultTaskPlanExecutor$TaskExecutorWorker$1.execute(DefaultTaskPlanExecutor.java:104)
at org.gradle.execution.taskgraph.DefaultTaskPlanExecutor$TaskExecutorWorker$1.execute(DefaultTaskPlanExecutor.java:98)
at org.gradle.execution.taskgraph.DefaultTaskExecutionPlan.execute(DefaultTaskExecutionPlan.java:663)
at org.gradle.execution.taskgraph.DefaultTaskExecutionPlan.executeWithTask(DefaultTaskExecutionPlan.java:596)
at org.gradle.execution.taskgraph.DefaultTaskPlanExecutor$TaskExecutorWorker.run(DefaultTaskPlanExecutor.java:98)
at org.gradle.internal.concurrent.ExecutorPolicy$CatchAndRecordFailures.onExecute(ExecutorPolicy.java:63)
at org.gradle.internal.concurrent.ManagedExecutorImpl$1.run(ManagedExecutorImpl.java:46)
at org.gradle.internal.concurrent.ThreadFactoryImpl$ManagedThreadRunnable.run(ThreadFactoryImpl.java:55)
Caused by: org.gradle.api.GradleException: There were failing tests. See the report at: file://<https://builds.apache.org/job/beam_PerformanceTests_MongoDBIO_IT/ws/src/sdks/java/io/mongodb/build/reports/tests/integrationTest/index.html>
at org.gradle.api.tasks.testing.AbstractTestTask.handleTestFailures(AbstractTestTask.java:612)
at org.gradle.api.tasks.testing.AbstractTestTask.executeTests(AbstractTestTask.java:484)
at org.gradle.api.tasks.testing.Test.executeTests(Test.java:583)
at org.gradle.internal.reflect.JavaMethod.invoke(JavaMethod.java:73)
at org.gradle.api.internal.project.taskfactory.StandardTaskAction.doExecute(StandardTaskAction.java:46)
at org.gradle.api.internal.project.taskfactory.StandardTaskAction.execute(StandardTaskAction.java:39)
at org.gradle.api.internal.project.taskfactory.StandardTaskAction.execute(StandardTaskAction.java:26)
at org.gradle.api.internal.AbstractTask$TaskActionWrapper.execute(AbstractTask.java:794)
at org.gradle.api.internal.AbstractTask$TaskActionWrapper.execute(AbstractTask.java:761)
at org.gradle.api.internal.tasks.execution.ExecuteActionsTaskExecuter$1.run(ExecuteActionsTaskExecuter.java:124)
at org.gradle.internal.operations.DefaultBuildOperationExecutor$RunnableBuildOperationWorker.execute(DefaultBuildOperationExecutor.java:317)
at org.gradle.internal.operations.DefaultBuildOperationExecutor$RunnableBuildOperationWorker.execute(DefaultBuildOperationExecutor.java:309)
at org.gradle.internal.operations.DefaultBuildOperationExecutor.execute(DefaultBuildOperationExecutor.java:185)
at org.gradle.internal.operations.DefaultBuildOperationExecutor.run(DefaultBuildOperationExecutor.java:97)
at org.gradle.internal.operations.DelegatingBuildOperationExecutor.run(DelegatingBuildOperationExecutor.java:31)
at org.gradle.api.internal.tasks.execution.ExecuteActionsTaskExecuter.executeAction(ExecuteActionsTaskExecuter.java:113)
at org.gradle.api.internal.tasks.execution.ExecuteActionsTaskExecuter.executeActions(ExecuteActionsTaskExecuter.java:95)
... 31 more
* Get more help at https://help.gradle.org
2018-06-03 12:14:31,659 d8271b9a MainThread beam_integration_benchmark(1/1) ERROR Error during benchmark beam_integration_benchmark
Traceback (most recent call last):
File "<https://builds.apache.org/job/beam_PerformanceTests_MongoDBIO_IT/ws/PerfKitBenchmarker/perfkitbenchmarker/pkb.py",> line 667, in RunBenchmark
DoRunPhase(spec, collector, detailed_timer)
File "<https://builds.apache.org/job/beam_PerformanceTests_MongoDBIO_IT/ws/PerfKitBenchmarker/perfkitbenchmarker/pkb.py",> line 547, in DoRunPhase
samples = spec.BenchmarkRun(spec)
File "<https://builds.apache.org/job/beam_PerformanceTests_MongoDBIO_IT/ws/PerfKitBenchmarker/perfkitbenchmarker/linux_benchmarks/beam_integration_benchmark.py",> line 159, in Run
job_type=job_type)
File "<https://builds.apache.org/job/beam_PerformanceTests_MongoDBIO_IT/ws/PerfKitBenchmarker/perfkitbenchmarker/providers/gcp/gcp_dpb_dataflow.py",> line 90, in SubmitJob
assert retcode == 0, "Integration Test Failed."
AssertionError: Integration Test Failed.
2018-06-03 12:14:31,660 d8271b9a MainThread beam_integration_benchmark(1/1) INFO Cleaning up benchmark beam_integration_benchmark
2018-06-03 12:14:31,661 d8271b9a MainThread beam_integration_benchmark(1/1) INFO Running: kubectl --kubeconfig=<https://builds.apache.org/job/beam_PerformanceTests_MongoDBIO_IT/ws/config-mongodbioit-254> delete -f <https://builds.apache.org/job/beam_PerformanceTests_MongoDBIO_IT/ws/src/.test-infra/kubernetes/mongodb/load-balancer/mongo.yml> --ignore-not-found
2018-06-03 12:14:32,541 d8271b9a MainThread beam_integration_benchmark(1/1) ERROR Exception running benchmark
Traceback (most recent call last):
File "<https://builds.apache.org/job/beam_PerformanceTests_MongoDBIO_IT/ws/PerfKitBenchmarker/perfkitbenchmarker/pkb.py",> line 801, in RunBenchmarkTask
RunBenchmark(spec, collector)
File "<https://builds.apache.org/job/beam_PerformanceTests_MongoDBIO_IT/ws/PerfKitBenchmarker/perfkitbenchmarker/pkb.py",> line 667, in RunBenchmark
DoRunPhase(spec, collector, detailed_timer)
File "<https://builds.apache.org/job/beam_PerformanceTests_MongoDBIO_IT/ws/PerfKitBenchmarker/perfkitbenchmarker/pkb.py",> line 547, in DoRunPhase
samples = spec.BenchmarkRun(spec)
File "<https://builds.apache.org/job/beam_PerformanceTests_MongoDBIO_IT/ws/PerfKitBenchmarker/perfkitbenchmarker/linux_benchmarks/beam_integration_benchmark.py",> line 159, in Run
job_type=job_type)
File "<https://builds.apache.org/job/beam_PerformanceTests_MongoDBIO_IT/ws/PerfKitBenchmarker/perfkitbenchmarker/providers/gcp/gcp_dpb_dataflow.py",> line 90, in SubmitJob
assert retcode == 0, "Integration Test Failed."
AssertionError: Integration Test Failed.
2018-06-03 12:14:32,541 d8271b9a MainThread beam_integration_benchmark(1/1) ERROR Benchmark 1/1 beam_integration_benchmark (UID: beam_integration_benchmark0) failed. Execution will continue.
2018-06-03 12:14:32,565 d8271b9a MainThread INFO Benchmark run statuses:
---------------------------------------------------------------------------------
Name UID Status Failed Substatus
---------------------------------------------------------------------------------
beam_integration_benchmark beam_integration_benchmark0 FAILED
---------------------------------------------------------------------------------
Success rate: 0.00% (0/1)
2018-06-03 12:14:32,566 d8271b9a MainThread INFO Complete logs can be found at: <https://builds.apache.org/job/beam_PerformanceTests_MongoDBIO_IT/ws/runs/d8271b9a/pkb.log>
2018-06-03 12:14:32,566 d8271b9a MainThread INFO Completion statuses can be found at: <https://builds.apache.org/job/beam_PerformanceTests_MongoDBIO_IT/ws/runs/d8271b9a/completion_statuses.json>
Build step 'Execute shell' marked build as failure
Build failed in Jenkins: beam_PerformanceTests_MongoDBIO_IT #253
Posted by Apache Jenkins Server <je...@builds.apache.org>.
See <https://builds.apache.org/job/beam_PerformanceTests_MongoDBIO_IT/253/display/redirect?page=changes>
Changes:
[daniel.o.programmer] [BEAM-4406] Updating Java portable environment major version.
[daniel.o.programmer] [BEAM-4406] Updating Python portable environment major version.
------------------------------------------
[...truncated 198.18 KB...]
at com.mongodb.connection.BaseCluster.selectServer(BaseCluster.java:101)
at com.mongodb.binding.ClusterBinding$ClusterBindingConnectionSource.<init>(ClusterBinding.java:75)
at com.mongodb.binding.ClusterBinding$ClusterBindingConnectionSource.<init>(ClusterBinding.java:71)
at com.mongodb.binding.ClusterBinding.getWriteConnectionSource(ClusterBinding.java:68)
at com.mongodb.operation.OperationHelper.withConnection(OperationHelper.java:219)
at com.mongodb.operation.MixedBulkWriteOperation.execute(MixedBulkWriteOperation.java:168)
at com.mongodb.operation.MixedBulkWriteOperation.execute(MixedBulkWriteOperation.java:74)
at com.mongodb.Mongo.execute(Mongo.java:781)
at com.mongodb.Mongo$2.execute(Mongo.java:764)
at com.mongodb.MongoCollectionImpl.insertMany(MongoCollectionImpl.java:323)
at com.mongodb.MongoCollectionImpl.insertMany(MongoCollectionImpl.java:311)
at org.apache.beam.sdk.io.mongodb.MongoDbIO$Write$WriteFn.flush(MongoDbIO.java:667)
at org.apache.beam.sdk.io.mongodb.MongoDbIO$Write$WriteFn.processElement(MongoDbIO.java:652)
com.mongodb.MongoSocketReadException: Prematurely reached end of stream
at com.mongodb.connection.SocketStream.read(SocketStream.java:88)
at com.mongodb.connection.InternalStreamConnection.receiveResponseBuffers(InternalStreamConnection.java:491)
at com.mongodb.connection.InternalStreamConnection.receiveMessage(InternalStreamConnection.java:221)
at com.mongodb.connection.UsageTrackingInternalConnection.receiveMessage(UsageTrackingInternalConnection.java:102)
at com.mongodb.connection.DefaultConnectionPool$PooledConnection.receiveMessage(DefaultConnectionPool.java:435)
at com.mongodb.connection.WriteCommandProtocol.receiveMessage(WriteCommandProtocol.java:234)
at com.mongodb.connection.WriteCommandProtocol.execute(WriteCommandProtocol.java:104)
at com.mongodb.connection.InsertCommandProtocol.execute(InsertCommandProtocol.java:67)
at com.mongodb.connection.InsertCommandProtocol.execute(InsertCommandProtocol.java:37)
at com.mongodb.connection.DefaultServer$DefaultServerProtocolExecutor.execute(DefaultServer.java:159)
at com.mongodb.connection.DefaultServerConnection.executeProtocol(DefaultServerConnection.java:286)
at com.mongodb.connection.DefaultServerConnection.insertCommand(DefaultServerConnection.java:115)
at com.mongodb.operation.MixedBulkWriteOperation$Run$2.executeWriteCommandProtocol(MixedBulkWriteOperation.java:455)
at com.mongodb.operation.MixedBulkWriteOperation$Run$RunExecutor.execute(MixedBulkWriteOperation.java:646)
at com.mongodb.operation.MixedBulkWriteOperation$Run.execute(MixedBulkWriteOperation.java:401)
at com.mongodb.operation.MixedBulkWriteOperation$1.call(MixedBulkWriteOperation.java:179)
at com.mongodb.operation.MixedBulkWriteOperation$1.call(MixedBulkWriteOperation.java:168)
at com.mongodb.operation.OperationHelper.withConnectionSource(OperationHelper.java:230)
at com.mongodb.operation.OperationHelper.withConnection(OperationHelper.java:221)
at com.mongodb.operation.MixedBulkWriteOperation.execute(MixedBulkWriteOperation.java:168)
at com.mongodb.operation.MixedBulkWriteOperation.execute(MixedBulkWriteOperation.java:74)
at com.mongodb.Mongo.execute(Mongo.java:781)
at com.mongodb.Mongo$2.execute(Mongo.java:764)
at com.mongodb.MongoCollectionImpl.insertMany(MongoCollectionImpl.java:323)
at com.mongodb.MongoCollectionImpl.insertMany(MongoCollectionImpl.java:311)
at org.apache.beam.sdk.io.mongodb.MongoDbIO$Write$WriteFn.flush(MongoDbIO.java:667)
at org.apache.beam.sdk.io.mongodb.MongoDbIO$Write$WriteFn.processElement(MongoDbIO.java:652)
com.mongodb.MongoTimeoutException: Timed out after 30000 ms while waiting for a server that matches WritableServerSelector. Client view of cluster state is {type=UNKNOWN, servers=[{address=35.202.74.112:27017, type=UNKNOWN, state=CONNECTING, exception={com.mongodb.MongoSocketOpenException: Exception opening socket}, caused by {java.net.SocketTimeoutException: connect timed out}}]
at com.mongodb.connection.BaseCluster.createTimeoutException(BaseCluster.java:369)
at com.mongodb.connection.BaseCluster.selectServer(BaseCluster.java:101)
at com.mongodb.binding.ClusterBinding$ClusterBindingConnectionSource.<init>(ClusterBinding.java:75)
at com.mongodb.binding.ClusterBinding$ClusterBindingConnectionSource.<init>(ClusterBinding.java:71)
at com.mongodb.binding.ClusterBinding.getWriteConnectionSource(ClusterBinding.java:68)
at com.mongodb.operation.OperationHelper.withConnection(OperationHelper.java:219)
at com.mongodb.operation.MixedBulkWriteOperation.execute(MixedBulkWriteOperation.java:168)
at com.mongodb.operation.MixedBulkWriteOperation.execute(MixedBulkWriteOperation.java:74)
at com.mongodb.Mongo.execute(Mongo.java:781)
at com.mongodb.Mongo$2.execute(Mongo.java:764)
at com.mongodb.MongoCollectionImpl.insertMany(MongoCollectionImpl.java:323)
at com.mongodb.MongoCollectionImpl.insertMany(MongoCollectionImpl.java:311)
at org.apache.beam.sdk.io.mongodb.MongoDbIO$Write$WriteFn.flush(MongoDbIO.java:667)
at org.apache.beam.sdk.io.mongodb.MongoDbIO$Write$WriteFn.processElement(MongoDbIO.java:652)
com.mongodb.MongoTimeoutException: Timed out after 30000 ms while waiting for a server that matches WritableServerSelector. Client view of cluster state is {type=UNKNOWN, servers=[{address=35.202.74.112:27017, type=UNKNOWN, state=CONNECTING, exception={com.mongodb.MongoSocketOpenException: Exception opening socket}, caused by {java.net.SocketTimeoutException: connect timed out}}]
at com.mongodb.connection.BaseCluster.createTimeoutException(BaseCluster.java:369)
at com.mongodb.connection.BaseCluster.selectServer(BaseCluster.java:101)
at com.mongodb.binding.ClusterBinding$ClusterBindingConnectionSource.<init>(ClusterBinding.java:75)
at com.mongodb.binding.ClusterBinding$ClusterBindingConnectionSource.<init>(ClusterBinding.java:71)
at com.mongodb.binding.ClusterBinding.getWriteConnectionSource(ClusterBinding.java:68)
at com.mongodb.operation.OperationHelper.withConnection(OperationHelper.java:219)
at com.mongodb.operation.MixedBulkWriteOperation.execute(MixedBulkWriteOperation.java:168)
at com.mongodb.operation.MixedBulkWriteOperation.execute(MixedBulkWriteOperation.java:74)
at com.mongodb.Mongo.execute(Mongo.java:781)
at com.mongodb.Mongo$2.execute(Mongo.java:764)
at com.mongodb.MongoCollectionImpl.insertMany(MongoCollectionImpl.java:323)
at com.mongodb.MongoCollectionImpl.insertMany(MongoCollectionImpl.java:311)
at org.apache.beam.sdk.io.mongodb.MongoDbIO$Write$WriteFn.flush(MongoDbIO.java:667)
at org.apache.beam.sdk.io.mongodb.MongoDbIO$Write$WriteFn.processElement(MongoDbIO.java:652)
com.mongodb.MongoTimeoutException: Timed out after 30000 ms while waiting for a server that matches WritableServerSelector. Client view of cluster state is {type=UNKNOWN, servers=[{address=35.202.74.112:27017, type=UNKNOWN, state=CONNECTING, exception={com.mongodb.MongoSocketOpenException: Exception opening socket}, caused by {java.net.SocketTimeoutException: connect timed out}}]
at com.mongodb.connection.BaseCluster.createTimeoutException(BaseCluster.java:369)
at com.mongodb.connection.BaseCluster.selectServer(BaseCluster.java:101)
at com.mongodb.binding.ClusterBinding$ClusterBindingConnectionSource.<init>(ClusterBinding.java:75)
at com.mongodb.binding.ClusterBinding$ClusterBindingConnectionSource.<init>(ClusterBinding.java:71)
at com.mongodb.binding.ClusterBinding.getWriteConnectionSource(ClusterBinding.java:68)
at com.mongodb.operation.OperationHelper.withConnection(OperationHelper.java:219)
at com.mongodb.operation.MixedBulkWriteOperation.execute(MixedBulkWriteOperation.java:168)
at com.mongodb.operation.MixedBulkWriteOperation.execute(MixedBulkWriteOperation.java:74)
at com.mongodb.Mongo.execute(Mongo.java:781)
at com.mongodb.Mongo$2.execute(Mongo.java:764)
at com.mongodb.MongoCollectionImpl.insertMany(MongoCollectionImpl.java:323)
at com.mongodb.MongoCollectionImpl.insertMany(MongoCollectionImpl.java:311)
at org.apache.beam.sdk.io.mongodb.MongoDbIO$Write$WriteFn.flush(MongoDbIO.java:667)
at org.apache.beam.sdk.io.mongodb.MongoDbIO$Write$WriteFn.processElement(MongoDbIO.java:652)
com.mongodb.MongoTimeoutException: Timed out after 30000 ms while waiting for a server that matches WritableServerSelector. Client view of cluster state is {type=UNKNOWN, servers=[{address=35.202.74.112:27017, type=UNKNOWN, state=CONNECTING, exception={com.mongodb.MongoSocketOpenException: Exception opening socket}, caused by {java.net.SocketTimeoutException: connect timed out}}]
at com.mongodb.connection.BaseCluster.createTimeoutException(BaseCluster.java:369)
at com.mongodb.connection.BaseCluster.selectServer(BaseCluster.java:101)
at com.mongodb.binding.ClusterBinding$ClusterBindingConnectionSource.<init>(ClusterBinding.java:75)
at com.mongodb.binding.ClusterBinding$ClusterBindingConnectionSource.<init>(ClusterBinding.java:71)
at com.mongodb.binding.ClusterBinding.getWriteConnectionSource(ClusterBinding.java:68)
at com.mongodb.operation.OperationHelper.withConnection(OperationHelper.java:219)
at com.mongodb.operation.MixedBulkWriteOperation.execute(MixedBulkWriteOperation.java:168)
at com.mongodb.operation.MixedBulkWriteOperation.execute(MixedBulkWriteOperation.java:74)
at com.mongodb.Mongo.execute(Mongo.java:781)
at com.mongodb.Mongo$2.execute(Mongo.java:764)
at com.mongodb.MongoCollectionImpl.insertMany(MongoCollectionImpl.java:323)
at com.mongodb.MongoCollectionImpl.insertMany(MongoCollectionImpl.java:311)
at org.apache.beam.sdk.io.mongodb.MongoDbIO$Write$WriteFn.flush(MongoDbIO.java:667)
at org.apache.beam.sdk.io.mongodb.MongoDbIO$Write$WriteFn.processElement(MongoDbIO.java:652)
com.mongodb.MongoTimeoutException: Timed out after 30000 ms while waiting for a server that matches WritableServerSelector. Client view of cluster state is {type=UNKNOWN, servers=[{address=35.202.74.112:27017, type=UNKNOWN, state=CONNECTING, exception={com.mongodb.MongoSocketOpenException: Exception opening socket}, caused by {java.net.SocketTimeoutException: connect timed out}}]
at com.mongodb.connection.BaseCluster.createTimeoutException(BaseCluster.java:369)
at com.mongodb.connection.BaseCluster.selectServer(BaseCluster.java:101)
at com.mongodb.binding.ClusterBinding$ClusterBindingConnectionSource.<init>(ClusterBinding.java:75)
at com.mongodb.binding.ClusterBinding$ClusterBindingConnectionSource.<init>(ClusterBinding.java:71)
at com.mongodb.binding.ClusterBinding.getWriteConnectionSource(ClusterBinding.java:68)
at com.mongodb.operation.OperationHelper.withConnection(OperationHelper.java:219)
at com.mongodb.operation.MixedBulkWriteOperation.execute(MixedBulkWriteOperation.java:168)
at com.mongodb.operation.MixedBulkWriteOperation.execute(MixedBulkWriteOperation.java:74)
at com.mongodb.Mongo.execute(Mongo.java:781)
at com.mongodb.Mongo$2.execute(Mongo.java:764)
at com.mongodb.MongoCollectionImpl.insertMany(MongoCollectionImpl.java:323)
at com.mongodb.MongoCollectionImpl.insertMany(MongoCollectionImpl.java:311)
at org.apache.beam.sdk.io.mongodb.MongoDbIO$Write$WriteFn.flush(MongoDbIO.java:667)
at org.apache.beam.sdk.io.mongodb.MongoDbIO$Write$WriteFn.processElement(MongoDbIO.java:652)
Workflow failed. Causes: S01:Generate sequence/Read(BoundedCountingSource)+Produce documents/Map+Write documents to MongoDB/ParDo(Write) failed., A work item was attempted 4 times without success. Each time the worker eventually lost contact with the service. The work item was attempted on:
mongodbioit0testwriteandr-06022304-k8wx-harness-xrbv,
mongodbioit0testwriteandr-06022304-k8wx-harness-xrbv,
mongodbioit0testwriteandr-06022304-k8wx-harness-xrbv,
mongodbioit0testwriteandr-06022304-k8wx-harness-xrbv
at org.apache.beam.runners.dataflow.TestDataflowRunner.run(TestDataflowRunner.java:134)
at org.apache.beam.runners.dataflow.TestDataflowRunner.run(TestDataflowRunner.java:90)
at org.apache.beam.runners.dataflow.TestDataflowRunner.run(TestDataflowRunner.java:55)
at org.apache.beam.sdk.Pipeline.run(Pipeline.java:311)
at org.apache.beam.sdk.testing.TestPipeline.run(TestPipeline.java:348)
at org.apache.beam.sdk.testing.TestPipeline.run(TestPipeline.java:329)
at org.apache.beam.sdk.io.mongodb.MongoDBIOIT.testWriteAndRead(MongoDBIOIT.java:118)
1 test completed, 1 failed
Finished generating test XML results (0.019 secs) into: <https://builds.apache.org/job/beam_PerformanceTests_MongoDBIO_IT/ws/src/sdks/java/io/mongodb/build/test-results/integrationTest>
Generating HTML test report...
Finished generating test html results (0.029 secs) into: <https://builds.apache.org/job/beam_PerformanceTests_MongoDBIO_IT/ws/src/sdks/java/io/mongodb/build/reports/tests/integrationTest>
:beam-sdks-java-io-mongodb:integrationTest (Thread[Task worker for ':' Thread 12,5,main]) completed. Took 10 mins 5.323 secs.
Deprecated Gradle features were used in this build, making it incompatible with Gradle 5.0.
See https://docs.gradle.org/4.7/userguide/command_line_interface.html#sec:command_line_warnings
BUILD FAILED in 10m 15s
62 actionable tasks: 1 executed, 61 up-to-date
Publishing build scan...
https://gradle.com/s/glan2kjqoftkm
STDERR:
FAILURE: Build failed with an exception.
* What went wrong:
Execution failed for task ':beam-sdks-java-io-mongodb:integrationTest'.
> There were failing tests. See the report at: file://<https://builds.apache.org/job/beam_PerformanceTests_MongoDBIO_IT/ws/src/sdks/java/io/mongodb/build/reports/tests/integrationTest/index.html>
* Try:
Run with --debug option to get more log output. Run with --scan to get full insights.
* Exception is:
org.gradle.api.tasks.TaskExecutionException: Execution failed for task ':beam-sdks-java-io-mongodb:integrationTest'.
at org.gradle.api.internal.tasks.execution.ExecuteActionsTaskExecuter.executeActions(ExecuteActionsTaskExecuter.java:103)
at org.gradle.api.internal.tasks.execution.ExecuteActionsTaskExecuter.execute(ExecuteActionsTaskExecuter.java:73)
at org.gradle.api.internal.tasks.execution.OutputDirectoryCreatingTaskExecuter.execute(OutputDirectoryCreatingTaskExecuter.java:51)
at org.gradle.api.internal.tasks.execution.SkipCachedTaskExecuter.execute(SkipCachedTaskExecuter.java:105)
at org.gradle.api.internal.tasks.execution.SkipUpToDateTaskExecuter.execute(SkipUpToDateTaskExecuter.java:59)
at org.gradle.api.internal.tasks.execution.ResolveTaskOutputCachingStateExecuter.execute(ResolveTaskOutputCachingStateExecuter.java:54)
at org.gradle.api.internal.tasks.execution.ResolveBuildCacheKeyExecuter.execute(ResolveBuildCacheKeyExecuter.java:66)
at org.gradle.api.internal.tasks.execution.ValidatingTaskExecuter.execute(ValidatingTaskExecuter.java:59)
at org.gradle.api.internal.tasks.execution.SkipEmptySourceFilesTaskExecuter.execute(SkipEmptySourceFilesTaskExecuter.java:101)
at org.gradle.api.internal.tasks.execution.FinalizeInputFilePropertiesTaskExecuter.execute(FinalizeInputFilePropertiesTaskExecuter.java:44)
at org.gradle.api.internal.tasks.execution.CleanupStaleOutputsExecuter.execute(CleanupStaleOutputsExecuter.java:91)
at org.gradle.api.internal.tasks.execution.ResolveTaskArtifactStateTaskExecuter.execute(ResolveTaskArtifactStateTaskExecuter.java:62)
at org.gradle.api.internal.tasks.execution.SkipTaskWithNoActionsExecuter.execute(SkipTaskWithNoActionsExecuter.java:59)
at org.gradle.api.internal.tasks.execution.SkipOnlyIfTaskExecuter.execute(SkipOnlyIfTaskExecuter.java:54)
at org.gradle.api.internal.tasks.execution.ExecuteAtMostOnceTaskExecuter.execute(ExecuteAtMostOnceTaskExecuter.java:43)
at org.gradle.api.internal.tasks.execution.CatchExceptionTaskExecuter.execute(CatchExceptionTaskExecuter.java:34)
at org.gradle.execution.taskgraph.DefaultTaskGraphExecuter$EventFiringTaskWorker$1.run(DefaultTaskGraphExecuter.java:256)
at org.gradle.internal.operations.DefaultBuildOperationExecutor$RunnableBuildOperationWorker.execute(DefaultBuildOperationExecutor.java:317)
at org.gradle.internal.operations.DefaultBuildOperationExecutor$RunnableBuildOperationWorker.execute(DefaultBuildOperationExecutor.java:309)
at org.gradle.internal.operations.DefaultBuildOperationExecutor.execute(DefaultBuildOperationExecutor.java:185)
at org.gradle.internal.operations.DefaultBuildOperationExecutor.run(DefaultBuildOperationExecutor.java:97)
at org.gradle.internal.operations.DelegatingBuildOperationExecutor.run(DelegatingBuildOperationExecutor.java:31)
at org.gradle.execution.taskgraph.DefaultTaskGraphExecuter$EventFiringTaskWorker.execute(DefaultTaskGraphExecuter.java:249)
at org.gradle.execution.taskgraph.DefaultTaskGraphExecuter$EventFiringTaskWorker.execute(DefaultTaskGraphExecuter.java:238)
at org.gradle.execution.taskgraph.DefaultTaskPlanExecutor$TaskExecutorWorker$1.execute(DefaultTaskPlanExecutor.java:104)
at org.gradle.execution.taskgraph.DefaultTaskPlanExecutor$TaskExecutorWorker$1.execute(DefaultTaskPlanExecutor.java:98)
at org.gradle.execution.taskgraph.DefaultTaskExecutionPlan.execute(DefaultTaskExecutionPlan.java:663)
at org.gradle.execution.taskgraph.DefaultTaskExecutionPlan.executeWithTask(DefaultTaskExecutionPlan.java:596)
at org.gradle.execution.taskgraph.DefaultTaskPlanExecutor$TaskExecutorWorker.run(DefaultTaskPlanExecutor.java:98)
at org.gradle.internal.concurrent.ExecutorPolicy$CatchAndRecordFailures.onExecute(ExecutorPolicy.java:63)
at org.gradle.internal.concurrent.ManagedExecutorImpl$1.run(ManagedExecutorImpl.java:46)
at org.gradle.internal.concurrent.ThreadFactoryImpl$ManagedThreadRunnable.run(ThreadFactoryImpl.java:55)
Caused by: org.gradle.api.GradleException: There were failing tests. See the report at: file://<https://builds.apache.org/job/beam_PerformanceTests_MongoDBIO_IT/ws/src/sdks/java/io/mongodb/build/reports/tests/integrationTest/index.html>
at org.gradle.api.tasks.testing.AbstractTestTask.handleTestFailures(AbstractTestTask.java:612)
at org.gradle.api.tasks.testing.AbstractTestTask.executeTests(AbstractTestTask.java:484)
at org.gradle.api.tasks.testing.Test.executeTests(Test.java:583)
at org.gradle.internal.reflect.JavaMethod.invoke(JavaMethod.java:73)
at org.gradle.api.internal.project.taskfactory.StandardTaskAction.doExecute(StandardTaskAction.java:46)
at org.gradle.api.internal.project.taskfactory.StandardTaskAction.execute(StandardTaskAction.java:39)
at org.gradle.api.internal.project.taskfactory.StandardTaskAction.execute(StandardTaskAction.java:26)
at org.gradle.api.internal.AbstractTask$TaskActionWrapper.execute(AbstractTask.java:794)
at org.gradle.api.internal.AbstractTask$TaskActionWrapper.execute(AbstractTask.java:761)
at org.gradle.api.internal.tasks.execution.ExecuteActionsTaskExecuter$1.run(ExecuteActionsTaskExecuter.java:124)
at org.gradle.internal.operations.DefaultBuildOperationExecutor$RunnableBuildOperationWorker.execute(DefaultBuildOperationExecutor.java:317)
at org.gradle.internal.operations.DefaultBuildOperationExecutor$RunnableBuildOperationWorker.execute(DefaultBuildOperationExecutor.java:309)
at org.gradle.internal.operations.DefaultBuildOperationExecutor.execute(DefaultBuildOperationExecutor.java:185)
at org.gradle.internal.operations.DefaultBuildOperationExecutor.run(DefaultBuildOperationExecutor.java:97)
at org.gradle.internal.operations.DelegatingBuildOperationExecutor.run(DelegatingBuildOperationExecutor.java:31)
at org.gradle.api.internal.tasks.execution.ExecuteActionsTaskExecuter.executeAction(ExecuteActionsTaskExecuter.java:113)
at org.gradle.api.internal.tasks.execution.ExecuteActionsTaskExecuter.executeActions(ExecuteActionsTaskExecuter.java:95)
... 31 more
* Get more help at https://help.gradle.org
2018-06-03 06:14:22,594 e9461a09 MainThread beam_integration_benchmark(1/1) ERROR Error during benchmark beam_integration_benchmark
Traceback (most recent call last):
File "<https://builds.apache.org/job/beam_PerformanceTests_MongoDBIO_IT/ws/PerfKitBenchmarker/perfkitbenchmarker/pkb.py",> line 667, in RunBenchmark
DoRunPhase(spec, collector, detailed_timer)
File "<https://builds.apache.org/job/beam_PerformanceTests_MongoDBIO_IT/ws/PerfKitBenchmarker/perfkitbenchmarker/pkb.py",> line 547, in DoRunPhase
samples = spec.BenchmarkRun(spec)
File "<https://builds.apache.org/job/beam_PerformanceTests_MongoDBIO_IT/ws/PerfKitBenchmarker/perfkitbenchmarker/linux_benchmarks/beam_integration_benchmark.py",> line 159, in Run
job_type=job_type)
File "<https://builds.apache.org/job/beam_PerformanceTests_MongoDBIO_IT/ws/PerfKitBenchmarker/perfkitbenchmarker/providers/gcp/gcp_dpb_dataflow.py",> line 90, in SubmitJob
assert retcode == 0, "Integration Test Failed."
AssertionError: Integration Test Failed.
2018-06-03 06:14:22,595 e9461a09 MainThread beam_integration_benchmark(1/1) INFO Cleaning up benchmark beam_integration_benchmark
2018-06-03 06:14:22,596 e9461a09 MainThread beam_integration_benchmark(1/1) INFO Running: kubectl --kubeconfig=<https://builds.apache.org/job/beam_PerformanceTests_MongoDBIO_IT/ws/config-mongodbioit-253> delete -f <https://builds.apache.org/job/beam_PerformanceTests_MongoDBIO_IT/ws/src/.test-infra/kubernetes/mongodb/load-balancer/mongo.yml> --ignore-not-found
2018-06-03 06:14:23,261 e9461a09 MainThread beam_integration_benchmark(1/1) ERROR Exception running benchmark
Traceback (most recent call last):
File "<https://builds.apache.org/job/beam_PerformanceTests_MongoDBIO_IT/ws/PerfKitBenchmarker/perfkitbenchmarker/pkb.py",> line 801, in RunBenchmarkTask
RunBenchmark(spec, collector)
File "<https://builds.apache.org/job/beam_PerformanceTests_MongoDBIO_IT/ws/PerfKitBenchmarker/perfkitbenchmarker/pkb.py",> line 667, in RunBenchmark
DoRunPhase(spec, collector, detailed_timer)
File "<https://builds.apache.org/job/beam_PerformanceTests_MongoDBIO_IT/ws/PerfKitBenchmarker/perfkitbenchmarker/pkb.py",> line 547, in DoRunPhase
samples = spec.BenchmarkRun(spec)
File "<https://builds.apache.org/job/beam_PerformanceTests_MongoDBIO_IT/ws/PerfKitBenchmarker/perfkitbenchmarker/linux_benchmarks/beam_integration_benchmark.py",> line 159, in Run
job_type=job_type)
File "<https://builds.apache.org/job/beam_PerformanceTests_MongoDBIO_IT/ws/PerfKitBenchmarker/perfkitbenchmarker/providers/gcp/gcp_dpb_dataflow.py",> line 90, in SubmitJob
assert retcode == 0, "Integration Test Failed."
AssertionError: Integration Test Failed.
2018-06-03 06:14:23,261 e9461a09 MainThread beam_integration_benchmark(1/1) ERROR Benchmark 1/1 beam_integration_benchmark (UID: beam_integration_benchmark0) failed. Execution will continue.
2018-06-03 06:14:23,295 e9461a09 MainThread INFO Benchmark run statuses:
---------------------------------------------------------------------------------
Name UID Status Failed Substatus
---------------------------------------------------------------------------------
beam_integration_benchmark beam_integration_benchmark0 FAILED
---------------------------------------------------------------------------------
Success rate: 0.00% (0/1)
2018-06-03 06:14:23,295 e9461a09 MainThread INFO Complete logs can be found at: <https://builds.apache.org/job/beam_PerformanceTests_MongoDBIO_IT/ws/runs/e9461a09/pkb.log>
2018-06-03 06:14:23,295 e9461a09 MainThread INFO Completion statuses can be found at: <https://builds.apache.org/job/beam_PerformanceTests_MongoDBIO_IT/ws/runs/e9461a09/completion_statuses.json>
Build step 'Execute shell' marked build as failure