You are viewing a plain text version of this content. The canonical link for it is here.
Posted to builds@beam.apache.org by Apache Jenkins Server <je...@builds.apache.org> on 2023/07/03 19:48:36 UTC
Build failed in Jenkins: beam_PreCommit_Java_Examples_Dataflow_Java17_Cron #2182
See <https://ci-beam.apache.org/job/beam_PreCommit_Java_Examples_Dataflow_Java17_Cron/2182/display/redirect?page=changes>
Changes:
[noreply] Upgrade obsolete Avro plugin to 0.16.0 (#27232)
------------------------------------------
[...truncated 10.31 KB...]
> Task :buildSrc:compileTestGroovy NO-SOURCE
> Task :buildSrc:processTestResources NO-SOURCE
> Task :buildSrc:testClasses UP-TO-DATE
> Task :buildSrc:test NO-SOURCE
> Task :buildSrc:validatePlugins UP-TO-DATE
> Task :buildSrc:check UP-TO-DATE
> Task :buildSrc:build UP-TO-DATE
> Configure project :sdks:java:container:java8
docker-pull-licenses set, creating go-licenses
> Configure project :sdks:java:container:java11
docker-pull-licenses set, creating go-licenses
> Configure project :sdks:go:container
docker-pull-licenses set, running go-licenses
> Configure project :sdks:java:container:java17
docker-pull-licenses set, creating go-licenses
> Task :sdks:java:extensions:google-cloud-platform-core:processResources NO-SOURCE
> Task :sdks:java:core:generateAvroProtocol NO-SOURCE
> Task :sdks:java:fn-execution:processResources NO-SOURCE
> Task :runners:core-construction-java:processResources NO-SOURCE
> Task :sdks:java:extensions:avro:generateAvroProtocol NO-SOURCE
> Task :sdks:java:harness:processResources NO-SOURCE
> Task :runners:core-java:processResources NO-SOURCE
> Task :sdks:java:expansion-service:processResources NO-SOURCE
> Task :runners:java-fn-execution:processResources NO-SOURCE
> Task :sdks:java:extensions:ml:processResources NO-SOURCE
> Task :sdks:java:extensions:avro:generateAvroJava NO-SOURCE
> Task :sdks:java:core:generateAvroJava NO-SOURCE
> Task :sdks:java:extensions:avro:processResources NO-SOURCE
> Task :sdks:java:io:kafka:processResources NO-SOURCE
> Task :examples:java:processResources NO-SOURCE
> Task :sdks:java:extensions:arrow:processResources NO-SOURCE
> Task :sdks:java:io:google-cloud-platform:processResources NO-SOURCE
> Task :runners:local-java:processResources NO-SOURCE
> Task :runners:direct-java:processResources NO-SOURCE
> Task :runners:google-cloud-dataflow-java:examples:compileJava NO-SOURCE
> Task :runners:google-cloud-dataflow-java:examples:processResources NO-SOURCE
> Task :runners:google-cloud-dataflow-java:examples:classes UP-TO-DATE
> Task :runners:google-cloud-dataflow-java:examples:compileTestJava NO-SOURCE
> Task :runners:google-cloud-dataflow-java:examples:processTestResources NO-SOURCE
> Task :runners:google-cloud-dataflow-java:examples:testClasses UP-TO-DATE
> Task :sdks:java:core:generateGrammarSource FROM-CACHE
> Task :runners:google-cloud-dataflow-java:examples-streaming:compileJava NO-SOURCE
> Task :runners:google-cloud-dataflow-java:examples-streaming:processResources NO-SOURCE
> Task :runners:google-cloud-dataflow-java:examples-streaming:classes UP-TO-DATE
> Task :runners:google-cloud-dataflow-java:examples-streaming:compileTestJava NO-SOURCE
> Task :runners:google-cloud-dataflow-java:examples-streaming:processTestResources NO-SOURCE
> Task :runners:google-cloud-dataflow-java:examples-streaming:testClasses UP-TO-DATE
> Task :runners:core-java:processTestResources NO-SOURCE
> Task :runners:direct-java:processTestResources NO-SOURCE
> Task :runners:google-cloud-dataflow-java:worker:processResources
> Task :sdks:java:extensions:protobuf:extractProto
> Task :model:fn-execution:extractProto
> Task :sdks:java:testing:test-utils:processResources NO-SOURCE
> Task :sdks:java:extensions:python:processResources
> Task :examples:java:processTestResources
> Task :model:job-management:extractProto
> Task :sdks:java:testing:test-utils:processTestResources NO-SOURCE
> Task :sdks:java:extensions:protobuf:processResources NO-SOURCE
> Task :model:job-management:processResources
> Task :model:fn-execution:processResources
> Task :sdks:java:core:processResources
> Task :runners:google-cloud-dataflow-java:processResources
> Task :sdks:java:core:generateTestAvroProtocol NO-SOURCE
> Task :sdks:java:core:generateTestAvroJava FROM-CACHE
> Task :sdks:java:core:generateTestGrammarSource NO-SOURCE
> Task :sdks:java:core:processTestResources
> Task :sdks:java:transform-service:launcher:compileJava FROM-CACHE
> Task :sdks:java:transform-service:launcher:processResources
> Task :sdks:java:transform-service:launcher:classes
> Task :sdks:java:transform-service:launcher:shadowJar FROM-CACHE
> Task :runners:google-cloud-dataflow-java:worker:windmill:extractIncludeProto
> Task :runners:google-cloud-dataflow-java:worker:windmill:extractProto
> Task :model:pipeline:extractIncludeProto
> Task :model:pipeline:extractProto
> Task :runners:google-cloud-dataflow-java:worker:windmill:generateProto FROM-CACHE
> Task :model:pipeline:generateProto FROM-CACHE
> Task :model:pipeline:compileJava FROM-CACHE
> Task :model:pipeline:processResources
> Task :model:pipeline:classes
> Task :model:pipeline:jar
> Task :model:pipeline:shadowJar FROM-CACHE
> Task :model:fn-execution:extractIncludeProto
> Task :model:job-management:extractIncludeProto
> Task :model:job-management:generateProto FROM-CACHE
> Task :model:fn-execution:generateProto FROM-CACHE
> Task :model:fn-execution:compileJava FROM-CACHE
> Task :model:fn-execution:classes
> Task :model:job-management:compileJava FROM-CACHE
> Task :model:job-management:classes
> Task :model:fn-execution:shadowJar FROM-CACHE
> Task :model:job-management:shadowJar FROM-CACHE
> Task :sdks:java:core:compileJava FROM-CACHE
> Task :sdks:java:core:classes
> Task :sdks:java:core:shadowJar FROM-CACHE
> Task :sdks:java:extensions:arrow:compileJava FROM-CACHE
> Task :sdks:java:extensions:arrow:classes UP-TO-DATE
> Task :sdks:java:extensions:arrow:jar
> Task :sdks:java:testing:test-utils:compileJava FROM-CACHE
> Task :sdks:java:testing:test-utils:classes UP-TO-DATE
> Task :runners:local-java:compileJava FROM-CACHE
> Task :runners:local-java:classes UP-TO-DATE
> Task :runners:local-java:jar
> Task :sdks:java:extensions:avro:compileJava FROM-CACHE
> Task :sdks:java:extensions:avro:classes UP-TO-DATE
> Task :sdks:java:extensions:avro:jar
> Task :sdks:java:fn-execution:compileJava FROM-CACHE
> Task :sdks:java:fn-execution:classes UP-TO-DATE
> Task :sdks:java:fn-execution:jar
> Task :sdks:java:extensions:protobuf:extractIncludeProto
> Task :sdks:java:extensions:protobuf:generateProto NO-SOURCE
> Task :runners:core-construction-java:compileJava FROM-CACHE
> Task :runners:core-construction-java:classes UP-TO-DATE
> Task :sdks:java:extensions:protobuf:compileJava FROM-CACHE
> Task :sdks:java:extensions:protobuf:classes UP-TO-DATE
> Task :runners:core-construction-java:jar
> Task :sdks:java:extensions:protobuf:jar
> Task :runners:core-java:compileJava FROM-CACHE
> Task :runners:core-java:classes UP-TO-DATE
> Task :sdks:java:extensions:python:compileJava FROM-CACHE
> Task :sdks:java:extensions:python:classes
> Task :runners:core-java:jar
> Task :sdks:java:extensions:python:jar
> Task :sdks:java:extensions:google-cloud-platform-core:compileJava FROM-CACHE
> Task :sdks:java:extensions:google-cloud-platform-core:classes UP-TO-DATE
> Task :sdks:java:extensions:google-cloud-platform-core:jar
> Task :sdks:java:harness:compileJava FROM-CACHE
> Task :sdks:java:harness:classes UP-TO-DATE
> Task :sdks:java:harness:jar
> Task :runners:java-fn-execution:compileJava FROM-CACHE
> Task :runners:java-fn-execution:classes UP-TO-DATE
> Task :runners:java-fn-execution:jar
> Task :sdks:java:expansion-service:compileJava FROM-CACHE
> Task :sdks:java:expansion-service:classes UP-TO-DATE
> Task :sdks:java:expansion-service:jar
> Task :runners:direct-java:compileJava FROM-CACHE
> Task :runners:direct-java:classes UP-TO-DATE
> Task :sdks:java:io:kafka:compileJava FROM-CACHE
> Task :sdks:java:io:kafka:classes UP-TO-DATE
> Task :sdks:java:extensions:ml:compileJava FROM-CACHE
> Task :sdks:java:extensions:ml:classes UP-TO-DATE
> Task :sdks:java:harness:shadowJar FROM-CACHE
> Task :sdks:java:extensions:ml:jar
> Task :sdks:java:io:kafka:jar
> Task :runners:direct-java:shadowJar FROM-CACHE
> Task :sdks:java:io:google-cloud-platform:compileJava FROM-CACHE
> Task :sdks:java:io:google-cloud-platform:classes UP-TO-DATE
> Task :sdks:java:io:google-cloud-platform:jar
> Task :runners:google-cloud-dataflow-java:compileJava FROM-CACHE
> Task :runners:google-cloud-dataflow-java:classes
> Task :runners:google-cloud-dataflow-java:jar
> Task :examples:java:compileJava FROM-CACHE
> Task :examples:java:classes UP-TO-DATE
> Task :examples:java:jar
> Task :examples:java:compileTestJava FROM-CACHE
> Task :examples:java:testClasses
> Task :examples:java:testJar
> Task :sdks:java:testing:test-utils:compileTestJava
Note: <https://ci-beam.apache.org/job/beam_PreCommit_Java_Examples_Dataflow_Java17_Cron/ws/src/sdks/java/testing/test-utils/src/test/java/org/apache/beam/sdk/testutils/publishing/InfluxDBPublisherTest.java> uses or overrides a deprecated API.
Note: Recompile with -Xlint:deprecation for details.
> Task :sdks:java:testing:test-utils:testClasses
> Task :runners:google-cloud-dataflow-java:worker:windmill:compileJava
> Task :runners:google-cloud-dataflow-java:worker:windmill:processResources
> Task :runners:google-cloud-dataflow-java:worker:windmill:classes
> Task :runners:google-cloud-dataflow-java:worker:windmill:shadowJar FROM-CACHE
> Task :sdks:java:core:compileTestJava
Note: Some input files use or override a deprecated API.
Note: Recompile with -Xlint:deprecation for details.
Note: Some input files use unchecked or unsafe operations.
Note: Recompile with -Xlint:unchecked for details.
> Task :runners:google-cloud-dataflow-java:worker:compileJava
Note: Some input files use or override a deprecated API.
Note: Recompile with -Xlint:deprecation for details.
Note: Some input files use unchecked or unsafe operations.
Note: Recompile with -Xlint:unchecked for details.
> Task :runners:google-cloud-dataflow-java:worker:classes
> Task :sdks:java:core:testClasses
> Task :sdks:java:core:shadowTestJar
> Task :runners:google-cloud-dataflow-java:worker:shadowJar
> Task :runners:google-cloud-dataflow-java:examples-streaming:appliancePreCommit FROM-CACHE
> Task :runners:google-cloud-dataflow-java:examples:preCommitLegacyWorker FROM-CACHE
> Task :runners:google-cloud-dataflow-java:examples:preCommitLegacyWorkerImpersonate FROM-CACHE
> Task :runners:google-cloud-dataflow-java:examples:preCommit UP-TO-DATE
> Task :runners:core-java:compileTestJava
Note: Some input files use or override a deprecated API.
Note: Recompile with -Xlint:deprecation for details.
Note: Some input files use unchecked or unsafe operations.
Note: Recompile with -Xlint:unchecked for details.
> Task :runners:core-java:testClasses
> Task :runners:core-java:testJar
> Task :runners:direct-java:compileTestJava
Note: Some input files use or override a deprecated API.
Note: Recompile with -Xlint:deprecation for details.
Note: Some input files use unchecked or unsafe operations.
Note: Recompile with -Xlint:unchecked for details.
> Task :runners:direct-java:testClasses
> Task :runners:direct-java:shadowTestJar
> Task :sdks:java:testing:test-utils:verifyJavaVersion17
Java verified
> Task :runners:google-cloud-dataflow-java:examples-streaming:windmillPreCommit
org.apache.beam.examples.WordCountIT > testE2EWordCount FAILED
java.lang.RuntimeException at WordCountIT.java:69
1 test completed, 1 failed
> Task :runners:google-cloud-dataflow-java:examples-streaming:windmillPreCommit FAILED
FAILURE: Build failed with an exception.
* What went wrong:
Execution failed for task ':runners:google-cloud-dataflow-java:examples-streaming:windmillPreCommit'.
> There were failing tests. See the report at: file://<https://ci-beam.apache.org/job/beam_PreCommit_Java_Examples_Dataflow_Java17_Cron/ws/src/runners/google-cloud-dataflow-java/examples-streaming/build/reports/tests/windmillPreCommit/index.html>
* Try:
> Run with --stacktrace option to get the stack trace.
> Run with --info or --debug option to get more log output.
* Get more help at https://help.gradle.org
Deprecated Gradle features were used in this build, making it incompatible with Gradle 8.0.
You can use '--warning-mode all' to show the individual deprecation warnings and determine if they come from your own scripts or plugins.
See https://docs.gradle.org/7.5.1/userguide/command_line_interface.html#sec:command_line_warnings
BUILD FAILED in 16m 55s
100 actionable tasks: 52 executed, 42 from cache, 6 up-to-date
Publishing build scan...
https://ge.apache.org/s/y6ts54vsydjv2
Build step 'Invoke Gradle script' changed build result to FAILURE
Build step 'Invoke Gradle script' marked build as failure
---------------------------------------------------------------------
To unsubscribe, e-mail: builds-unsubscribe@beam.apache.org
For additional commands, e-mail: builds-help@beam.apache.org
Jenkins build is back to normal : beam_PreCommit_Java_Examples_Dataflow_Java17_Cron #2190
Posted by Apache Jenkins Server <je...@builds.apache.org>.
See <https://ci-beam.apache.org/job/beam_PreCommit_Java_Examples_Dataflow_Java17_Cron/2190/display/redirect>
---------------------------------------------------------------------
To unsubscribe, e-mail: builds-unsubscribe@beam.apache.org
For additional commands, e-mail: builds-help@beam.apache.org
Build failed in Jenkins: beam_PreCommit_Java_Examples_Dataflow_Java17_Cron #2189
Posted by Apache Jenkins Server <je...@builds.apache.org>.
See <https://ci-beam.apache.org/job/beam_PreCommit_Java_Examples_Dataflow_Java17_Cron/2189/display/redirect>
Changes:
------------------------------------------
[...truncated 5.68 KB...]
> Task :buildSrc:testClasses UP-TO-DATE
> Task :buildSrc:test NO-SOURCE
> Task :buildSrc:validatePlugins FROM-CACHE
> Task :buildSrc:check UP-TO-DATE
> Task :buildSrc:build
> Task :clean UP-TO-DATE
BUILD SUCCESSFUL in 10s
7 actionable tasks: 4 executed, 2 from cache, 1 up-to-date
Publishing build scan...
https://ge.apache.org/s/3dwtpnhcldem6
Build step 'Invoke Gradle script' changed build result to SUCCESS
[Gradle] - Launching build.
[src] $ <https://ci-beam.apache.org/job/beam_PreCommit_Java_Examples_Dataflow_Java17_Cron/ws/src/gradlew> -PdisableSpotlessCheck=true -PdisableCheckStyle=true -PskipCheckerFramework -PcompileAndRunTestsWithJava17 -Pjava17Home=/usr/lib/jvm/java-17-openjdk-amd64 --continue --max-workers=12 -Dorg.gradle.jvmargs=-Xms2g -Dorg.gradle.jvmargs=-Xmx6g -Dorg.gradle.vfs.watch=false -Pdocker-pull-licenses javaExamplesDataflowPreCommit
To honour the JVM settings for this build a single-use Daemon process will be forked. See https://docs.gradle.org/7.5.1/userguide/gradle_daemon.html#sec:disabling_the_daemon.
Daemon will be stopped at the end of the build
Configuration on demand is an incubating feature.
Gradle Enterprise plugins resolution: https://plugins.gradle.org/m2
Enforcing Gradle Enterprise: https://ge.apache.org, allowUntrustedServer: false
> Task :buildSrc:compileJava NO-SOURCE
> Task :buildSrc:compileGroovy UP-TO-DATE
> Task :buildSrc:pluginDescriptors UP-TO-DATE
> Task :buildSrc:processResources UP-TO-DATE
> Task :buildSrc:classes UP-TO-DATE
> Task :buildSrc:jar UP-TO-DATE
> Task :buildSrc:assemble UP-TO-DATE
> Task :buildSrc:pluginUnderTestMetadata UP-TO-DATE
> Task :buildSrc:compileTestJava NO-SOURCE
> Task :buildSrc:compileTestGroovy NO-SOURCE
> Task :buildSrc:processTestResources NO-SOURCE
> Task :buildSrc:testClasses UP-TO-DATE
> Task :buildSrc:test NO-SOURCE
> Task :buildSrc:validatePlugins UP-TO-DATE
> Task :buildSrc:check UP-TO-DATE
> Task :buildSrc:build UP-TO-DATE
> Configure project :sdks:java:container:java8
docker-pull-licenses set, creating go-licenses
> Configure project :sdks:java:container:java11
docker-pull-licenses set, creating go-licenses
> Configure project :sdks:go:container
docker-pull-licenses set, running go-licenses
> Configure project :sdks:java:container:java17
docker-pull-licenses set, creating go-licenses
> Task :sdks:java:extensions:avro:generateAvroProtocol NO-SOURCE
> Task :sdks:java:fn-execution:processResources NO-SOURCE
> Task :sdks:java:expansion-service:processResources NO-SOURCE
> Task :runners:core-java:processResources NO-SOURCE
> Task :runners:core-construction-java:processResources NO-SOURCE
> Task :sdks:java:core:generateAvroProtocol NO-SOURCE
> Task :runners:java-fn-execution:processResources NO-SOURCE
> Task :sdks:java:harness:processResources NO-SOURCE
> Task :sdks:java:extensions:google-cloud-platform-core:processResources NO-SOURCE
> Task :sdks:java:extensions:ml:processResources NO-SOURCE
> Task :sdks:java:core:generateAvroJava NO-SOURCE
> Task :sdks:java:extensions:avro:generateAvroJava NO-SOURCE
> Task :sdks:java:io:google-cloud-platform:processResources NO-SOURCE
> Task :examples:java:processResources NO-SOURCE
> Task :sdks:java:extensions:avro:processResources NO-SOURCE
> Task :sdks:java:extensions:arrow:processResources NO-SOURCE
> Task :sdks:java:io:kafka:processResources NO-SOURCE
> Task :runners:direct-java:processResources NO-SOURCE
> Task :runners:local-java:processResources NO-SOURCE
> Task :runners:google-cloud-dataflow-java:examples:compileJava NO-SOURCE
> Task :runners:google-cloud-dataflow-java:examples:processResources NO-SOURCE
> Task :runners:google-cloud-dataflow-java:examples:classes UP-TO-DATE
> Task :runners:google-cloud-dataflow-java:examples:compileTestJava NO-SOURCE
> Task :runners:google-cloud-dataflow-java:examples:processTestResources NO-SOURCE
> Task :runners:google-cloud-dataflow-java:examples:testClasses UP-TO-DATE
> Task :runners:google-cloud-dataflow-java:examples-streaming:compileJava NO-SOURCE
> Task :runners:google-cloud-dataflow-java:examples-streaming:processResources NO-SOURCE
> Task :runners:google-cloud-dataflow-java:examples-streaming:classes UP-TO-DATE
> Task :runners:google-cloud-dataflow-java:examples-streaming:compileTestJava NO-SOURCE
> Task :runners:google-cloud-dataflow-java:examples-streaming:processTestResources NO-SOURCE
> Task :runners:google-cloud-dataflow-java:examples-streaming:testClasses UP-TO-DATE
> Task :runners:core-java:processTestResources NO-SOURCE
> Task :runners:direct-java:processTestResources NO-SOURCE
> Task :sdks:java:testing:test-utils:processResources NO-SOURCE
> Task :sdks:java:testing:test-utils:processTestResources NO-SOURCE
> Task :examples:java:processTestResources
> Task :sdks:java:extensions:protobuf:extractProto
> Task :model:job-management:extractProto
> Task :runners:google-cloud-dataflow-java:worker:processResources
> Task :runners:google-cloud-dataflow-java:processResources
> Task :model:fn-execution:extractProto
> Task :sdks:java:extensions:python:processResources
> Task :sdks:java:extensions:protobuf:processResources NO-SOURCE
> Task :sdks:java:core:generateGrammarSource FROM-CACHE
> Task :model:job-management:processResources
> Task :model:fn-execution:processResources
> Task :sdks:java:core:processResources
> Task :sdks:java:core:generateTestAvroProtocol NO-SOURCE
> Task :sdks:java:transform-service:launcher:compileJava FROM-CACHE
> Task :sdks:java:core:generateTestAvroJava FROM-CACHE
> Task :sdks:java:core:generateTestGrammarSource NO-SOURCE
> Task :sdks:java:transform-service:launcher:processResources
> Task :sdks:java:transform-service:launcher:classes
> Task :sdks:java:core:processTestResources
> Task :sdks:java:transform-service:launcher:shadowJar FROM-CACHE
> Task :runners:google-cloud-dataflow-java:worker:windmill:extractIncludeProto
> Task :model:pipeline:extractIncludeProto
> Task :runners:google-cloud-dataflow-java:worker:windmill:extractProto
> Task :model:pipeline:extractProto
> Task :runners:google-cloud-dataflow-java:worker:windmill:generateProto FROM-CACHE
> Task :model:pipeline:generateProto FROM-CACHE
> Task :runners:google-cloud-dataflow-java:worker:windmill:compileJava FROM-CACHE
> Task :runners:google-cloud-dataflow-java:worker:windmill:processResources
> Task :runners:google-cloud-dataflow-java:worker:windmill:classes
> Task :runners:google-cloud-dataflow-java:worker:windmill:shadowJar FROM-CACHE
> Task :model:pipeline:compileJava FROM-CACHE
> Task :model:pipeline:processResources
> Task :model:pipeline:classes
> Task :model:pipeline:jar
> Task :model:pipeline:shadowJar FROM-CACHE
> Task :model:job-management:extractIncludeProto
> Task :model:fn-execution:extractIncludeProto
> Task :model:job-management:generateProto FROM-CACHE
> Task :model:fn-execution:generateProto FROM-CACHE
> Task :model:job-management:compileJava FROM-CACHE
> Task :model:job-management:classes
> Task :model:fn-execution:compileJava FROM-CACHE
> Task :model:fn-execution:classes
> Task :model:job-management:shadowJar FROM-CACHE
> Task :model:fn-execution:shadowJar FROM-CACHE
> Task :sdks:java:core:compileJava FROM-CACHE
> Task :sdks:java:core:classes
> Task :sdks:java:core:shadowJar FROM-CACHE
> Task :sdks:java:extensions:arrow:compileJava FROM-CACHE
> Task :sdks:java:extensions:arrow:classes UP-TO-DATE
> Task :sdks:java:extensions:arrow:jar
> Task :runners:local-java:compileJava FROM-CACHE
> Task :runners:local-java:classes UP-TO-DATE
> Task :sdks:java:testing:test-utils:compileJava FROM-CACHE
> Task :sdks:java:testing:test-utils:classes UP-TO-DATE
> Task :runners:local-java:jar
> Task :sdks:java:extensions:avro:compileJava FROM-CACHE
> Task :sdks:java:extensions:avro:classes UP-TO-DATE
> Task :sdks:java:extensions:avro:jar
> Task :sdks:java:fn-execution:compileJava FROM-CACHE
> Task :sdks:java:fn-execution:classes UP-TO-DATE
> Task :sdks:java:fn-execution:jar
> Task :runners:core-construction-java:compileJava FROM-CACHE
> Task :runners:core-construction-java:classes UP-TO-DATE
> Task :sdks:java:extensions:protobuf:extractIncludeProto
> Task :sdks:java:extensions:protobuf:generateProto NO-SOURCE
> Task :runners:core-construction-java:jar
> Task :sdks:java:extensions:protobuf:compileJava FROM-CACHE
> Task :sdks:java:extensions:protobuf:classes UP-TO-DATE
> Task :sdks:java:extensions:protobuf:jar
> Task :runners:core-java:compileJava FROM-CACHE
> Task :runners:core-java:classes UP-TO-DATE
> Task :runners:core-java:jar
> Task :sdks:java:extensions:python:compileJava FROM-CACHE
> Task :sdks:java:extensions:python:classes
> Task :sdks:java:extensions:python:jar
> Task :sdks:java:extensions:google-cloud-platform-core:compileJava FROM-CACHE
> Task :sdks:java:extensions:google-cloud-platform-core:classes UP-TO-DATE
> Task :sdks:java:harness:compileJava FROM-CACHE
> Task :sdks:java:harness:classes UP-TO-DATE
> Task :sdks:java:extensions:google-cloud-platform-core:jar
> Task :sdks:java:harness:jar
> Task :sdks:java:testing:test-utils:compileTestJava FROM-CACHE
> Task :sdks:java:testing:test-utils:testClasses UP-TO-DATE
> Task :runners:java-fn-execution:compileJava FROM-CACHE
> Task :runners:java-fn-execution:classes UP-TO-DATE
> Task :runners:java-fn-execution:jar
> Task :sdks:java:expansion-service:compileJava FROM-CACHE
> Task :sdks:java:expansion-service:classes UP-TO-DATE
> Task :sdks:java:expansion-service:jar
> Task :runners:direct-java:compileJava FROM-CACHE
> Task :runners:direct-java:classes UP-TO-DATE
> Task :sdks:java:extensions:ml:compileJava FROM-CACHE
> Task :sdks:java:extensions:ml:classes UP-TO-DATE
> Task :sdks:java:io:kafka:compileJava FROM-CACHE
> Task :sdks:java:io:kafka:classes UP-TO-DATE
> Task :sdks:java:extensions:ml:jar
> Task :sdks:java:io:kafka:jar
> Task :sdks:java:harness:shadowJar FROM-CACHE
> Task :runners:direct-java:shadowJar FROM-CACHE
> Task :sdks:java:io:google-cloud-platform:compileJava FROM-CACHE
> Task :sdks:java:io:google-cloud-platform:classes UP-TO-DATE
> Task :sdks:java:core:compileTestJava FROM-CACHE
> Task :sdks:java:core:testClasses
> Task :sdks:java:io:google-cloud-platform:jar
> Task :sdks:java:core:shadowTestJar FROM-CACHE
> Task :runners:google-cloud-dataflow-java:compileJava FROM-CACHE
> Task :runners:google-cloud-dataflow-java:classes
> Task :examples:java:compileJava FROM-CACHE
> Task :examples:java:classes UP-TO-DATE
> Task :runners:google-cloud-dataflow-java:jar
> Task :examples:java:jar
> Task :runners:core-java:compileTestJava FROM-CACHE
> Task :runners:core-java:testClasses UP-TO-DATE
> Task :runners:core-java:testJar
> Task :runners:google-cloud-dataflow-java:worker:compileJava FROM-CACHE
> Task :examples:java:compileTestJava FROM-CACHE
> Task :runners:google-cloud-dataflow-java:worker:classes
> Task :examples:java:testClasses
> Task :runners:direct-java:compileTestJava FROM-CACHE
> Task :runners:direct-java:testClasses UP-TO-DATE
> Task :examples:java:testJar
> Task :runners:direct-java:shadowTestJar FROM-CACHE
> Task :runners:google-cloud-dataflow-java:worker:shadowJar FROM-CACHE
> Task :sdks:java:testing:test-utils:verifyJavaVersion17 FROM-CACHE
> Task :runners:google-cloud-dataflow-java:examples-streaming:appliancePreCommit FROM-CACHE
> Task :runners:google-cloud-dataflow-java:examples:preCommitLegacyWorker FROM-CACHE
> Task :runners:google-cloud-dataflow-java:examples:preCommitLegacyWorkerImpersonate FROM-CACHE
> Task :runners:google-cloud-dataflow-java:examples:preCommit UP-TO-DATE
> Task :runners:google-cloud-dataflow-java:examples-streaming:windmillPreCommit
org.apache.beam.examples.WordCountIT > testE2EWordCount FAILED
java.lang.RuntimeException at WordCountIT.java:69
1 test completed, 1 failed
> Task :runners:google-cloud-dataflow-java:examples-streaming:windmillPreCommit FAILED
FAILURE: Build failed with an exception.
* What went wrong:
Execution failed for task ':runners:google-cloud-dataflow-java:examples-streaming:windmillPreCommit'.
> There were failing tests. See the report at: file://<https://ci-beam.apache.org/job/beam_PreCommit_Java_Examples_Dataflow_Java17_Cron/ws/src/runners/google-cloud-dataflow-java/examples-streaming/build/reports/tests/windmillPreCommit/index.html>
* Try:
> Run with --stacktrace option to get the stack trace.
> Run with --info or --debug option to get more log output.
* Get more help at https://help.gradle.org
Deprecated Gradle features were used in this build, making it incompatible with Gradle 8.0.
You can use '--warning-mode all' to show the individual deprecation warnings and determine if they come from your own scripts or plugins.
See https://docs.gradle.org/7.5.1/userguide/command_line_interface.html#sec:command_line_warnings
BUILD FAILED in 16m 2s
100 actionable tasks: 42 executed, 52 from cache, 6 up-to-date
Publishing build scan...
https://ge.apache.org/s/quaynxewe43nk
Build step 'Invoke Gradle script' changed build result to FAILURE
Build step 'Invoke Gradle script' marked build as failure
---------------------------------------------------------------------
To unsubscribe, e-mail: builds-unsubscribe@beam.apache.org
For additional commands, e-mail: builds-help@beam.apache.org
Build failed in Jenkins: beam_PreCommit_Java_Examples_Dataflow_Java17_Cron #2188
Posted by Apache Jenkins Server <je...@builds.apache.org>.
See <https://ci-beam.apache.org/job/beam_PreCommit_Java_Examples_Dataflow_Java17_Cron/2188/display/redirect?page=changes>
Changes:
[noreply] Merge pull request #27345: Consider beam_services option when
------------------------------------------
[...truncated 5.68 KB...]
> Task :buildSrc:testClasses UP-TO-DATE
> Task :buildSrc:test NO-SOURCE
> Task :buildSrc:validatePlugins FROM-CACHE
> Task :buildSrc:check UP-TO-DATE
> Task :buildSrc:build
> Task :clean UP-TO-DATE
BUILD SUCCESSFUL in 10s
7 actionable tasks: 4 executed, 2 from cache, 1 up-to-date
Publishing build scan...
https://ge.apache.org/s/zg2rvya2z4tdm
Build step 'Invoke Gradle script' changed build result to SUCCESS
[Gradle] - Launching build.
[src] $ <https://ci-beam.apache.org/job/beam_PreCommit_Java_Examples_Dataflow_Java17_Cron/ws/src/gradlew> -PdisableSpotlessCheck=true -PdisableCheckStyle=true -PskipCheckerFramework -PcompileAndRunTestsWithJava17 -Pjava17Home=/usr/lib/jvm/java-17-openjdk-amd64 --continue --max-workers=12 -Dorg.gradle.jvmargs=-Xms2g -Dorg.gradle.jvmargs=-Xmx6g -Dorg.gradle.vfs.watch=false -Pdocker-pull-licenses javaExamplesDataflowPreCommit
To honour the JVM settings for this build a single-use Daemon process will be forked. See https://docs.gradle.org/7.5.1/userguide/gradle_daemon.html#sec:disabling_the_daemon.
Daemon will be stopped at the end of the build
Configuration on demand is an incubating feature.
Gradle Enterprise plugins resolution: https://plugins.gradle.org/m2
Enforcing Gradle Enterprise: https://ge.apache.org, allowUntrustedServer: false
> Task :buildSrc:compileJava NO-SOURCE
> Task :buildSrc:compileGroovy UP-TO-DATE
> Task :buildSrc:pluginDescriptors UP-TO-DATE
> Task :buildSrc:processResources UP-TO-DATE
> Task :buildSrc:classes UP-TO-DATE
> Task :buildSrc:jar UP-TO-DATE
> Task :buildSrc:assemble UP-TO-DATE
> Task :buildSrc:pluginUnderTestMetadata UP-TO-DATE
> Task :buildSrc:compileTestJava NO-SOURCE
> Task :buildSrc:compileTestGroovy NO-SOURCE
> Task :buildSrc:processTestResources NO-SOURCE
> Task :buildSrc:testClasses UP-TO-DATE
> Task :buildSrc:test NO-SOURCE
> Task :buildSrc:validatePlugins UP-TO-DATE
> Task :buildSrc:check UP-TO-DATE
> Task :buildSrc:build UP-TO-DATE
> Configure project :sdks:java:container:java8
docker-pull-licenses set, creating go-licenses
> Configure project :sdks:java:container:java11
docker-pull-licenses set, creating go-licenses
> Configure project :sdks:go:container
docker-pull-licenses set, running go-licenses
> Configure project :sdks:java:container:java17
docker-pull-licenses set, creating go-licenses
> Task :sdks:java:core:generateAvroProtocol NO-SOURCE
> Task :sdks:java:expansion-service:processResources NO-SOURCE
> Task :sdks:java:fn-execution:processResources NO-SOURCE
> Task :sdks:java:extensions:google-cloud-platform-core:processResources NO-SOURCE
> Task :sdks:java:extensions:avro:generateAvroProtocol NO-SOURCE
> Task :sdks:java:harness:processResources NO-SOURCE
> Task :runners:java-fn-execution:processResources NO-SOURCE
> Task :runners:core-java:processResources NO-SOURCE
> Task :runners:core-construction-java:processResources NO-SOURCE
> Task :sdks:java:extensions:avro:generateAvroJava NO-SOURCE
> Task :sdks:java:core:generateAvroJava NO-SOURCE
> Task :sdks:java:extensions:ml:processResources NO-SOURCE
> Task :sdks:java:extensions:avro:processResources NO-SOURCE
> Task :sdks:java:extensions:arrow:processResources NO-SOURCE
> Task :runners:local-java:processResources NO-SOURCE
> Task :sdks:java:io:google-cloud-platform:processResources NO-SOURCE
> Task :sdks:java:io:kafka:processResources NO-SOURCE
> Task :examples:java:processResources NO-SOURCE
> Task :runners:direct-java:processResources NO-SOURCE
> Task :runners:google-cloud-dataflow-java:examples:compileJava NO-SOURCE
> Task :runners:google-cloud-dataflow-java:examples:processResources NO-SOURCE
> Task :runners:google-cloud-dataflow-java:examples:classes UP-TO-DATE
> Task :runners:google-cloud-dataflow-java:examples:compileTestJava NO-SOURCE
> Task :runners:google-cloud-dataflow-java:examples:processTestResources NO-SOURCE
> Task :runners:google-cloud-dataflow-java:examples:testClasses UP-TO-DATE
> Task :runners:google-cloud-dataflow-java:examples-streaming:compileJava NO-SOURCE
> Task :runners:google-cloud-dataflow-java:examples-streaming:processResources NO-SOURCE
> Task :runners:google-cloud-dataflow-java:examples-streaming:classes UP-TO-DATE
> Task :runners:google-cloud-dataflow-java:examples-streaming:compileTestJava NO-SOURCE
> Task :runners:google-cloud-dataflow-java:examples-streaming:processTestResources NO-SOURCE
> Task :runners:google-cloud-dataflow-java:examples-streaming:testClasses UP-TO-DATE
> Task :runners:core-java:processTestResources NO-SOURCE
> Task :runners:direct-java:processTestResources NO-SOURCE
> Task :sdks:java:testing:test-utils:processResources NO-SOURCE
> Task :sdks:java:testing:test-utils:processTestResources NO-SOURCE
> Task :sdks:java:extensions:protobuf:extractProto
> Task :model:fn-execution:extractProto
> Task :runners:google-cloud-dataflow-java:worker:processResources
> Task :model:job-management:extractProto
> Task :examples:java:processTestResources
> Task :sdks:java:extensions:python:processResources
> Task :runners:google-cloud-dataflow-java:processResources
> Task :sdks:java:extensions:protobuf:processResources NO-SOURCE
> Task :sdks:java:core:generateGrammarSource FROM-CACHE
> Task :model:job-management:processResources
> Task :model:fn-execution:processResources
> Task :sdks:java:core:processResources
> Task :sdks:java:core:generateTestAvroProtocol NO-SOURCE
> Task :sdks:java:core:generateTestAvroJava FROM-CACHE
> Task :sdks:java:core:generateTestGrammarSource NO-SOURCE
> Task :sdks:java:transform-service:launcher:compileJava FROM-CACHE
> Task :sdks:java:transform-service:launcher:processResources
> Task :sdks:java:transform-service:launcher:classes
> Task :sdks:java:core:processTestResources
> Task :sdks:java:transform-service:launcher:shadowJar FROM-CACHE
> Task :model:pipeline:extractIncludeProto
> Task :runners:google-cloud-dataflow-java:worker:windmill:extractIncludeProto
> Task :model:pipeline:extractProto
> Task :runners:google-cloud-dataflow-java:worker:windmill:extractProto
> Task :runners:google-cloud-dataflow-java:worker:windmill:generateProto FROM-CACHE
> Task :model:pipeline:generateProto FROM-CACHE
> Task :runners:google-cloud-dataflow-java:worker:windmill:compileJava FROM-CACHE
> Task :runners:google-cloud-dataflow-java:worker:windmill:processResources
> Task :runners:google-cloud-dataflow-java:worker:windmill:classes
> Task :runners:google-cloud-dataflow-java:worker:windmill:shadowJar FROM-CACHE
> Task :model:pipeline:compileJava FROM-CACHE
> Task :model:pipeline:processResources
> Task :model:pipeline:classes
> Task :model:pipeline:jar
> Task :model:pipeline:shadowJar FROM-CACHE
> Task :model:fn-execution:extractIncludeProto
> Task :model:job-management:extractIncludeProto
> Task :model:job-management:generateProto FROM-CACHE
> Task :model:fn-execution:generateProto FROM-CACHE
> Task :model:job-management:compileJava FROM-CACHE
> Task :model:job-management:classes
> Task :model:fn-execution:compileJava FROM-CACHE
> Task :model:fn-execution:classes
> Task :model:job-management:shadowJar FROM-CACHE
> Task :model:fn-execution:shadowJar FROM-CACHE
> Task :sdks:java:core:compileJava FROM-CACHE
> Task :sdks:java:core:classes
> Task :sdks:java:core:shadowJar FROM-CACHE
> Task :sdks:java:extensions:arrow:compileJava FROM-CACHE
> Task :sdks:java:extensions:arrow:classes UP-TO-DATE
> Task :sdks:java:extensions:arrow:jar
> Task :runners:local-java:compileJava FROM-CACHE
> Task :runners:local-java:classes UP-TO-DATE
> Task :sdks:java:testing:test-utils:compileJava FROM-CACHE
> Task :sdks:java:testing:test-utils:classes UP-TO-DATE
> Task :runners:local-java:jar
> Task :sdks:java:extensions:avro:compileJava FROM-CACHE
> Task :sdks:java:extensions:avro:classes UP-TO-DATE
> Task :sdks:java:extensions:avro:jar
> Task :sdks:java:testing:test-utils:compileTestJava FROM-CACHE
> Task :sdks:java:testing:test-utils:testClasses UP-TO-DATE
> Task :sdks:java:fn-execution:compileJava FROM-CACHE
> Task :sdks:java:fn-execution:classes UP-TO-DATE
> Task :sdks:java:fn-execution:jar
> Task :sdks:java:extensions:protobuf:extractIncludeProto
> Task :sdks:java:extensions:protobuf:generateProto NO-SOURCE
> Task :runners:core-construction-java:compileJava FROM-CACHE
> Task :runners:core-construction-java:classes UP-TO-DATE
> Task :sdks:java:extensions:protobuf:compileJava FROM-CACHE
> Task :sdks:java:extensions:protobuf:classes UP-TO-DATE
> Task :sdks:java:extensions:protobuf:jar
> Task :runners:core-construction-java:jar
> Task :runners:core-java:compileJava FROM-CACHE
> Task :runners:core-java:classes UP-TO-DATE
> Task :runners:core-java:jar
> Task :sdks:java:extensions:python:compileJava FROM-CACHE
> Task :sdks:java:extensions:python:classes
> Task :sdks:java:extensions:python:jar
> Task :sdks:java:extensions:google-cloud-platform-core:compileJava FROM-CACHE
> Task :sdks:java:extensions:google-cloud-platform-core:classes UP-TO-DATE
> Task :sdks:java:extensions:google-cloud-platform-core:jar
> Task :sdks:java:harness:compileJava FROM-CACHE
> Task :sdks:java:harness:classes UP-TO-DATE
> Task :sdks:java:harness:jar
> Task :sdks:java:core:compileTestJava FROM-CACHE
> Task :sdks:java:core:testClasses
> Task :runners:java-fn-execution:compileJava FROM-CACHE
> Task :runners:java-fn-execution:classes UP-TO-DATE
> Task :runners:java-fn-execution:jar
> Task :sdks:java:expansion-service:compileJava FROM-CACHE
> Task :sdks:java:expansion-service:classes UP-TO-DATE
> Task :sdks:java:expansion-service:jar
> Task :sdks:java:core:shadowTestJar FROM-CACHE
> Task :runners:direct-java:compileJava FROM-CACHE
> Task :runners:direct-java:classes UP-TO-DATE
> Task :sdks:java:extensions:ml:compileJava FROM-CACHE
> Task :sdks:java:extensions:ml:classes UP-TO-DATE
> Task :sdks:java:io:kafka:compileJava FROM-CACHE
> Task :sdks:java:io:kafka:classes UP-TO-DATE
> Task :runners:direct-java:shadowJar FROM-CACHE
> Task :sdks:java:extensions:ml:jar
> Task :sdks:java:io:kafka:jar
> Task :sdks:java:harness:shadowJar FROM-CACHE
> Task :runners:core-java:compileTestJava FROM-CACHE
> Task :runners:core-java:testClasses UP-TO-DATE
> Task :runners:core-java:testJar
> Task :sdks:java:io:google-cloud-platform:compileJava FROM-CACHE
> Task :sdks:java:io:google-cloud-platform:classes UP-TO-DATE
> Task :runners:direct-java:compileTestJava FROM-CACHE
> Task :runners:direct-java:testClasses UP-TO-DATE
> Task :sdks:java:io:google-cloud-platform:jar
> Task :runners:direct-java:shadowTestJar FROM-CACHE
> Task :runners:google-cloud-dataflow-java:compileJava FROM-CACHE
> Task :runners:google-cloud-dataflow-java:classes
> Task :examples:java:compileJava FROM-CACHE
> Task :examples:java:classes UP-TO-DATE
> Task :runners:google-cloud-dataflow-java:jar
> Task :examples:java:jar
> Task :sdks:java:testing:test-utils:verifyJavaVersion17 FROM-CACHE
> Task :examples:java:compileTestJava FROM-CACHE
> Task :examples:java:testClasses
> Task :examples:java:testJar
> Task :runners:google-cloud-dataflow-java:worker:compileJava FROM-CACHE
> Task :runners:google-cloud-dataflow-java:worker:classes
> Task :runners:google-cloud-dataflow-java:worker:shadowJar FROM-CACHE
> Task :runners:google-cloud-dataflow-java:examples-streaming:appliancePreCommit FROM-CACHE
> Task :runners:google-cloud-dataflow-java:examples:preCommitLegacyWorker FROM-CACHE
> Task :runners:google-cloud-dataflow-java:examples:preCommitLegacyWorkerImpersonate FROM-CACHE
> Task :runners:google-cloud-dataflow-java:examples:preCommit UP-TO-DATE
> Task :runners:google-cloud-dataflow-java:examples-streaming:windmillPreCommit
org.apache.beam.examples.WordCountIT > testE2EWordCount FAILED
java.lang.RuntimeException at WordCountIT.java:69
1 test completed, 1 failed
> Task :runners:google-cloud-dataflow-java:examples-streaming:windmillPreCommit FAILED
FAILURE: Build failed with an exception.
* What went wrong:
Execution failed for task ':runners:google-cloud-dataflow-java:examples-streaming:windmillPreCommit'.
> There were failing tests. See the report at: file://<https://ci-beam.apache.org/job/beam_PreCommit_Java_Examples_Dataflow_Java17_Cron/ws/src/runners/google-cloud-dataflow-java/examples-streaming/build/reports/tests/windmillPreCommit/index.html>
* Try:
> Run with --stacktrace option to get the stack trace.
> Run with --info or --debug option to get more log output.
* Get more help at https://help.gradle.org
Deprecated Gradle features were used in this build, making it incompatible with Gradle 8.0.
You can use '--warning-mode all' to show the individual deprecation warnings and determine if they come from your own scripts or plugins.
See https://docs.gradle.org/7.5.1/userguide/command_line_interface.html#sec:command_line_warnings
BUILD FAILED in 16m 3s
100 actionable tasks: 42 executed, 52 from cache, 6 up-to-date
Publishing build scan...
https://ge.apache.org/s/k6qtb2llzebbg
Build step 'Invoke Gradle script' changed build result to FAILURE
Build step 'Invoke Gradle script' marked build as failure
---------------------------------------------------------------------
To unsubscribe, e-mail: builds-unsubscribe@beam.apache.org
For additional commands, e-mail: builds-help@beam.apache.org
Build failed in Jenkins: beam_PreCommit_Java_Examples_Dataflow_Java17_Cron #2187
Posted by Apache Jenkins Server <je...@builds.apache.org>.
See <https://ci-beam.apache.org/job/beam_PreCommit_Java_Examples_Dataflow_Java17_Cron/2187/display/redirect>
Changes:
------------------------------------------
[...truncated 5.63 KB...]
> Task :buildSrc:testClasses UP-TO-DATE
> Task :buildSrc:test NO-SOURCE
> Task :buildSrc:validatePlugins FROM-CACHE
> Task :buildSrc:check UP-TO-DATE
> Task :buildSrc:build
> Task :clean UP-TO-DATE
BUILD SUCCESSFUL in 10s
7 actionable tasks: 4 executed, 2 from cache, 1 up-to-date
Publishing build scan...
https://ge.apache.org/s/nnpdiaccrybsi
Build step 'Invoke Gradle script' changed build result to SUCCESS
[Gradle] - Launching build.
[src] $ <https://ci-beam.apache.org/job/beam_PreCommit_Java_Examples_Dataflow_Java17_Cron/ws/src/gradlew> -PdisableSpotlessCheck=true -PdisableCheckStyle=true -PskipCheckerFramework -PcompileAndRunTestsWithJava17 -Pjava17Home=/usr/lib/jvm/java-17-openjdk-amd64 --continue --max-workers=12 -Dorg.gradle.jvmargs=-Xms2g -Dorg.gradle.jvmargs=-Xmx6g -Dorg.gradle.vfs.watch=false -Pdocker-pull-licenses javaExamplesDataflowPreCommit
To honour the JVM settings for this build a single-use Daemon process will be forked. See https://docs.gradle.org/7.5.1/userguide/gradle_daemon.html#sec:disabling_the_daemon.
Daemon will be stopped at the end of the build
Configuration on demand is an incubating feature.
Gradle Enterprise plugins resolution: https://plugins.gradle.org/m2
Enforcing Gradle Enterprise: https://ge.apache.org, allowUntrustedServer: false
> Task :buildSrc:compileJava NO-SOURCE
> Task :buildSrc:compileGroovy UP-TO-DATE
> Task :buildSrc:pluginDescriptors UP-TO-DATE
> Task :buildSrc:processResources UP-TO-DATE
> Task :buildSrc:classes UP-TO-DATE
> Task :buildSrc:jar UP-TO-DATE
> Task :buildSrc:assemble UP-TO-DATE
> Task :buildSrc:pluginUnderTestMetadata UP-TO-DATE
> Task :buildSrc:compileTestJava NO-SOURCE
> Task :buildSrc:compileTestGroovy NO-SOURCE
> Task :buildSrc:processTestResources NO-SOURCE
> Task :buildSrc:testClasses UP-TO-DATE
> Task :buildSrc:test NO-SOURCE
> Task :buildSrc:validatePlugins UP-TO-DATE
> Task :buildSrc:check UP-TO-DATE
> Task :buildSrc:build UP-TO-DATE
> Configure project :sdks:java:container:java8
docker-pull-licenses set, creating go-licenses
> Configure project :sdks:java:container:java11
docker-pull-licenses set, creating go-licenses
> Configure project :sdks:go:container
docker-pull-licenses set, running go-licenses
> Configure project :sdks:java:container:java17
docker-pull-licenses set, creating go-licenses
> Task :sdks:java:fn-execution:processResources NO-SOURCE
> Task :sdks:java:extensions:google-cloud-platform-core:processResources NO-SOURCE
> Task :sdks:java:expansion-service:processResources NO-SOURCE
> Task :sdks:java:extensions:avro:generateAvroProtocol NO-SOURCE
> Task :sdks:java:core:generateAvroProtocol NO-SOURCE
> Task :runners:java-fn-execution:processResources NO-SOURCE
> Task :sdks:java:harness:processResources NO-SOURCE
> Task :runners:core-java:processResources NO-SOURCE
> Task :runners:core-construction-java:processResources NO-SOURCE
> Task :sdks:java:extensions:avro:generateAvroJava NO-SOURCE
> Task :sdks:java:core:generateAvroJava NO-SOURCE
> Task :sdks:java:extensions:avro:processResources NO-SOURCE
> Task :sdks:java:extensions:arrow:processResources NO-SOURCE
> Task :sdks:java:extensions:ml:processResources NO-SOURCE
> Task :sdks:java:io:kafka:processResources NO-SOURCE
> Task :examples:java:processResources NO-SOURCE
> Task :runners:direct-java:processResources NO-SOURCE
> Task :sdks:java:io:google-cloud-platform:processResources NO-SOURCE
> Task :runners:local-java:processResources NO-SOURCE
> Task :runners:google-cloud-dataflow-java:examples:compileJava NO-SOURCE
> Task :runners:google-cloud-dataflow-java:examples:processResources NO-SOURCE
> Task :runners:google-cloud-dataflow-java:examples:classes UP-TO-DATE
> Task :runners:google-cloud-dataflow-java:examples:compileTestJava NO-SOURCE
> Task :runners:google-cloud-dataflow-java:examples:processTestResources NO-SOURCE
> Task :runners:google-cloud-dataflow-java:examples:testClasses UP-TO-DATE
> Task :runners:google-cloud-dataflow-java:examples-streaming:compileJava NO-SOURCE
> Task :runners:google-cloud-dataflow-java:examples-streaming:processResources NO-SOURCE
> Task :runners:google-cloud-dataflow-java:examples-streaming:classes UP-TO-DATE
> Task :runners:google-cloud-dataflow-java:examples-streaming:compileTestJava NO-SOURCE
> Task :runners:google-cloud-dataflow-java:examples-streaming:processTestResources NO-SOURCE
> Task :runners:google-cloud-dataflow-java:examples-streaming:testClasses UP-TO-DATE
> Task :runners:core-java:processTestResources NO-SOURCE
> Task :runners:direct-java:processTestResources NO-SOURCE
> Task :sdks:java:testing:test-utils:processResources NO-SOURCE
> Task :sdks:java:testing:test-utils:processTestResources NO-SOURCE
> Task :runners:google-cloud-dataflow-java:worker:processResources
> Task :sdks:java:extensions:python:processResources
> Task :sdks:java:extensions:protobuf:extractProto
> Task :model:fn-execution:extractProto
> Task :runners:google-cloud-dataflow-java:processResources
> Task :examples:java:processTestResources
> Task :model:job-management:extractProto
> Task :sdks:java:extensions:protobuf:processResources NO-SOURCE
> Task :model:job-management:processResources
> Task :model:fn-execution:processResources
> Task :sdks:java:core:generateGrammarSource FROM-CACHE
> Task :sdks:java:core:processResources
> Task :sdks:java:core:generateTestAvroProtocol NO-SOURCE
> Task :sdks:java:transform-service:launcher:compileJava FROM-CACHE
> Task :sdks:java:core:generateTestAvroJava FROM-CACHE
> Task :sdks:java:core:generateTestGrammarSource NO-SOURCE
> Task :sdks:java:transform-service:launcher:processResources
> Task :sdks:java:transform-service:launcher:classes
> Task :sdks:java:core:processTestResources
> Task :sdks:java:transform-service:launcher:shadowJar FROM-CACHE
> Task :runners:google-cloud-dataflow-java:worker:windmill:extractIncludeProto
> Task :model:pipeline:extractIncludeProto
> Task :model:pipeline:extractProto
> Task :runners:google-cloud-dataflow-java:worker:windmill:extractProto
> Task :runners:google-cloud-dataflow-java:worker:windmill:generateProto FROM-CACHE
> Task :model:pipeline:generateProto FROM-CACHE
> Task :runners:google-cloud-dataflow-java:worker:windmill:compileJava FROM-CACHE
> Task :runners:google-cloud-dataflow-java:worker:windmill:processResources
> Task :runners:google-cloud-dataflow-java:worker:windmill:classes
> Task :runners:google-cloud-dataflow-java:worker:windmill:shadowJar FROM-CACHE
> Task :model:pipeline:compileJava FROM-CACHE
> Task :model:pipeline:processResources
> Task :model:pipeline:classes
> Task :model:pipeline:jar
> Task :model:pipeline:shadowJar FROM-CACHE
> Task :model:job-management:extractIncludeProto
> Task :model:fn-execution:extractIncludeProto
> Task :model:job-management:generateProto FROM-CACHE
> Task :model:fn-execution:generateProto FROM-CACHE
> Task :model:job-management:compileJava FROM-CACHE
> Task :model:job-management:classes
> Task :model:fn-execution:compileJava FROM-CACHE
> Task :model:fn-execution:classes
> Task :model:job-management:shadowJar FROM-CACHE
> Task :model:fn-execution:shadowJar FROM-CACHE
> Task :sdks:java:core:compileJava FROM-CACHE
> Task :sdks:java:core:classes
> Task :sdks:java:core:shadowJar FROM-CACHE
> Task :runners:local-java:compileJava FROM-CACHE
> Task :runners:local-java:classes UP-TO-DATE
> Task :sdks:java:extensions:arrow:compileJava FROM-CACHE
> Task :sdks:java:extensions:arrow:classes UP-TO-DATE
> Task :runners:local-java:jar
> Task :sdks:java:extensions:arrow:jar
> Task :sdks:java:testing:test-utils:compileJava FROM-CACHE
> Task :sdks:java:testing:test-utils:classes UP-TO-DATE
> Task :sdks:java:extensions:avro:compileJava FROM-CACHE
> Task :sdks:java:extensions:avro:classes UP-TO-DATE
> Task :sdks:java:extensions:avro:jar
> Task :sdks:java:fn-execution:compileJava FROM-CACHE
> Task :sdks:java:fn-execution:classes UP-TO-DATE
> Task :sdks:java:fn-execution:jar
> Task :runners:core-construction-java:compileJava FROM-CACHE
> Task :runners:core-construction-java:classes UP-TO-DATE
> Task :sdks:java:extensions:protobuf:extractIncludeProto
> Task :sdks:java:extensions:protobuf:generateProto NO-SOURCE
> Task :sdks:java:extensions:protobuf:compileJava FROM-CACHE
> Task :sdks:java:extensions:protobuf:classes UP-TO-DATE
> Task :sdks:java:extensions:protobuf:jar
> Task :runners:core-construction-java:jar
> Task :runners:core-java:compileJava FROM-CACHE
> Task :runners:core-java:classes UP-TO-DATE
> Task :sdks:java:testing:test-utils:compileTestJava FROM-CACHE
> Task :sdks:java:testing:test-utils:testClasses UP-TO-DATE
> Task :runners:core-java:jar
> Task :sdks:java:extensions:python:compileJava FROM-CACHE
> Task :sdks:java:extensions:python:classes
> Task :sdks:java:extensions:python:jar
> Task :sdks:java:extensions:google-cloud-platform-core:compileJava FROM-CACHE
> Task :sdks:java:extensions:google-cloud-platform-core:classes UP-TO-DATE
> Task :sdks:java:harness:compileJava FROM-CACHE
> Task :sdks:java:extensions:google-cloud-platform-core:jar
> Task :sdks:java:harness:classes UP-TO-DATE
> Task :sdks:java:harness:jar
> Task :runners:java-fn-execution:compileJava FROM-CACHE
> Task :runners:java-fn-execution:classes UP-TO-DATE
> Task :runners:java-fn-execution:jar
> Task :sdks:java:expansion-service:compileJava FROM-CACHE
> Task :sdks:java:expansion-service:classes UP-TO-DATE
> Task :sdks:java:expansion-service:jar
> Task :runners:direct-java:compileJava FROM-CACHE
> Task :runners:direct-java:classes UP-TO-DATE
> Task :sdks:java:io:kafka:compileJava FROM-CACHE
> Task :sdks:java:io:kafka:classes UP-TO-DATE
> Task :runners:direct-java:shadowJar FROM-CACHE
> Task :sdks:java:extensions:ml:compileJava FROM-CACHE
> Task :sdks:java:extensions:ml:classes UP-TO-DATE
> Task :sdks:java:io:kafka:jar
> Task :sdks:java:harness:shadowJar FROM-CACHE
> Task :sdks:java:extensions:ml:jar
> Task :sdks:java:core:compileTestJava FROM-CACHE
> Task :sdks:java:core:testClasses
> Task :sdks:java:io:google-cloud-platform:compileJava FROM-CACHE
> Task :sdks:java:io:google-cloud-platform:classes UP-TO-DATE
> Task :sdks:java:core:shadowTestJar FROM-CACHE
> Task :sdks:java:io:google-cloud-platform:jar
> Task :runners:core-java:compileTestJava FROM-CACHE
> Task :runners:core-java:testClasses UP-TO-DATE
> Task :runners:core-java:testJar
> Task :examples:java:compileJava FROM-CACHE
> Task :examples:java:classes UP-TO-DATE
> Task :runners:google-cloud-dataflow-java:compileJava FROM-CACHE
> Task :runners:google-cloud-dataflow-java:classes
> Task :runners:direct-java:compileTestJava FROM-CACHE
> Task :runners:direct-java:testClasses UP-TO-DATE
> Task :runners:google-cloud-dataflow-java:jar
> Task :examples:java:jar
> Task :runners:direct-java:shadowTestJar FROM-CACHE
> Task :examples:java:compileTestJava FROM-CACHE
> Task :examples:java:testClasses
> Task :examples:java:testJar
> Task :runners:google-cloud-dataflow-java:worker:compileJava FROM-CACHE
> Task :runners:google-cloud-dataflow-java:worker:classes
> Task :sdks:java:testing:test-utils:verifyJavaVersion17 FROM-CACHE
> Task :runners:google-cloud-dataflow-java:worker:shadowJar FROM-CACHE
> Task :runners:google-cloud-dataflow-java:examples-streaming:appliancePreCommit FROM-CACHE
> Task :runners:google-cloud-dataflow-java:examples:preCommitLegacyWorker FROM-CACHE
> Task :runners:google-cloud-dataflow-java:examples:preCommitLegacyWorkerImpersonate FROM-CACHE
> Task :runners:google-cloud-dataflow-java:examples:preCommit UP-TO-DATE
> Task :runners:google-cloud-dataflow-java:examples-streaming:windmillPreCommit
org.apache.beam.examples.WordCountIT > testE2EWordCount FAILED
java.lang.RuntimeException at WordCountIT.java:69
1 test completed, 1 failed
> Task :runners:google-cloud-dataflow-java:examples-streaming:windmillPreCommit FAILED
FAILURE: Build failed with an exception.
* What went wrong:
Execution failed for task ':runners:google-cloud-dataflow-java:examples-streaming:windmillPreCommit'.
> There were failing tests. See the report at: file://<https://ci-beam.apache.org/job/beam_PreCommit_Java_Examples_Dataflow_Java17_Cron/ws/src/runners/google-cloud-dataflow-java/examples-streaming/build/reports/tests/windmillPreCommit/index.html>
* Try:
> Run with --stacktrace option to get the stack trace.
> Run with --info or --debug option to get more log output.
* Get more help at https://help.gradle.org
Deprecated Gradle features were used in this build, making it incompatible with Gradle 8.0.
You can use '--warning-mode all' to show the individual deprecation warnings and determine if they come from your own scripts or plugins.
See https://docs.gradle.org/7.5.1/userguide/command_line_interface.html#sec:command_line_warnings
BUILD FAILED in 16m 21s
100 actionable tasks: 42 executed, 52 from cache, 6 up-to-date
Publishing build scan...
https://ge.apache.org/s/ysucjg2ihxyuu
Build step 'Invoke Gradle script' changed build result to FAILURE
Build step 'Invoke Gradle script' marked build as failure
---------------------------------------------------------------------
To unsubscribe, e-mail: builds-unsubscribe@beam.apache.org
For additional commands, e-mail: builds-help@beam.apache.org
Build failed in Jenkins: beam_PreCommit_Java_Examples_Dataflow_Java17_Cron #2186
Posted by Apache Jenkins Server <je...@builds.apache.org>.
See <https://ci-beam.apache.org/job/beam_PreCommit_Java_Examples_Dataflow_Java17_Cron/2186/display/redirect>
Changes:
------------------------------------------
[...truncated 5.63 KB...]
> Task :buildSrc:testClasses UP-TO-DATE
> Task :buildSrc:test NO-SOURCE
> Task :buildSrc:validatePlugins FROM-CACHE
> Task :buildSrc:check UP-TO-DATE
> Task :buildSrc:build
> Task :clean UP-TO-DATE
BUILD SUCCESSFUL in 10s
7 actionable tasks: 4 executed, 2 from cache, 1 up-to-date
Publishing build scan...
https://ge.apache.org/s/ypk4fkdbauztc
Build step 'Invoke Gradle script' changed build result to SUCCESS
[Gradle] - Launching build.
[src] $ <https://ci-beam.apache.org/job/beam_PreCommit_Java_Examples_Dataflow_Java17_Cron/ws/src/gradlew> -PdisableSpotlessCheck=true -PdisableCheckStyle=true -PskipCheckerFramework -PcompileAndRunTestsWithJava17 -Pjava17Home=/usr/lib/jvm/java-17-openjdk-amd64 --continue --max-workers=12 -Dorg.gradle.jvmargs=-Xms2g -Dorg.gradle.jvmargs=-Xmx6g -Dorg.gradle.vfs.watch=false -Pdocker-pull-licenses javaExamplesDataflowPreCommit
To honour the JVM settings for this build a single-use Daemon process will be forked. See https://docs.gradle.org/7.5.1/userguide/gradle_daemon.html#sec:disabling_the_daemon.
Daemon will be stopped at the end of the build
Configuration on demand is an incubating feature.
Gradle Enterprise plugins resolution: https://plugins.gradle.org/m2
Enforcing Gradle Enterprise: https://ge.apache.org, allowUntrustedServer: false
> Task :buildSrc:compileJava NO-SOURCE
> Task :buildSrc:compileGroovy UP-TO-DATE
> Task :buildSrc:pluginDescriptors UP-TO-DATE
> Task :buildSrc:processResources UP-TO-DATE
> Task :buildSrc:classes UP-TO-DATE
> Task :buildSrc:jar UP-TO-DATE
> Task :buildSrc:assemble UP-TO-DATE
> Task :buildSrc:pluginUnderTestMetadata UP-TO-DATE
> Task :buildSrc:compileTestJava NO-SOURCE
> Task :buildSrc:compileTestGroovy NO-SOURCE
> Task :buildSrc:processTestResources NO-SOURCE
> Task :buildSrc:testClasses UP-TO-DATE
> Task :buildSrc:test NO-SOURCE
> Task :buildSrc:validatePlugins UP-TO-DATE
> Task :buildSrc:check UP-TO-DATE
> Task :buildSrc:build UP-TO-DATE
> Configure project :sdks:java:container:java8
docker-pull-licenses set, creating go-licenses
> Configure project :sdks:java:container:java11
docker-pull-licenses set, creating go-licenses
> Configure project :sdks:go:container
docker-pull-licenses set, running go-licenses
> Configure project :sdks:java:container:java17
docker-pull-licenses set, creating go-licenses
> Task :sdks:java:fn-execution:processResources NO-SOURCE
> Task :sdks:java:extensions:avro:generateAvroProtocol NO-SOURCE
> Task :runners:java-fn-execution:processResources NO-SOURCE
> Task :runners:core-java:processResources NO-SOURCE
> Task :sdks:java:core:generateAvroProtocol NO-SOURCE
> Task :sdks:java:harness:processResources NO-SOURCE
> Task :sdks:java:extensions:google-cloud-platform-core:processResources NO-SOURCE
> Task :runners:core-construction-java:processResources NO-SOURCE
> Task :sdks:java:expansion-service:processResources NO-SOURCE
> Task :sdks:java:extensions:avro:generateAvroJava NO-SOURCE
> Task :sdks:java:core:generateAvroJava NO-SOURCE
> Task :sdks:java:extensions:ml:processResources NO-SOURCE
> Task :sdks:java:extensions:avro:processResources NO-SOURCE
> Task :sdks:java:extensions:arrow:processResources NO-SOURCE
> Task :sdks:java:io:kafka:processResources NO-SOURCE
> Task :sdks:java:io:google-cloud-platform:processResources NO-SOURCE
> Task :runners:local-java:processResources NO-SOURCE
> Task :examples:java:processResources NO-SOURCE
> Task :runners:direct-java:processResources NO-SOURCE
> Task :runners:google-cloud-dataflow-java:examples:compileJava NO-SOURCE
> Task :runners:google-cloud-dataflow-java:examples:processResources NO-SOURCE
> Task :runners:google-cloud-dataflow-java:examples:classes UP-TO-DATE
> Task :runners:google-cloud-dataflow-java:examples:compileTestJava NO-SOURCE
> Task :runners:google-cloud-dataflow-java:examples:processTestResources NO-SOURCE
> Task :runners:google-cloud-dataflow-java:examples:testClasses UP-TO-DATE
> Task :runners:google-cloud-dataflow-java:examples-streaming:compileJava NO-SOURCE
> Task :runners:google-cloud-dataflow-java:examples-streaming:processResources NO-SOURCE
> Task :runners:google-cloud-dataflow-java:examples-streaming:classes UP-TO-DATE
> Task :runners:google-cloud-dataflow-java:examples-streaming:compileTestJava NO-SOURCE
> Task :runners:google-cloud-dataflow-java:examples-streaming:processTestResources NO-SOURCE
> Task :runners:google-cloud-dataflow-java:examples-streaming:testClasses UP-TO-DATE
> Task :runners:core-java:processTestResources NO-SOURCE
> Task :runners:direct-java:processTestResources NO-SOURCE
> Task :sdks:java:testing:test-utils:processResources NO-SOURCE
> Task :sdks:java:testing:test-utils:processTestResources NO-SOURCE
> Task :model:job-management:extractProto
> Task :sdks:java:extensions:python:processResources
> Task :runners:google-cloud-dataflow-java:worker:processResources
> Task :sdks:java:extensions:protobuf:extractProto
> Task :model:fn-execution:extractProto
> Task :examples:java:processTestResources
> Task :runners:google-cloud-dataflow-java:processResources
> Task :sdks:java:extensions:protobuf:processResources NO-SOURCE
> Task :model:job-management:processResources
> Task :model:fn-execution:processResources
> Task :sdks:java:core:generateGrammarSource FROM-CACHE
> Task :sdks:java:transform-service:launcher:compileJava FROM-CACHE
> Task :sdks:java:core:processResources
> Task :sdks:java:core:generateTestAvroProtocol NO-SOURCE
> Task :sdks:java:transform-service:launcher:processResources
> Task :sdks:java:transform-service:launcher:classes
> Task :sdks:java:core:generateTestAvroJava FROM-CACHE
> Task :sdks:java:core:generateTestGrammarSource NO-SOURCE
> Task :sdks:java:core:processTestResources
> Task :sdks:java:transform-service:launcher:shadowJar FROM-CACHE
> Task :model:pipeline:extractIncludeProto
> Task :runners:google-cloud-dataflow-java:worker:windmill:extractIncludeProto
> Task :model:pipeline:extractProto
> Task :runners:google-cloud-dataflow-java:worker:windmill:extractProto
> Task :runners:google-cloud-dataflow-java:worker:windmill:generateProto FROM-CACHE
> Task :model:pipeline:generateProto FROM-CACHE
> Task :runners:google-cloud-dataflow-java:worker:windmill:compileJava FROM-CACHE
> Task :runners:google-cloud-dataflow-java:worker:windmill:processResources
> Task :runners:google-cloud-dataflow-java:worker:windmill:classes
> Task :runners:google-cloud-dataflow-java:worker:windmill:shadowJar FROM-CACHE
> Task :model:pipeline:compileJava FROM-CACHE
> Task :model:pipeline:processResources
> Task :model:pipeline:classes
> Task :model:pipeline:jar
> Task :model:pipeline:shadowJar FROM-CACHE
> Task :model:fn-execution:extractIncludeProto
> Task :model:job-management:extractIncludeProto
> Task :model:job-management:generateProto FROM-CACHE
> Task :model:fn-execution:generateProto FROM-CACHE
> Task :model:job-management:compileJava FROM-CACHE
> Task :model:job-management:classes
> Task :model:fn-execution:compileJava FROM-CACHE
> Task :model:fn-execution:classes
> Task :model:job-management:shadowJar FROM-CACHE
> Task :model:fn-execution:shadowJar FROM-CACHE
> Task :sdks:java:core:compileJava FROM-CACHE
> Task :sdks:java:core:classes
> Task :sdks:java:core:shadowJar FROM-CACHE
> Task :sdks:java:extensions:arrow:compileJava FROM-CACHE
> Task :sdks:java:extensions:arrow:classes UP-TO-DATE
> Task :sdks:java:extensions:arrow:jar
> Task :runners:local-java:compileJava FROM-CACHE
> Task :runners:local-java:classes UP-TO-DATE
> Task :runners:local-java:jar
> Task :sdks:java:testing:test-utils:compileJava FROM-CACHE
> Task :sdks:java:testing:test-utils:classes UP-TO-DATE
> Task :sdks:java:extensions:avro:compileJava FROM-CACHE
> Task :sdks:java:extensions:avro:classes UP-TO-DATE
> Task :sdks:java:extensions:avro:jar
> Task :sdks:java:fn-execution:compileJava FROM-CACHE
> Task :sdks:java:fn-execution:classes UP-TO-DATE
> Task :sdks:java:fn-execution:jar
> Task :sdks:java:testing:test-utils:compileTestJava FROM-CACHE
> Task :sdks:java:testing:test-utils:testClasses UP-TO-DATE
> Task :runners:core-construction-java:compileJava FROM-CACHE
> Task :runners:core-construction-java:classes UP-TO-DATE
> Task :sdks:java:extensions:protobuf:extractIncludeProto
> Task :sdks:java:extensions:protobuf:generateProto NO-SOURCE
> Task :sdks:java:extensions:protobuf:compileJava FROM-CACHE
> Task :sdks:java:extensions:protobuf:classes UP-TO-DATE
> Task :runners:core-construction-java:jar
> Task :sdks:java:extensions:protobuf:jar
> Task :runners:core-java:compileJava FROM-CACHE
> Task :runners:core-java:classes UP-TO-DATE
> Task :runners:core-java:jar
> Task :sdks:java:extensions:python:compileJava FROM-CACHE
> Task :sdks:java:extensions:python:classes
> Task :sdks:java:extensions:python:jar
> Task :sdks:java:extensions:google-cloud-platform-core:compileJava FROM-CACHE
> Task :sdks:java:extensions:google-cloud-platform-core:classes UP-TO-DATE
> Task :sdks:java:harness:compileJava FROM-CACHE
> Task :sdks:java:harness:classes UP-TO-DATE
> Task :sdks:java:extensions:google-cloud-platform-core:jar
> Task :sdks:java:harness:jar
> Task :runners:java-fn-execution:compileJava FROM-CACHE
> Task :runners:java-fn-execution:classes UP-TO-DATE
> Task :runners:java-fn-execution:jar
> Task :sdks:java:expansion-service:compileJava FROM-CACHE
> Task :sdks:java:expansion-service:classes UP-TO-DATE
> Task :sdks:java:expansion-service:jar
> Task :runners:direct-java:compileJava FROM-CACHE
> Task :runners:direct-java:classes UP-TO-DATE
> Task :sdks:java:io:kafka:compileJava FROM-CACHE
> Task :sdks:java:io:kafka:classes UP-TO-DATE
> Task :sdks:java:extensions:ml:compileJava FROM-CACHE
> Task :sdks:java:extensions:ml:classes UP-TO-DATE
> Task :sdks:java:harness:shadowJar FROM-CACHE
> Task :sdks:java:extensions:ml:jar
> Task :runners:direct-java:shadowJar FROM-CACHE
> Task :sdks:java:io:kafka:jar
> Task :sdks:java:core:compileTestJava FROM-CACHE
> Task :sdks:java:core:testClasses
> Task :sdks:java:core:shadowTestJar FROM-CACHE
> Task :sdks:java:io:google-cloud-platform:compileJava FROM-CACHE
> Task :sdks:java:io:google-cloud-platform:classes UP-TO-DATE
> Task :runners:core-java:compileTestJava FROM-CACHE
> Task :runners:core-java:testClasses UP-TO-DATE
> Task :sdks:java:io:google-cloud-platform:jar
> Task :runners:core-java:testJar
> Task :runners:direct-java:compileTestJava FROM-CACHE
> Task :runners:direct-java:testClasses UP-TO-DATE
> Task :runners:google-cloud-dataflow-java:compileJava FROM-CACHE
> Task :runners:google-cloud-dataflow-java:classes
> Task :examples:java:compileJava FROM-CACHE
> Task :examples:java:classes UP-TO-DATE
> Task :runners:google-cloud-dataflow-java:jar
> Task :examples:java:jar
> Task :runners:direct-java:shadowTestJar FROM-CACHE
> Task :examples:java:compileTestJava FROM-CACHE
> Task :examples:java:testClasses
> Task :examples:java:testJar
> Task :runners:google-cloud-dataflow-java:worker:compileJava FROM-CACHE
> Task :runners:google-cloud-dataflow-java:worker:classes
> Task :sdks:java:testing:test-utils:verifyJavaVersion17 FROM-CACHE
> Task :runners:google-cloud-dataflow-java:worker:shadowJar FROM-CACHE
> Task :runners:google-cloud-dataflow-java:examples-streaming:appliancePreCommit FROM-CACHE
> Task :runners:google-cloud-dataflow-java:examples:preCommitLegacyWorker FROM-CACHE
> Task :runners:google-cloud-dataflow-java:examples:preCommitLegacyWorkerImpersonate FROM-CACHE
> Task :runners:google-cloud-dataflow-java:examples:preCommit UP-TO-DATE
> Task :runners:google-cloud-dataflow-java:examples-streaming:windmillPreCommit
org.apache.beam.examples.WordCountIT > testE2EWordCount FAILED
java.lang.RuntimeException at WordCountIT.java:69
1 test completed, 1 failed
> Task :runners:google-cloud-dataflow-java:examples-streaming:windmillPreCommit FAILED
FAILURE: Build failed with an exception.
* What went wrong:
Execution failed for task ':runners:google-cloud-dataflow-java:examples-streaming:windmillPreCommit'.
> There were failing tests. See the report at: file://<https://ci-beam.apache.org/job/beam_PreCommit_Java_Examples_Dataflow_Java17_Cron/ws/src/runners/google-cloud-dataflow-java/examples-streaming/build/reports/tests/windmillPreCommit/index.html>
* Try:
> Run with --stacktrace option to get the stack trace.
> Run with --info or --debug option to get more log output.
* Get more help at https://help.gradle.org
Deprecated Gradle features were used in this build, making it incompatible with Gradle 8.0.
You can use '--warning-mode all' to show the individual deprecation warnings and determine if they come from your own scripts or plugins.
See https://docs.gradle.org/7.5.1/userguide/command_line_interface.html#sec:command_line_warnings
BUILD FAILED in 16m 2s
100 actionable tasks: 42 executed, 52 from cache, 6 up-to-date
Publishing build scan...
https://ge.apache.org/s/mpj4w6kokovci
Build step 'Invoke Gradle script' changed build result to FAILURE
Build step 'Invoke Gradle script' marked build as failure
---------------------------------------------------------------------
To unsubscribe, e-mail: builds-unsubscribe@beam.apache.org
For additional commands, e-mail: builds-help@beam.apache.org
Build failed in Jenkins: beam_PreCommit_Java_Examples_Dataflow_Java17_Cron #2185
Posted by Apache Jenkins Server <je...@builds.apache.org>.
See <https://ci-beam.apache.org/job/beam_PreCommit_Java_Examples_Dataflow_Java17_Cron/2185/display/redirect>
Changes:
------------------------------------------
[...truncated 5.63 KB...]
> Task :buildSrc:testClasses UP-TO-DATE
> Task :buildSrc:test NO-SOURCE
> Task :buildSrc:validatePlugins FROM-CACHE
> Task :buildSrc:check UP-TO-DATE
> Task :buildSrc:build
> Task :clean UP-TO-DATE
BUILD SUCCESSFUL in 10s
7 actionable tasks: 4 executed, 2 from cache, 1 up-to-date
Publishing build scan...
https://ge.apache.org/s/2kt2h33olpdpc
Build step 'Invoke Gradle script' changed build result to SUCCESS
[Gradle] - Launching build.
[src] $ <https://ci-beam.apache.org/job/beam_PreCommit_Java_Examples_Dataflow_Java17_Cron/ws/src/gradlew> -PdisableSpotlessCheck=true -PdisableCheckStyle=true -PskipCheckerFramework -PcompileAndRunTestsWithJava17 -Pjava17Home=/usr/lib/jvm/java-17-openjdk-amd64 --continue --max-workers=12 -Dorg.gradle.jvmargs=-Xms2g -Dorg.gradle.jvmargs=-Xmx6g -Dorg.gradle.vfs.watch=false -Pdocker-pull-licenses javaExamplesDataflowPreCommit
To honour the JVM settings for this build a single-use Daemon process will be forked. See https://docs.gradle.org/7.5.1/userguide/gradle_daemon.html#sec:disabling_the_daemon.
Daemon will be stopped at the end of the build
Configuration on demand is an incubating feature.
Gradle Enterprise plugins resolution: https://plugins.gradle.org/m2
Enforcing Gradle Enterprise: https://ge.apache.org, allowUntrustedServer: false
> Task :buildSrc:compileJava NO-SOURCE
> Task :buildSrc:compileGroovy UP-TO-DATE
> Task :buildSrc:pluginDescriptors UP-TO-DATE
> Task :buildSrc:processResources UP-TO-DATE
> Task :buildSrc:classes UP-TO-DATE
> Task :buildSrc:jar UP-TO-DATE
> Task :buildSrc:assemble UP-TO-DATE
> Task :buildSrc:pluginUnderTestMetadata UP-TO-DATE
> Task :buildSrc:compileTestJava NO-SOURCE
> Task :buildSrc:compileTestGroovy NO-SOURCE
> Task :buildSrc:processTestResources NO-SOURCE
> Task :buildSrc:testClasses UP-TO-DATE
> Task :buildSrc:test NO-SOURCE
> Task :buildSrc:validatePlugins UP-TO-DATE
> Task :buildSrc:check UP-TO-DATE
> Task :buildSrc:build UP-TO-DATE
> Configure project :sdks:java:container:java8
docker-pull-licenses set, creating go-licenses
> Configure project :sdks:java:container:java11
docker-pull-licenses set, creating go-licenses
> Configure project :sdks:go:container
docker-pull-licenses set, running go-licenses
> Configure project :sdks:java:container:java17
docker-pull-licenses set, creating go-licenses
> Task :sdks:java:expansion-service:processResources NO-SOURCE
> Task :runners:core-java:processResources NO-SOURCE
> Task :runners:java-fn-execution:processResources NO-SOURCE
> Task :sdks:java:extensions:google-cloud-platform-core:processResources NO-SOURCE
> Task :runners:core-construction-java:processResources NO-SOURCE
> Task :sdks:java:fn-execution:processResources NO-SOURCE
> Task :sdks:java:extensions:avro:generateAvroProtocol NO-SOURCE
> Task :sdks:java:harness:processResources NO-SOURCE
> Task :sdks:java:core:generateAvroProtocol NO-SOURCE
> Task :sdks:java:extensions:avro:generateAvroJava NO-SOURCE
> Task :sdks:java:extensions:arrow:processResources NO-SOURCE
> Task :sdks:java:core:generateAvroJava NO-SOURCE
> Task :sdks:java:extensions:avro:processResources NO-SOURCE
> Task :sdks:java:io:google-cloud-platform:processResources NO-SOURCE
> Task :runners:local-java:processResources NO-SOURCE
> Task :sdks:java:io:kafka:processResources NO-SOURCE
> Task :examples:java:processResources NO-SOURCE
> Task :sdks:java:extensions:ml:processResources NO-SOURCE
> Task :runners:google-cloud-dataflow-java:examples:compileJava NO-SOURCE
> Task :runners:direct-java:processResources NO-SOURCE
> Task :runners:google-cloud-dataflow-java:examples:processResources NO-SOURCE
> Task :runners:google-cloud-dataflow-java:examples:classes UP-TO-DATE
> Task :runners:google-cloud-dataflow-java:examples:compileTestJava NO-SOURCE
> Task :runners:google-cloud-dataflow-java:examples:processTestResources NO-SOURCE
> Task :runners:google-cloud-dataflow-java:examples:testClasses UP-TO-DATE
> Task :runners:google-cloud-dataflow-java:examples-streaming:compileJava NO-SOURCE
> Task :runners:google-cloud-dataflow-java:examples-streaming:processResources NO-SOURCE
> Task :runners:google-cloud-dataflow-java:examples-streaming:classes UP-TO-DATE
> Task :runners:google-cloud-dataflow-java:examples-streaming:compileTestJava NO-SOURCE
> Task :runners:google-cloud-dataflow-java:examples-streaming:processTestResources NO-SOURCE
> Task :runners:google-cloud-dataflow-java:examples-streaming:testClasses UP-TO-DATE
> Task :runners:core-java:processTestResources NO-SOURCE
> Task :runners:direct-java:processTestResources NO-SOURCE
> Task :sdks:java:testing:test-utils:processResources NO-SOURCE
> Task :sdks:java:testing:test-utils:processTestResources NO-SOURCE
> Task :examples:java:processTestResources
> Task :runners:google-cloud-dataflow-java:processResources
> Task :runners:google-cloud-dataflow-java:worker:processResources
> Task :model:fn-execution:extractProto
> Task :sdks:java:extensions:python:processResources
> Task :model:job-management:extractProto
> Task :sdks:java:extensions:protobuf:extractProto
> Task :sdks:java:extensions:protobuf:processResources NO-SOURCE
> Task :model:job-management:processResources
> Task :model:fn-execution:processResources
> Task :sdks:java:core:generateGrammarSource FROM-CACHE
> Task :sdks:java:core:processResources
> Task :sdks:java:core:generateTestAvroProtocol NO-SOURCE
> Task :sdks:java:transform-service:launcher:compileJava FROM-CACHE
> Task :sdks:java:transform-service:launcher:processResources
> Task :sdks:java:core:generateTestAvroJava FROM-CACHE
> Task :sdks:java:transform-service:launcher:classes
> Task :sdks:java:core:generateTestGrammarSource NO-SOURCE
> Task :sdks:java:core:processTestResources
> Task :sdks:java:transform-service:launcher:shadowJar FROM-CACHE
> Task :model:pipeline:extractIncludeProto
> Task :runners:google-cloud-dataflow-java:worker:windmill:extractIncludeProto
> Task :model:pipeline:extractProto
> Task :runners:google-cloud-dataflow-java:worker:windmill:extractProto
> Task :runners:google-cloud-dataflow-java:worker:windmill:generateProto FROM-CACHE
> Task :model:pipeline:generateProto FROM-CACHE
> Task :runners:google-cloud-dataflow-java:worker:windmill:compileJava FROM-CACHE
> Task :runners:google-cloud-dataflow-java:worker:windmill:processResources
> Task :runners:google-cloud-dataflow-java:worker:windmill:classes
> Task :runners:google-cloud-dataflow-java:worker:windmill:shadowJar FROM-CACHE
> Task :model:pipeline:compileJava FROM-CACHE
> Task :model:pipeline:processResources
> Task :model:pipeline:classes
> Task :model:pipeline:jar
> Task :model:pipeline:shadowJar FROM-CACHE
> Task :model:fn-execution:extractIncludeProto
> Task :model:job-management:extractIncludeProto
> Task :model:job-management:generateProto FROM-CACHE
> Task :model:fn-execution:generateProto FROM-CACHE
> Task :model:job-management:compileJava FROM-CACHE
> Task :model:job-management:classes
> Task :model:fn-execution:compileJava FROM-CACHE
> Task :model:fn-execution:classes
> Task :model:job-management:shadowJar FROM-CACHE
> Task :model:fn-execution:shadowJar FROM-CACHE
> Task :sdks:java:core:compileJava FROM-CACHE
> Task :sdks:java:core:classes
> Task :sdks:java:core:shadowJar FROM-CACHE
> Task :sdks:java:testing:test-utils:compileJava FROM-CACHE
> Task :sdks:java:testing:test-utils:classes UP-TO-DATE
> Task :sdks:java:extensions:arrow:compileJava FROM-CACHE
> Task :sdks:java:extensions:arrow:classes UP-TO-DATE
> Task :sdks:java:extensions:arrow:jar
> Task :runners:local-java:compileJava FROM-CACHE
> Task :runners:local-java:classes UP-TO-DATE
> Task :sdks:java:extensions:avro:compileJava FROM-CACHE
> Task :sdks:java:extensions:avro:classes UP-TO-DATE
> Task :runners:local-java:jar
> Task :sdks:java:extensions:avro:jar
> Task :sdks:java:fn-execution:compileJava FROM-CACHE
> Task :sdks:java:fn-execution:classes UP-TO-DATE
> Task :sdks:java:fn-execution:jar
> Task :sdks:java:extensions:protobuf:extractIncludeProto
> Task :sdks:java:extensions:protobuf:generateProto NO-SOURCE
> Task :runners:core-construction-java:compileJava FROM-CACHE
> Task :runners:core-construction-java:classes UP-TO-DATE
> Task :sdks:java:extensions:protobuf:compileJava FROM-CACHE
> Task :sdks:java:extensions:protobuf:classes UP-TO-DATE
> Task :sdks:java:extensions:protobuf:jar
> Task :runners:core-construction-java:jar
> Task :runners:core-java:compileJava FROM-CACHE
> Task :runners:core-java:classes UP-TO-DATE
> Task :runners:core-java:jar
> Task :sdks:java:extensions:python:compileJava FROM-CACHE
> Task :sdks:java:extensions:python:classes
> Task :sdks:java:extensions:python:jar
> Task :sdks:java:testing:test-utils:compileTestJava FROM-CACHE
> Task :sdks:java:testing:test-utils:testClasses UP-TO-DATE
> Task :sdks:java:extensions:google-cloud-platform-core:compileJava FROM-CACHE
> Task :sdks:java:extensions:google-cloud-platform-core:classes UP-TO-DATE
> Task :sdks:java:harness:compileJava FROM-CACHE
> Task :sdks:java:harness:classes UP-TO-DATE
> Task :sdks:java:extensions:google-cloud-platform-core:jar
> Task :sdks:java:harness:jar
> Task :runners:java-fn-execution:compileJava FROM-CACHE
> Task :runners:java-fn-execution:classes UP-TO-DATE
> Task :runners:java-fn-execution:jar
> Task :sdks:java:expansion-service:compileJava FROM-CACHE
> Task :sdks:java:expansion-service:classes UP-TO-DATE
> Task :sdks:java:expansion-service:jar
> Task :runners:direct-java:compileJava FROM-CACHE
> Task :runners:direct-java:classes UP-TO-DATE
> Task :sdks:java:extensions:ml:compileJava FROM-CACHE
> Task :sdks:java:extensions:ml:classes UP-TO-DATE
> Task :sdks:java:io:kafka:compileJava FROM-CACHE
> Task :sdks:java:io:kafka:classes UP-TO-DATE
> Task :runners:direct-java:shadowJar FROM-CACHE
> Task :sdks:java:harness:shadowJar FROM-CACHE
> Task :sdks:java:extensions:ml:jar
> Task :sdks:java:io:kafka:jar
> Task :sdks:java:core:compileTestJava FROM-CACHE
> Task :sdks:java:core:testClasses
> Task :sdks:java:io:google-cloud-platform:compileJava FROM-CACHE
> Task :sdks:java:io:google-cloud-platform:classes UP-TO-DATE
> Task :sdks:java:core:shadowTestJar FROM-CACHE
> Task :sdks:java:io:google-cloud-platform:jar
> Task :runners:google-cloud-dataflow-java:compileJava FROM-CACHE
> Task :runners:google-cloud-dataflow-java:classes
> Task :examples:java:compileJava FROM-CACHE
> Task :examples:java:classes UP-TO-DATE
> Task :runners:google-cloud-dataflow-java:jar
> Task :runners:core-java:compileTestJava FROM-CACHE
> Task :runners:core-java:testClasses UP-TO-DATE
> Task :examples:java:jar
> Task :runners:core-java:testJar
> Task :runners:direct-java:compileTestJava FROM-CACHE
> Task :runners:direct-java:testClasses UP-TO-DATE
> Task :examples:java:compileTestJava FROM-CACHE
> Task :examples:java:testClasses
> Task :runners:google-cloud-dataflow-java:worker:compileJava FROM-CACHE
> Task :runners:google-cloud-dataflow-java:worker:classes
> Task :examples:java:testJar
> Task :runners:direct-java:shadowTestJar FROM-CACHE
> Task :sdks:java:testing:test-utils:verifyJavaVersion17 FROM-CACHE
> Task :runners:google-cloud-dataflow-java:worker:shadowJar FROM-CACHE
> Task :runners:google-cloud-dataflow-java:examples-streaming:appliancePreCommit FROM-CACHE
> Task :runners:google-cloud-dataflow-java:examples:preCommitLegacyWorker FROM-CACHE
> Task :runners:google-cloud-dataflow-java:examples:preCommitLegacyWorkerImpersonate FROM-CACHE
> Task :runners:google-cloud-dataflow-java:examples:preCommit UP-TO-DATE
> Task :runners:google-cloud-dataflow-java:examples-streaming:windmillPreCommit
org.apache.beam.examples.WordCountIT > testE2EWordCount FAILED
java.lang.RuntimeException at WordCountIT.java:69
1 test completed, 1 failed
> Task :runners:google-cloud-dataflow-java:examples-streaming:windmillPreCommit FAILED
FAILURE: Build failed with an exception.
* What went wrong:
Execution failed for task ':runners:google-cloud-dataflow-java:examples-streaming:windmillPreCommit'.
> There were failing tests. See the report at: file://<https://ci-beam.apache.org/job/beam_PreCommit_Java_Examples_Dataflow_Java17_Cron/ws/src/runners/google-cloud-dataflow-java/examples-streaming/build/reports/tests/windmillPreCommit/index.html>
* Try:
> Run with --stacktrace option to get the stack trace.
> Run with --info or --debug option to get more log output.
* Get more help at https://help.gradle.org
Deprecated Gradle features were used in this build, making it incompatible with Gradle 8.0.
You can use '--warning-mode all' to show the individual deprecation warnings and determine if they come from your own scripts or plugins.
See https://docs.gradle.org/7.5.1/userguide/command_line_interface.html#sec:command_line_warnings
BUILD FAILED in 16m 8s
100 actionable tasks: 42 executed, 52 from cache, 6 up-to-date
Publishing build scan...
https://ge.apache.org/s/77kl47kkclovu
Build step 'Invoke Gradle script' changed build result to FAILURE
Build step 'Invoke Gradle script' marked build as failure
---------------------------------------------------------------------
To unsubscribe, e-mail: builds-unsubscribe@beam.apache.org
For additional commands, e-mail: builds-help@beam.apache.org
Build failed in Jenkins: beam_PreCommit_Java_Examples_Dataflow_Java17_Cron #2184
Posted by Apache Jenkins Server <je...@builds.apache.org>.
See <https://ci-beam.apache.org/job/beam_PreCommit_Java_Examples_Dataflow_Java17_Cron/2184/display/redirect>
Changes:
------------------------------------------
[...truncated 5.63 KB...]
> Task :buildSrc:testClasses UP-TO-DATE
> Task :buildSrc:test NO-SOURCE
> Task :buildSrc:validatePlugins FROM-CACHE
> Task :buildSrc:check UP-TO-DATE
> Task :buildSrc:build
> Task :clean UP-TO-DATE
BUILD SUCCESSFUL in 9s
7 actionable tasks: 4 executed, 2 from cache, 1 up-to-date
Publishing build scan...
https://ge.apache.org/s/xxemohxryz642
Build step 'Invoke Gradle script' changed build result to SUCCESS
[Gradle] - Launching build.
[src] $ <https://ci-beam.apache.org/job/beam_PreCommit_Java_Examples_Dataflow_Java17_Cron/ws/src/gradlew> -PdisableSpotlessCheck=true -PdisableCheckStyle=true -PskipCheckerFramework -PcompileAndRunTestsWithJava17 -Pjava17Home=/usr/lib/jvm/java-17-openjdk-amd64 --continue --max-workers=12 -Dorg.gradle.jvmargs=-Xms2g -Dorg.gradle.jvmargs=-Xmx6g -Dorg.gradle.vfs.watch=false -Pdocker-pull-licenses javaExamplesDataflowPreCommit
To honour the JVM settings for this build a single-use Daemon process will be forked. See https://docs.gradle.org/7.5.1/userguide/gradle_daemon.html#sec:disabling_the_daemon.
Daemon will be stopped at the end of the build
Configuration on demand is an incubating feature.
Gradle Enterprise plugins resolution: https://plugins.gradle.org/m2
Enforcing Gradle Enterprise: https://ge.apache.org, allowUntrustedServer: false
> Task :buildSrc:compileJava NO-SOURCE
> Task :buildSrc:compileGroovy UP-TO-DATE
> Task :buildSrc:pluginDescriptors UP-TO-DATE
> Task :buildSrc:processResources UP-TO-DATE
> Task :buildSrc:classes UP-TO-DATE
> Task :buildSrc:jar UP-TO-DATE
> Task :buildSrc:assemble UP-TO-DATE
> Task :buildSrc:pluginUnderTestMetadata UP-TO-DATE
> Task :buildSrc:compileTestJava NO-SOURCE
> Task :buildSrc:compileTestGroovy NO-SOURCE
> Task :buildSrc:processTestResources NO-SOURCE
> Task :buildSrc:testClasses UP-TO-DATE
> Task :buildSrc:test NO-SOURCE
> Task :buildSrc:validatePlugins UP-TO-DATE
> Task :buildSrc:check UP-TO-DATE
> Task :buildSrc:build UP-TO-DATE
> Configure project :sdks:java:container:java8
docker-pull-licenses set, creating go-licenses
> Configure project :sdks:java:container:java11
docker-pull-licenses set, creating go-licenses
> Configure project :sdks:go:container
docker-pull-licenses set, running go-licenses
> Configure project :sdks:java:container:java17
docker-pull-licenses set, creating go-licenses
> Task :sdks:java:extensions:avro:generateAvroProtocol NO-SOURCE
> Task :runners:java-fn-execution:processResources NO-SOURCE
> Task :runners:core-construction-java:processResources NO-SOURCE
> Task :sdks:java:expansion-service:processResources NO-SOURCE
> Task :sdks:java:fn-execution:processResources NO-SOURCE
> Task :sdks:java:core:generateAvroProtocol NO-SOURCE
> Task :sdks:java:extensions:google-cloud-platform-core:processResources NO-SOURCE
> Task :sdks:java:harness:processResources NO-SOURCE
> Task :runners:core-java:processResources NO-SOURCE
> Task :sdks:java:extensions:avro:generateAvroJava NO-SOURCE
> Task :sdks:java:core:generateAvroJava NO-SOURCE
> Task :sdks:java:extensions:avro:processResources NO-SOURCE
> Task :sdks:java:extensions:ml:processResources NO-SOURCE
> Task :sdks:java:io:kafka:processResources NO-SOURCE
> Task :sdks:java:io:google-cloud-platform:processResources NO-SOURCE
> Task :sdks:java:extensions:arrow:processResources NO-SOURCE
> Task :runners:direct-java:processResources NO-SOURCE
> Task :runners:google-cloud-dataflow-java:examples:compileJava NO-SOURCE
> Task :runners:google-cloud-dataflow-java:examples:processResources NO-SOURCE
> Task :runners:google-cloud-dataflow-java:examples:classes UP-TO-DATE
> Task :runners:local-java:processResources NO-SOURCE
> Task :examples:java:processResources NO-SOURCE
> Task :runners:google-cloud-dataflow-java:examples:compileTestJava NO-SOURCE
> Task :runners:google-cloud-dataflow-java:examples:processTestResources NO-SOURCE
> Task :runners:google-cloud-dataflow-java:examples:testClasses UP-TO-DATE
> Task :runners:google-cloud-dataflow-java:examples-streaming:compileJava NO-SOURCE
> Task :runners:google-cloud-dataflow-java:examples-streaming:processResources NO-SOURCE
> Task :runners:google-cloud-dataflow-java:examples-streaming:classes UP-TO-DATE
> Task :runners:google-cloud-dataflow-java:examples-streaming:compileTestJava NO-SOURCE
> Task :runners:google-cloud-dataflow-java:examples-streaming:processTestResources NO-SOURCE
> Task :runners:google-cloud-dataflow-java:examples-streaming:testClasses UP-TO-DATE
> Task :runners:core-java:processTestResources NO-SOURCE
> Task :runners:direct-java:processTestResources NO-SOURCE
> Task :sdks:java:testing:test-utils:processResources NO-SOURCE
> Task :sdks:java:testing:test-utils:processTestResources NO-SOURCE
> Task :sdks:java:extensions:python:processResources
> Task :runners:google-cloud-dataflow-java:worker:processResources
> Task :sdks:java:extensions:protobuf:extractProto
> Task :examples:java:processTestResources
> Task :model:fn-execution:extractProto
> Task :model:job-management:extractProto
> Task :sdks:java:extensions:protobuf:processResources NO-SOURCE
> Task :runners:google-cloud-dataflow-java:processResources
> Task :sdks:java:core:generateGrammarSource FROM-CACHE
> Task :model:job-management:processResources
> Task :model:fn-execution:processResources
> Task :sdks:java:core:processResources
> Task :sdks:java:core:generateTestAvroProtocol NO-SOURCE
> Task :sdks:java:core:generateTestAvroJava FROM-CACHE
> Task :sdks:java:core:generateTestGrammarSource NO-SOURCE
> Task :sdks:java:transform-service:launcher:compileJava FROM-CACHE
> Task :sdks:java:core:processTestResources
> Task :sdks:java:transform-service:launcher:processResources
> Task :sdks:java:transform-service:launcher:classes
> Task :sdks:java:transform-service:launcher:shadowJar FROM-CACHE
> Task :model:pipeline:extractIncludeProto
> Task :runners:google-cloud-dataflow-java:worker:windmill:extractIncludeProto
> Task :runners:google-cloud-dataflow-java:worker:windmill:extractProto
> Task :model:pipeline:extractProto
> Task :runners:google-cloud-dataflow-java:worker:windmill:generateProto FROM-CACHE
> Task :model:pipeline:generateProto FROM-CACHE
> Task :runners:google-cloud-dataflow-java:worker:windmill:compileJava FROM-CACHE
> Task :runners:google-cloud-dataflow-java:worker:windmill:processResources
> Task :runners:google-cloud-dataflow-java:worker:windmill:classes
> Task :runners:google-cloud-dataflow-java:worker:windmill:shadowJar FROM-CACHE
> Task :model:pipeline:compileJava FROM-CACHE
> Task :model:pipeline:processResources
> Task :model:pipeline:classes
> Task :model:pipeline:jar
> Task :model:pipeline:shadowJar FROM-CACHE
> Task :model:fn-execution:extractIncludeProto
> Task :model:job-management:extractIncludeProto
> Task :model:fn-execution:generateProto FROM-CACHE
> Task :model:job-management:generateProto FROM-CACHE
> Task :model:fn-execution:compileJava FROM-CACHE
> Task :model:fn-execution:classes
> Task :model:job-management:compileJava FROM-CACHE
> Task :model:job-management:classes
> Task :model:fn-execution:shadowJar FROM-CACHE
> Task :model:job-management:shadowJar FROM-CACHE
> Task :sdks:java:core:compileJava FROM-CACHE
> Task :sdks:java:core:classes
> Task :sdks:java:core:shadowJar FROM-CACHE
> Task :sdks:java:extensions:avro:compileJava FROM-CACHE
> Task :sdks:java:extensions:avro:classes UP-TO-DATE
> Task :runners:local-java:compileJava FROM-CACHE
> Task :runners:local-java:classes UP-TO-DATE
> Task :runners:local-java:jar
> Task :sdks:java:testing:test-utils:compileJava FROM-CACHE
> Task :sdks:java:testing:test-utils:classes UP-TO-DATE
> Task :sdks:java:extensions:avro:jar
> Task :sdks:java:extensions:arrow:compileJava FROM-CACHE
> Task :sdks:java:extensions:arrow:classes UP-TO-DATE
> Task :sdks:java:extensions:arrow:jar
> Task :sdks:java:fn-execution:compileJava FROM-CACHE
> Task :sdks:java:fn-execution:classes UP-TO-DATE
> Task :sdks:java:fn-execution:jar
> Task :sdks:java:extensions:protobuf:extractIncludeProto
> Task :sdks:java:extensions:protobuf:generateProto NO-SOURCE
> Task :runners:core-construction-java:compileJava FROM-CACHE
> Task :runners:core-construction-java:classes UP-TO-DATE
> Task :sdks:java:testing:test-utils:compileTestJava FROM-CACHE
> Task :sdks:java:testing:test-utils:testClasses UP-TO-DATE
> Task :sdks:java:extensions:protobuf:compileJava FROM-CACHE
> Task :sdks:java:extensions:protobuf:classes UP-TO-DATE
> Task :sdks:java:extensions:protobuf:jar
> Task :runners:core-construction-java:jar
> Task :runners:core-java:compileJava FROM-CACHE
> Task :runners:core-java:classes UP-TO-DATE
> Task :sdks:java:extensions:python:compileJava FROM-CACHE
> Task :sdks:java:extensions:python:classes
> Task :runners:core-java:jar
> Task :sdks:java:extensions:python:jar
> Task :sdks:java:extensions:google-cloud-platform-core:compileJava FROM-CACHE
> Task :sdks:java:extensions:google-cloud-platform-core:classes UP-TO-DATE
> Task :sdks:java:harness:compileJava FROM-CACHE
> Task :sdks:java:harness:classes UP-TO-DATE
> Task :sdks:java:extensions:google-cloud-platform-core:jar
> Task :sdks:java:harness:jar
> Task :runners:java-fn-execution:compileJava FROM-CACHE
> Task :runners:java-fn-execution:classes UP-TO-DATE
> Task :runners:java-fn-execution:jar
> Task :sdks:java:expansion-service:compileJava FROM-CACHE
> Task :sdks:java:expansion-service:classes UP-TO-DATE
> Task :sdks:java:expansion-service:jar
> Task :runners:direct-java:compileJava FROM-CACHE
> Task :runners:direct-java:classes UP-TO-DATE
> Task :sdks:java:extensions:ml:compileJava FROM-CACHE
> Task :sdks:java:extensions:ml:classes UP-TO-DATE
> Task :sdks:java:io:kafka:compileJava FROM-CACHE
> Task :sdks:java:io:kafka:classes UP-TO-DATE
> Task :sdks:java:extensions:ml:jar
> Task :sdks:java:core:compileTestJava FROM-CACHE
> Task :sdks:java:core:testClasses
> Task :sdks:java:io:kafka:jar
> Task :runners:direct-java:shadowJar FROM-CACHE
> Task :sdks:java:harness:shadowJar FROM-CACHE
> Task :sdks:java:core:shadowTestJar FROM-CACHE
> Task :sdks:java:io:google-cloud-platform:compileJava FROM-CACHE
> Task :sdks:java:io:google-cloud-platform:classes UP-TO-DATE
> Task :sdks:java:io:google-cloud-platform:jar
> Task :runners:core-java:compileTestJava FROM-CACHE
> Task :runners:core-java:testClasses UP-TO-DATE
> Task :runners:core-java:testJar
> Task :runners:direct-java:compileTestJava FROM-CACHE
> Task :runners:direct-java:testClasses UP-TO-DATE
> Task :runners:google-cloud-dataflow-java:compileJava FROM-CACHE
> Task :runners:google-cloud-dataflow-java:classes
> Task :runners:google-cloud-dataflow-java:jar
> Task :examples:java:compileJava FROM-CACHE
> Task :examples:java:classes UP-TO-DATE
> Task :examples:java:jar
> Task :runners:direct-java:shadowTestJar FROM-CACHE
> Task :sdks:java:testing:test-utils:verifyJavaVersion17 FROM-CACHE
> Task :runners:google-cloud-dataflow-java:worker:compileJava FROM-CACHE
> Task :runners:google-cloud-dataflow-java:worker:classes
> Task :examples:java:compileTestJava FROM-CACHE
> Task :examples:java:testClasses
> Task :examples:java:testJar
> Task :runners:google-cloud-dataflow-java:worker:shadowJar FROM-CACHE
> Task :runners:google-cloud-dataflow-java:examples-streaming:appliancePreCommit FROM-CACHE
> Task :runners:google-cloud-dataflow-java:examples:preCommitLegacyWorker FROM-CACHE
> Task :runners:google-cloud-dataflow-java:examples:preCommitLegacyWorkerImpersonate FROM-CACHE
> Task :runners:google-cloud-dataflow-java:examples:preCommit UP-TO-DATE
> Task :runners:google-cloud-dataflow-java:examples-streaming:windmillPreCommit
org.apache.beam.examples.WordCountIT > testE2EWordCount FAILED
java.lang.RuntimeException at WordCountIT.java:69
1 test completed, 1 failed
> Task :runners:google-cloud-dataflow-java:examples-streaming:windmillPreCommit FAILED
FAILURE: Build failed with an exception.
* What went wrong:
Execution failed for task ':runners:google-cloud-dataflow-java:examples-streaming:windmillPreCommit'.
> There were failing tests. See the report at: file://<https://ci-beam.apache.org/job/beam_PreCommit_Java_Examples_Dataflow_Java17_Cron/ws/src/runners/google-cloud-dataflow-java/examples-streaming/build/reports/tests/windmillPreCommit/index.html>
* Try:
> Run with --stacktrace option to get the stack trace.
> Run with --info or --debug option to get more log output.
* Get more help at https://help.gradle.org
Deprecated Gradle features were used in this build, making it incompatible with Gradle 8.0.
You can use '--warning-mode all' to show the individual deprecation warnings and determine if they come from your own scripts or plugins.
See https://docs.gradle.org/7.5.1/userguide/command_line_interface.html#sec:command_line_warnings
BUILD FAILED in 16m
100 actionable tasks: 42 executed, 52 from cache, 6 up-to-date
Publishing build scan...
https://ge.apache.org/s/yebs75ku32rl6
Build step 'Invoke Gradle script' changed build result to FAILURE
Build step 'Invoke Gradle script' marked build as failure
---------------------------------------------------------------------
To unsubscribe, e-mail: builds-unsubscribe@beam.apache.org
For additional commands, e-mail: builds-help@beam.apache.org
Build failed in Jenkins: beam_PreCommit_Java_Examples_Dataflow_Java17_Cron #2183
Posted by Apache Jenkins Server <je...@builds.apache.org>.
See <https://ci-beam.apache.org/job/beam_PreCommit_Java_Examples_Dataflow_Java17_Cron/2183/display/redirect>
Changes:
------------------------------------------
[...truncated 5.63 KB...]
> Task :buildSrc:testClasses UP-TO-DATE
> Task :buildSrc:test NO-SOURCE
> Task :buildSrc:validatePlugins FROM-CACHE
> Task :buildSrc:check UP-TO-DATE
> Task :buildSrc:build
> Task :clean UP-TO-DATE
BUILD SUCCESSFUL in 10s
7 actionable tasks: 4 executed, 2 from cache, 1 up-to-date
Publishing build scan...
https://ge.apache.org/s/lx5xlsekjbeze
Build step 'Invoke Gradle script' changed build result to SUCCESS
[Gradle] - Launching build.
[src] $ <https://ci-beam.apache.org/job/beam_PreCommit_Java_Examples_Dataflow_Java17_Cron/ws/src/gradlew> -PdisableSpotlessCheck=true -PdisableCheckStyle=true -PskipCheckerFramework -PcompileAndRunTestsWithJava17 -Pjava17Home=/usr/lib/jvm/java-17-openjdk-amd64 --continue --max-workers=12 -Dorg.gradle.jvmargs=-Xms2g -Dorg.gradle.jvmargs=-Xmx6g -Dorg.gradle.vfs.watch=false -Pdocker-pull-licenses javaExamplesDataflowPreCommit
To honour the JVM settings for this build a single-use Daemon process will be forked. See https://docs.gradle.org/7.5.1/userguide/gradle_daemon.html#sec:disabling_the_daemon.
Daemon will be stopped at the end of the build
Configuration on demand is an incubating feature.
Gradle Enterprise plugins resolution: https://plugins.gradle.org/m2
Enforcing Gradle Enterprise: https://ge.apache.org, allowUntrustedServer: false
> Task :buildSrc:compileJava NO-SOURCE
> Task :buildSrc:compileGroovy UP-TO-DATE
> Task :buildSrc:pluginDescriptors UP-TO-DATE
> Task :buildSrc:processResources UP-TO-DATE
> Task :buildSrc:classes UP-TO-DATE
> Task :buildSrc:jar UP-TO-DATE
> Task :buildSrc:assemble UP-TO-DATE
> Task :buildSrc:pluginUnderTestMetadata UP-TO-DATE
> Task :buildSrc:compileTestJava NO-SOURCE
> Task :buildSrc:compileTestGroovy NO-SOURCE
> Task :buildSrc:processTestResources NO-SOURCE
> Task :buildSrc:testClasses UP-TO-DATE
> Task :buildSrc:test NO-SOURCE
> Task :buildSrc:validatePlugins UP-TO-DATE
> Task :buildSrc:check UP-TO-DATE
> Task :buildSrc:build UP-TO-DATE
> Configure project :sdks:java:container:java8
docker-pull-licenses set, creating go-licenses
> Configure project :sdks:java:container:java11
docker-pull-licenses set, creating go-licenses
> Configure project :sdks:go:container
docker-pull-licenses set, running go-licenses
> Configure project :sdks:java:container:java17
docker-pull-licenses set, creating go-licenses
> Task :sdks:java:core:generateAvroProtocol NO-SOURCE
> Task :runners:core-construction-java:processResources NO-SOURCE
> Task :sdks:java:harness:processResources NO-SOURCE
> Task :sdks:java:fn-execution:processResources NO-SOURCE
> Task :sdks:java:extensions:avro:generateAvroProtocol NO-SOURCE
> Task :sdks:java:extensions:google-cloud-platform-core:processResources NO-SOURCE
> Task :sdks:java:expansion-service:processResources NO-SOURCE
> Task :runners:core-java:processResources NO-SOURCE
> Task :runners:java-fn-execution:processResources NO-SOURCE
> Task :sdks:java:extensions:avro:generateAvroJava NO-SOURCE
> Task :sdks:java:extensions:ml:processResources NO-SOURCE
> Task :sdks:java:core:generateAvroJava NO-SOURCE
> Task :sdks:java:extensions:avro:processResources NO-SOURCE
> Task :sdks:java:io:kafka:processResources NO-SOURCE
> Task :sdks:java:io:google-cloud-platform:processResources NO-SOURCE
> Task :examples:java:processResources NO-SOURCE
> Task :sdks:java:extensions:arrow:processResources NO-SOURCE
> Task :runners:local-java:processResources NO-SOURCE
> Task :runners:direct-java:processResources NO-SOURCE
> Task :runners:google-cloud-dataflow-java:examples:compileJava NO-SOURCE
> Task :runners:google-cloud-dataflow-java:examples:processResources NO-SOURCE
> Task :runners:google-cloud-dataflow-java:examples:classes UP-TO-DATE
> Task :runners:google-cloud-dataflow-java:examples:compileTestJava NO-SOURCE
> Task :runners:google-cloud-dataflow-java:examples:processTestResources NO-SOURCE
> Task :runners:google-cloud-dataflow-java:examples:testClasses UP-TO-DATE
> Task :runners:google-cloud-dataflow-java:examples-streaming:compileJava NO-SOURCE
> Task :runners:google-cloud-dataflow-java:examples-streaming:processResources NO-SOURCE
> Task :runners:google-cloud-dataflow-java:examples-streaming:classes UP-TO-DATE
> Task :runners:google-cloud-dataflow-java:examples-streaming:compileTestJava NO-SOURCE
> Task :runners:google-cloud-dataflow-java:examples-streaming:processTestResources NO-SOURCE
> Task :runners:google-cloud-dataflow-java:examples-streaming:testClasses UP-TO-DATE
> Task :runners:core-java:processTestResources NO-SOURCE
> Task :runners:direct-java:processTestResources NO-SOURCE
> Task :sdks:java:testing:test-utils:processResources NO-SOURCE
> Task :sdks:java:testing:test-utils:processTestResources NO-SOURCE
> Task :model:job-management:extractProto
> Task :sdks:java:extensions:python:processResources
> Task :sdks:java:extensions:protobuf:extractProto
> Task :runners:google-cloud-dataflow-java:worker:processResources
> Task :examples:java:processTestResources
> Task :model:fn-execution:extractProto
> Task :sdks:java:extensions:protobuf:processResources NO-SOURCE
> Task :sdks:java:core:generateGrammarSource FROM-CACHE
> Task :model:job-management:processResources
> Task :model:fn-execution:processResources
> Task :sdks:java:core:processResources
> Task :runners:google-cloud-dataflow-java:processResources
> Task :sdks:java:core:generateTestAvroProtocol NO-SOURCE
> Task :sdks:java:core:generateTestAvroJava FROM-CACHE
> Task :sdks:java:core:generateTestGrammarSource NO-SOURCE
> Task :sdks:java:transform-service:launcher:compileJava FROM-CACHE
> Task :sdks:java:transform-service:launcher:processResources
> Task :sdks:java:transform-service:launcher:classes
> Task :sdks:java:core:processTestResources
> Task :sdks:java:transform-service:launcher:shadowJar FROM-CACHE
> Task :model:pipeline:extractIncludeProto
> Task :runners:google-cloud-dataflow-java:worker:windmill:extractIncludeProto
> Task :model:pipeline:extractProto
> Task :runners:google-cloud-dataflow-java:worker:windmill:extractProto
> Task :runners:google-cloud-dataflow-java:worker:windmill:generateProto FROM-CACHE
> Task :model:pipeline:generateProto FROM-CACHE
> Task :runners:google-cloud-dataflow-java:worker:windmill:compileJava FROM-CACHE
> Task :runners:google-cloud-dataflow-java:worker:windmill:processResources
> Task :runners:google-cloud-dataflow-java:worker:windmill:classes
> Task :model:pipeline:compileJava FROM-CACHE
> Task :model:pipeline:processResources
> Task :model:pipeline:classes
> Task :runners:google-cloud-dataflow-java:worker:windmill:shadowJar FROM-CACHE
> Task :model:pipeline:jar
> Task :model:pipeline:shadowJar FROM-CACHE
> Task :model:fn-execution:extractIncludeProto
> Task :model:job-management:extractIncludeProto
> Task :model:job-management:generateProto FROM-CACHE
> Task :model:fn-execution:generateProto FROM-CACHE
> Task :model:job-management:compileJava FROM-CACHE
> Task :model:job-management:classes
> Task :model:fn-execution:compileJava FROM-CACHE
> Task :model:fn-execution:classes
> Task :model:job-management:shadowJar FROM-CACHE
> Task :model:fn-execution:shadowJar FROM-CACHE
> Task :sdks:java:core:compileJava FROM-CACHE
> Task :sdks:java:core:classes
> Task :sdks:java:core:shadowJar FROM-CACHE
> Task :sdks:java:extensions:avro:compileJava FROM-CACHE
> Task :sdks:java:extensions:avro:classes UP-TO-DATE
> Task :sdks:java:extensions:avro:jar
> Task :runners:local-java:compileJava FROM-CACHE
> Task :runners:local-java:classes UP-TO-DATE
> Task :sdks:java:testing:test-utils:compileJava FROM-CACHE
> Task :sdks:java:testing:test-utils:classes UP-TO-DATE
> Task :runners:local-java:jar
> Task :sdks:java:extensions:arrow:compileJava FROM-CACHE
> Task :sdks:java:extensions:arrow:classes UP-TO-DATE
> Task :sdks:java:extensions:arrow:jar
> Task :sdks:java:testing:test-utils:compileTestJava FROM-CACHE
> Task :sdks:java:testing:test-utils:testClasses UP-TO-DATE
> Task :sdks:java:fn-execution:compileJava FROM-CACHE
> Task :sdks:java:fn-execution:classes UP-TO-DATE
> Task :sdks:java:fn-execution:jar
> Task :sdks:java:extensions:protobuf:extractIncludeProto
> Task :sdks:java:extensions:protobuf:generateProto NO-SOURCE
> Task :sdks:java:extensions:protobuf:compileJava FROM-CACHE
> Task :sdks:java:extensions:protobuf:classes UP-TO-DATE
> Task :sdks:java:extensions:protobuf:jar
> Task :runners:core-construction-java:compileJava FROM-CACHE
> Task :runners:core-construction-java:classes UP-TO-DATE
> Task :runners:core-construction-java:jar
> Task :runners:core-java:compileJava FROM-CACHE
> Task :runners:core-java:classes UP-TO-DATE
> Task :sdks:java:extensions:python:compileJava FROM-CACHE
> Task :sdks:java:extensions:python:classes
> Task :runners:core-java:jar
> Task :sdks:java:extensions:python:jar
> Task :sdks:java:extensions:google-cloud-platform-core:compileJava FROM-CACHE
> Task :sdks:java:extensions:google-cloud-platform-core:classes UP-TO-DATE
> Task :sdks:java:harness:compileJava FROM-CACHE
> Task :sdks:java:harness:classes UP-TO-DATE
> Task :sdks:java:extensions:google-cloud-platform-core:jar
> Task :sdks:java:core:compileTestJava FROM-CACHE
> Task :sdks:java:core:testClasses
> Task :sdks:java:harness:jar
> Task :runners:java-fn-execution:compileJava FROM-CACHE
> Task :runners:java-fn-execution:classes UP-TO-DATE
> Task :runners:java-fn-execution:jar
> Task :sdks:java:expansion-service:compileJava FROM-CACHE
> Task :sdks:java:expansion-service:classes UP-TO-DATE
> Task :sdks:java:expansion-service:jar
> Task :runners:direct-java:compileJava FROM-CACHE
> Task :runners:direct-java:classes UP-TO-DATE
> Task :sdks:java:core:shadowTestJar FROM-CACHE
> Task :sdks:java:extensions:ml:compileJava FROM-CACHE
> Task :sdks:java:extensions:ml:classes UP-TO-DATE
> Task :sdks:java:extensions:ml:jar
> Task :sdks:java:io:kafka:compileJava FROM-CACHE
> Task :sdks:java:io:kafka:classes UP-TO-DATE
> Task :sdks:java:io:kafka:jar
> Task :sdks:java:harness:shadowJar FROM-CACHE
> Task :runners:direct-java:shadowJar FROM-CACHE
> Task :sdks:java:io:google-cloud-platform:compileJava FROM-CACHE
> Task :sdks:java:io:google-cloud-platform:classes UP-TO-DATE
> Task :runners:core-java:compileTestJava FROM-CACHE
> Task :runners:core-java:testClasses UP-TO-DATE
> Task :runners:core-java:testJar
> Task :sdks:java:io:google-cloud-platform:jar
> Task :runners:direct-java:compileTestJava FROM-CACHE
> Task :runners:direct-java:testClasses UP-TO-DATE
> Task :runners:google-cloud-dataflow-java:compileJava FROM-CACHE
> Task :runners:google-cloud-dataflow-java:classes
> Task :examples:java:compileJava FROM-CACHE
> Task :examples:java:classes UP-TO-DATE
> Task :runners:google-cloud-dataflow-java:jar
> Task :examples:java:jar
> Task :runners:direct-java:shadowTestJar FROM-CACHE
> Task :sdks:java:testing:test-utils:verifyJavaVersion17 FROM-CACHE
> Task :examples:java:compileTestJava FROM-CACHE
> Task :examples:java:testClasses
> Task :examples:java:testJar
> Task :runners:google-cloud-dataflow-java:worker:compileJava FROM-CACHE
> Task :runners:google-cloud-dataflow-java:worker:classes
> Task :runners:google-cloud-dataflow-java:worker:shadowJar FROM-CACHE
> Task :runners:google-cloud-dataflow-java:examples-streaming:appliancePreCommit FROM-CACHE
> Task :runners:google-cloud-dataflow-java:examples:preCommitLegacyWorker FROM-CACHE
> Task :runners:google-cloud-dataflow-java:examples:preCommitLegacyWorkerImpersonate FROM-CACHE
> Task :runners:google-cloud-dataflow-java:examples:preCommit UP-TO-DATE
> Task :runners:google-cloud-dataflow-java:examples-streaming:windmillPreCommit
org.apache.beam.examples.WordCountIT > testE2EWordCount FAILED
java.lang.RuntimeException at WordCountIT.java:69
1 test completed, 1 failed
> Task :runners:google-cloud-dataflow-java:examples-streaming:windmillPreCommit FAILED
FAILURE: Build failed with an exception.
* What went wrong:
Execution failed for task ':runners:google-cloud-dataflow-java:examples-streaming:windmillPreCommit'.
> There were failing tests. See the report at: file://<https://ci-beam.apache.org/job/beam_PreCommit_Java_Examples_Dataflow_Java17_Cron/ws/src/runners/google-cloud-dataflow-java/examples-streaming/build/reports/tests/windmillPreCommit/index.html>
* Try:
> Run with --stacktrace option to get the stack trace.
> Run with --info or --debug option to get more log output.
* Get more help at https://help.gradle.org
Deprecated Gradle features were used in this build, making it incompatible with Gradle 8.0.
You can use '--warning-mode all' to show the individual deprecation warnings and determine if they come from your own scripts or plugins.
See https://docs.gradle.org/7.5.1/userguide/command_line_interface.html#sec:command_line_warnings
BUILD FAILED in 16m 17s
100 actionable tasks: 42 executed, 52 from cache, 6 up-to-date
Publishing build scan...
https://ge.apache.org/s/64ehobrxk3vx6
Build step 'Invoke Gradle script' changed build result to FAILURE
Build step 'Invoke Gradle script' marked build as failure
---------------------------------------------------------------------
To unsubscribe, e-mail: builds-unsubscribe@beam.apache.org
For additional commands, e-mail: builds-help@beam.apache.org