You are viewing a plain text version of this content. The canonical link for it is here.
Posted to dev@lucene.apache.org by Policeman Jenkins Server <je...@thetaphi.de> on 2014/11/11 10:17:42 UTC

[JENKINS] Lucene-Solr-4.10-Linux (64bit/ibm-j9-jdk7) - Build # 75 - Failure!

Build: http://jenkins.thetaphi.de/job/Lucene-Solr-4.10-Linux/75/
Java: 64bit/ibm-j9-jdk7 -Xjit:exclude={org/apache/lucene/util/fst/FST.pack(IIF)Lorg/apache/lucene/util/fst/FST;} (asserts: true)

1 tests failed.
REGRESSION:  org.apache.lucene.analysis.ja.TestJapaneseKatakanaStemFilter.testRandomData

Error Message:


Stack Trace:
java.lang.NullPointerException
	at __randomizedtesting.SeedInfo.seed([3B0DD47F52B9DBDC:469D039F8353E6FD]:0)
	at org.apache.lucene.codecs.lucene49.Lucene49NormsConsumer$NormMap.add(Lucene49NormsConsumer.java:226)
	at org.apache.lucene.codecs.lucene49.Lucene49NormsConsumer.addNumericField(Lucene49NormsConsumer.java:95)
	at org.apache.lucene.index.NumericDocValuesWriter.flush(NumericDocValuesWriter.java:92)
	at org.apache.lucene.index.DefaultIndexingChain.writeNorms(DefaultIndexingChain.java:207)
	at org.apache.lucene.index.DefaultIndexingChain.flush(DefaultIndexingChain.java:94)
	at org.apache.lucene.index.DocumentsWriterPerThread.flush(DocumentsWriterPerThread.java:439)
	at org.apache.lucene.index.DocumentsWriter.doFlush(DocumentsWriter.java:510)
	at org.apache.lucene.index.DocumentsWriter.flushAllThreads(DocumentsWriter.java:621)
	at org.apache.lucene.index.IndexWriter.doFlush(IndexWriter.java:3227)
	at org.apache.lucene.index.IndexWriter.flush(IndexWriter.java:3203)
	at org.apache.lucene.index.IndexWriter.shutdown(IndexWriter.java:907)
	at org.apache.lucene.index.IndexWriter.close(IndexWriter.java:984)
	at org.apache.lucene.index.IndexWriter.close(IndexWriter.java:954)
	at org.apache.lucene.index.RandomIndexWriter.close(RandomIndexWriter.java:373)
	at org.apache.lucene.util.IOUtils.close(IOUtils.java:77)
	at org.apache.lucene.analysis.BaseTokenStreamTestCase.checkRandomData(BaseTokenStreamTestCase.java:541)
	at org.apache.lucene.analysis.BaseTokenStreamTestCase.checkRandomData(BaseTokenStreamTestCase.java:432)
	at org.apache.lucene.analysis.ja.TestJapaneseKatakanaStemFilter.testRandomData(TestJapaneseKatakanaStemFilter.java:86)
	at sun.reflect.NativeMethodAccessorImpl.invoke0(Native Method)
	at sun.reflect.NativeMethodAccessorImpl.invoke(NativeMethodAccessorImpl.java:94)
	at sun.reflect.DelegatingMethodAccessorImpl.invoke(DelegatingMethodAccessorImpl.java:55)
	at java.lang.reflect.Method.invoke(Method.java:619)
	at com.carrotsearch.randomizedtesting.RandomizedRunner.invoke(RandomizedRunner.java:1618)
	at com.carrotsearch.randomizedtesting.RandomizedRunner$6.evaluate(RandomizedRunner.java:827)
	at com.carrotsearch.randomizedtesting.RandomizedRunner$7.evaluate(RandomizedRunner.java:863)
	at com.carrotsearch.randomizedtesting.RandomizedRunner$8.evaluate(RandomizedRunner.java:877)
	at org.apache.lucene.util.TestRuleSetupTeardownChained$1.evaluate(TestRuleSetupTeardownChained.java:50)
	at org.apache.lucene.util.TestRuleFieldCacheSanity$1.evaluate(TestRuleFieldCacheSanity.java:51)
	at org.apache.lucene.util.AbstractBeforeAfterRule$1.evaluate(AbstractBeforeAfterRule.java:46)
	at com.carrotsearch.randomizedtesting.rules.SystemPropertiesInvariantRule$1.evaluate(SystemPropertiesInvariantRule.java:55)
	at org.apache.lucene.util.TestRuleThreadAndTestName$1.evaluate(TestRuleThreadAndTestName.java:49)
	at org.apache.lucene.util.TestRuleIgnoreAfterMaxFailures$1.evaluate(TestRuleIgnoreAfterMaxFailures.java:65)
	at org.apache.lucene.util.TestRuleMarkFailure$1.evaluate(TestRuleMarkFailure.java:48)
	at com.carrotsearch.randomizedtesting.rules.StatementAdapter.evaluate(StatementAdapter.java:36)
	at com.carrotsearch.randomizedtesting.ThreadLeakControl$StatementRunner.run(ThreadLeakControl.java:365)
	at com.carrotsearch.randomizedtesting.ThreadLeakControl.forkTimeoutingTask(ThreadLeakControl.java:798)
	at com.carrotsearch.randomizedtesting.ThreadLeakControl$3.evaluate(ThreadLeakControl.java:458)
	at com.carrotsearch.randomizedtesting.RandomizedRunner.runSingleTest(RandomizedRunner.java:836)
	at com.carrotsearch.randomizedtesting.RandomizedRunner$3.evaluate(RandomizedRunner.java:738)
	at com.carrotsearch.randomizedtesting.RandomizedRunner$4.evaluate(RandomizedRunner.java:772)
	at com.carrotsearch.randomizedtesting.RandomizedRunner$5.evaluate(RandomizedRunner.java:783)
	at org.apache.lucene.util.AbstractBeforeAfterRule$1.evaluate(AbstractBeforeAfterRule.java:46)
	at org.apache.lucene.util.TestRuleStoreClassName$1.evaluate(TestRuleStoreClassName.java:42)
	at com.carrotsearch.randomizedtesting.rules.SystemPropertiesInvariantRule$1.evaluate(SystemPropertiesInvariantRule.java:55)
	at com.carrotsearch.randomizedtesting.rules.NoShadowingOrOverridesOnMethodsRule$1.evaluate(NoShadowingOrOverridesOnMethodsRule.java:39)
	at com.carrotsearch.randomizedtesting.rules.NoShadowingOrOverridesOnMethodsRule$1.evaluate(NoShadowingOrOverridesOnMethodsRule.java:39)
	at com.carrotsearch.randomizedtesting.rules.StatementAdapter.evaluate(StatementAdapter.java:36)
	at com.carrotsearch.randomizedtesting.rules.StatementAdapter.evaluate(StatementAdapter.java:36)
	at com.carrotsearch.randomizedtesting.rules.StatementAdapter.evaluate(StatementAdapter.java:36)
	at org.apache.lucene.util.TestRuleAssertionsRequired$1.evaluate(TestRuleAssertionsRequired.java:54)
	at org.apache.lucene.util.TestRuleMarkFailure$1.evaluate(TestRuleMarkFailure.java:48)
	at org.apache.lucene.util.TestRuleIgnoreAfterMaxFailures$1.evaluate(TestRuleIgnoreAfterMaxFailures.java:65)
	at org.apache.lucene.util.TestRuleIgnoreTestSuites$1.evaluate(TestRuleIgnoreTestSuites.java:55)
	at com.carrotsearch.randomizedtesting.rules.StatementAdapter.evaluate(StatementAdapter.java:36)
	at com.carrotsearch.randomizedtesting.ThreadLeakControl$StatementRunner.run(ThreadLeakControl.java:365)
	at java.lang.Thread.run(Thread.java:853)




Build Log:
[...truncated 6746 lines...]
   [junit4] Suite: org.apache.lucene.analysis.ja.TestJapaneseKatakanaStemFilter
   [junit4]   2> NOTE: reproduce with: ant test  -Dtestcase=TestJapaneseKatakanaStemFilter -Dtests.method=testRandomData -Dtests.seed=3B0DD47F52B9DBDC -Dtests.multiplier=3 -Dtests.slow=true -Dtests.locale=ru -Dtests.timezone=America/St_Thomas -Dtests.asserts=true -Dtests.file.encoding=ISO-8859-1
   [junit4] ERROR   2.50s J1 | TestJapaneseKatakanaStemFilter.testRandomData <<<
   [junit4]    > Throwable #1: java.lang.NullPointerException
   [junit4]    > 	at __randomizedtesting.SeedInfo.seed([3B0DD47F52B9DBDC:469D039F8353E6FD]:0)
   [junit4]    > 	at org.apache.lucene.codecs.lucene49.Lucene49NormsConsumer$NormMap.add(Lucene49NormsConsumer.java:226)
   [junit4]    > 	at org.apache.lucene.codecs.lucene49.Lucene49NormsConsumer.addNumericField(Lucene49NormsConsumer.java:95)
   [junit4]    > 	at org.apache.lucene.index.NumericDocValuesWriter.flush(NumericDocValuesWriter.java:92)
   [junit4]    > 	at org.apache.lucene.index.DefaultIndexingChain.writeNorms(DefaultIndexingChain.java:207)
   [junit4]    > 	at org.apache.lucene.index.DefaultIndexingChain.flush(DefaultIndexingChain.java:94)
   [junit4]    > 	at org.apache.lucene.index.DocumentsWriterPerThread.flush(DocumentsWriterPerThread.java:439)
   [junit4]    > 	at org.apache.lucene.index.DocumentsWriter.doFlush(DocumentsWriter.java:510)
   [junit4]    > 	at org.apache.lucene.index.DocumentsWriter.flushAllThreads(DocumentsWriter.java:621)
   [junit4]    > 	at org.apache.lucene.index.IndexWriter.doFlush(IndexWriter.java:3227)
   [junit4]    > 	at org.apache.lucene.index.IndexWriter.flush(IndexWriter.java:3203)
   [junit4]    > 	at org.apache.lucene.index.IndexWriter.shutdown(IndexWriter.java:907)
   [junit4]    > 	at org.apache.lucene.index.IndexWriter.close(IndexWriter.java:984)
   [junit4]    > 	at org.apache.lucene.index.IndexWriter.close(IndexWriter.java:954)
   [junit4]    > 	at org.apache.lucene.index.RandomIndexWriter.close(RandomIndexWriter.java:373)
   [junit4]    > 	at org.apache.lucene.util.IOUtils.close(IOUtils.java:77)
   [junit4]    > 	at org.apache.lucene.analysis.BaseTokenStreamTestCase.checkRandomData(BaseTokenStreamTestCase.java:541)
   [junit4]    > 	at org.apache.lucene.analysis.BaseTokenStreamTestCase.checkRandomData(BaseTokenStreamTestCase.java:432)
   [junit4]    > 	at org.apache.lucene.analysis.ja.TestJapaneseKatakanaStemFilter.testRandomData(TestJapaneseKatakanaStemFilter.java:86)
   [junit4]    > 	at java.lang.Thread.run(Thread.java:853)
   [junit4]   2> NOTE: leaving temporary files on disk at: /mnt/ssd/jenkins/workspace/Lucene-Solr-4.10-Linux/lucene/build/analysis/kuromoji/test/J1/./lucene.analysis.ja.TestJapaneseKatakanaStemFilter-3B0DD47F52B9DBDC-001
   [junit4]   2> NOTE: test params are: codec=Lucene410: {dummy=Lucene41(blocksize=128)}, docValues:{}, sim=RandomSimilarityProvider(queryNorm=true,coord=no): {dummy=DFR I(F)B2}, locale=ru, timezone=America/St_Thomas
   [junit4]   2> NOTE: Linux 3.13.0-39-generic amd64/IBM Corporation 1.7.0 (64-bit)/cpus=8,threads=1,free=5921424,total=30212096
   [junit4]   2> NOTE: All tests run in this JVM: [TestJapanesePartOfSpeechStopFilterFactory, TestJapaneseKatakanaStemFilter]
   [junit4] Completed on J1 in 2.66s, 5 tests, 1 error <<< FAILURES!

[...truncated 57 lines...]
BUILD FAILED
/mnt/ssd/jenkins/workspace/Lucene-Solr-4.10-Linux/build.xml:474: The following error occurred while executing this line:
/mnt/ssd/jenkins/workspace/Lucene-Solr-4.10-Linux/build.xml:467: The following error occurred while executing this line:
/mnt/ssd/jenkins/workspace/Lucene-Solr-4.10-Linux/build.xml:45: The following error occurred while executing this line:
/mnt/ssd/jenkins/workspace/Lucene-Solr-4.10-Linux/extra-targets.xml:37: The following error occurred while executing this line:
/mnt/ssd/jenkins/workspace/Lucene-Solr-4.10-Linux/lucene/build.xml:540: The following error occurred while executing this line:
/mnt/ssd/jenkins/workspace/Lucene-Solr-4.10-Linux/lucene/common-build.xml:2107: The following error occurred while executing this line:
/mnt/ssd/jenkins/workspace/Lucene-Solr-4.10-Linux/lucene/analysis/build.xml:106: The following error occurred while executing this line:
/mnt/ssd/jenkins/workspace/Lucene-Solr-4.10-Linux/lucene/analysis/build.xml:38: The following error occurred while executing this line:
/mnt/ssd/jenkins/workspace/Lucene-Solr-4.10-Linux/lucene/module-build.xml:60: The following error occurred while executing this line:
/mnt/ssd/jenkins/workspace/Lucene-Solr-4.10-Linux/lucene/common-build.xml:1350: The following error occurred while executing this line:
/mnt/ssd/jenkins/workspace/Lucene-Solr-4.10-Linux/lucene/common-build.xml:970: There were test failures: 17 suites, 108 tests, 1 error, 1 ignored (1 assumption)

Total time: 38 minutes 36 seconds
Build step 'Invoke Ant' marked build as failure
[description-setter] Description set: Java: 64bit/ibm-j9-jdk7 -Xjit:exclude={org/apache/lucene/util/fst/FST.pack(IIF)Lorg/apache/lucene/util/fst/FST;} (asserts: true)
Archiving artifacts
Recording test results
Email was triggered for: Failure - Any
Sending email for trigger: Failure - Any



Re: [JENKINS] Lucene-Solr-4.10-Linux (64bit/ibm-j9-jdk7) - Build # 76 - Still Failing!

Posted by Michael McCandless <lu...@mikemccandless.com>.
J9 bug.

Mike McCandless

http://blog.mikemccandless.com


On Tue, Nov 11, 2014 at 9:08 AM, Policeman Jenkins Server
<je...@thetaphi.de> wrote:
> Build: http://jenkins.thetaphi.de/job/Lucene-Solr-4.10-Linux/76/
> Java: 64bit/ibm-j9-jdk7 -Xjit:exclude={org/apache/lucene/util/fst/FST.pack(IIF)Lorg/apache/lucene/util/fst/FST;} (asserts: false)
>
> 3 tests failed.
> FAILED:  org.apache.lucene.codecs.compressing.TestCompressingTermVectorsFormat.testRamBytesUsed {#0 seed=[3C4832D329799907:CEEB2093E3068651]}
>
> Error Message:
>
>
> Stack Trace:
> java.lang.NullPointerException
>         at __randomizedtesting.SeedInfo.seed([3C4832D329799907:CEEB2093E3068651]:0)
>         at org.apache.lucene.codecs.lucene49.Lucene49NormsConsumer$NormMap.getOrd(Lucene49NormsConsumer.java:249)
>         at org.apache.lucene.codecs.lucene49.Lucene49NormsConsumer.addNumericField(Lucene49NormsConsumer.java:150)
>         at org.apache.lucene.codecs.DocValuesConsumer.mergeNumericField(DocValuesConsumer.java:129)
>         at org.apache.lucene.index.SegmentMerger.mergeNorms(SegmentMerger.java:255)
>         at org.apache.lucene.index.SegmentMerger.merge(SegmentMerger.java:133)
>         at org.apache.lucene.index.IndexWriter.mergeMiddle(IndexWriter.java:4173)
>         at org.apache.lucene.index.IndexWriter.merge(IndexWriter.java:3768)
>         at org.apache.lucene.index.SerialMergeScheduler.merge(SerialMergeScheduler.java:40)
>         at org.apache.lucene.index.IndexWriter.maybeMerge(IndexWriter.java:1970)
>         at org.apache.lucene.index.IndexWriter.forceMerge(IndexWriter.java:1797)
>         at org.apache.lucene.index.IndexWriter.forceMerge(IndexWriter.java:1754)
>         at org.apache.lucene.index.BaseIndexFileFormatTestCase.testRamBytesUsed(BaseIndexFileFormatTestCase.java:228)
>         at org.apache.lucene.index.BaseTermVectorsFormatTestCase.testRamBytesUsed(BaseTermVectorsFormatTestCase.java:61)
>         at sun.reflect.NativeMethodAccessorImpl.invoke0(Native Method)
>         at sun.reflect.NativeMethodAccessorImpl.invoke(NativeMethodAccessorImpl.java:94)
>         at sun.reflect.DelegatingMethodAccessorImpl.invoke(DelegatingMethodAccessorImpl.java:55)
>         at java.lang.reflect.Method.invoke(Method.java:619)
>         at com.carrotsearch.randomizedtesting.RandomizedRunner.invoke(RandomizedRunner.java:1618)
>         at com.carrotsearch.randomizedtesting.RandomizedRunner$6.evaluate(RandomizedRunner.java:827)
>         at com.carrotsearch.randomizedtesting.RandomizedRunner$7.evaluate(RandomizedRunner.java:863)
>         at com.carrotsearch.randomizedtesting.RandomizedRunner$8.evaluate(RandomizedRunner.java:877)
>         at org.apache.lucene.util.TestRuleSetupTeardownChained$1.evaluate(TestRuleSetupTeardownChained.java:50)
>         at org.apache.lucene.util.TestRuleFieldCacheSanity$1.evaluate(TestRuleFieldCacheSanity.java:51)
>         at org.apache.lucene.util.AbstractBeforeAfterRule$1.evaluate(AbstractBeforeAfterRule.java:46)
>         at com.carrotsearch.randomizedtesting.rules.SystemPropertiesInvariantRule$1.evaluate(SystemPropertiesInvariantRule.java:55)
>         at org.apache.lucene.util.TestRuleThreadAndTestName$1.evaluate(TestRuleThreadAndTestName.java:49)
>         at org.apache.lucene.util.TestRuleIgnoreAfterMaxFailures$1.evaluate(TestRuleIgnoreAfterMaxFailures.java:65)
>         at org.apache.lucene.util.TestRuleMarkFailure$1.evaluate(TestRuleMarkFailure.java:48)
>         at com.carrotsearch.randomizedtesting.rules.StatementAdapter.evaluate(StatementAdapter.java:36)
>         at com.carrotsearch.randomizedtesting.ThreadLeakControl$StatementRunner.run(ThreadLeakControl.java:365)
>         at com.carrotsearch.randomizedtesting.ThreadLeakControl.forkTimeoutingTask(ThreadLeakControl.java:798)
>         at com.carrotsearch.randomizedtesting.ThreadLeakControl$3.evaluate(ThreadLeakControl.java:458)
>         at com.carrotsearch.randomizedtesting.RandomizedRunner.runSingleTest(RandomizedRunner.java:836)
>         at com.carrotsearch.randomizedtesting.RandomizedRunner$3.evaluate(RandomizedRunner.java:738)
>         at com.carrotsearch.randomizedtesting.RandomizedRunner$4.evaluate(RandomizedRunner.java:772)
>         at com.carrotsearch.randomizedtesting.RandomizedRunner$5.evaluate(RandomizedRunner.java:783)
>         at org.apache.lucene.util.AbstractBeforeAfterRule$1.evaluate(AbstractBeforeAfterRule.java:46)
>         at org.apache.lucene.util.TestRuleStoreClassName$1.evaluate(TestRuleStoreClassName.java:42)
>         at com.carrotsearch.randomizedtesting.rules.SystemPropertiesInvariantRule$1.evaluate(SystemPropertiesInvariantRule.java:55)
>         at com.carrotsearch.randomizedtesting.rules.NoShadowingOrOverridesOnMethodsRule$1.evaluate(NoShadowingOrOverridesOnMethodsRule.java:39)
>         at com.carrotsearch.randomizedtesting.rules.NoShadowingOrOverridesOnMethodsRule$1.evaluate(NoShadowingOrOverridesOnMethodsRule.java:39)
>         at com.carrotsearch.randomizedtesting.rules.StatementAdapter.evaluate(StatementAdapter.java:36)
>         at com.carrotsearch.randomizedtesting.rules.StatementAdapter.evaluate(StatementAdapter.java:36)
>         at com.carrotsearch.randomizedtesting.rules.StatementAdapter.evaluate(StatementAdapter.java:36)
>         at org.apache.lucene.util.TestRuleAssertionsRequired$1.evaluate(TestRuleAssertionsRequired.java:54)
>         at org.apache.lucene.util.TestRuleMarkFailure$1.evaluate(TestRuleMarkFailure.java:48)
>         at org.apache.lucene.util.TestRuleIgnoreAfterMaxFailures$1.evaluate(TestRuleIgnoreAfterMaxFailures.java:65)
>         at org.apache.lucene.util.TestRuleIgnoreTestSuites$1.evaluate(TestRuleIgnoreTestSuites.java:55)
>         at com.carrotsearch.randomizedtesting.rules.StatementAdapter.evaluate(StatementAdapter.java:36)
>         at com.carrotsearch.randomizedtesting.ThreadLeakControl$StatementRunner.run(ThreadLeakControl.java:365)
>         at java.lang.Thread.run(Thread.java:853)
>
>
> FAILED:  org.apache.lucene.codecs.compressing.TestCompressingTermVectorsFormat.testRamBytesUsed {#1 seed=[3C4832D329799907:7ABD9C6FD7C44D7D]}
>
> Error Message:
> Captured an uncaught exception in thread: Thread[id=138, name=Lucene Merge Thread #0, state=RUNNABLE, group=TGRP-TestCompressingTermVectorsFormat]
>
> Stack Trace:
> com.carrotsearch.randomizedtesting.UncaughtExceptionError: Captured an uncaught exception in thread: Thread[id=138, name=Lucene Merge Thread #0, state=RUNNABLE, group=TGRP-TestCompressingTermVectorsFormat]
> Caused by: org.apache.lucene.index.MergePolicy$MergeException: java.lang.NullPointerException
>         at __randomizedtesting.SeedInfo.seed([3C4832D329799907]:0)
>         at org.apache.lucene.index.ConcurrentMergeScheduler.handleMergeException(ConcurrentMergeScheduler.java:545)
>         at org.apache.lucene.index.ConcurrentMergeScheduler$MergeThread.run(ConcurrentMergeScheduler.java:518)
> Caused by: java.lang.NullPointerException
>         at org.apache.lucene.codecs.lucene49.Lucene49NormsConsumer$NormMap.getOrd(Lucene49NormsConsumer.java:249)
>         at org.apache.lucene.codecs.lucene49.Lucene49NormsConsumer.addNumericField(Lucene49NormsConsumer.java:150)
>         at org.apache.lucene.codecs.DocValuesConsumer.mergeNumericField(DocValuesConsumer.java:129)
>         at org.apache.lucene.index.SegmentMerger.mergeNorms(SegmentMerger.java:255)
>         at org.apache.lucene.index.SegmentMerger.merge(SegmentMerger.java:133)
>         at org.apache.lucene.index.IndexWriter.mergeMiddle(IndexWriter.java:4173)
>         at org.apache.lucene.index.IndexWriter.merge(IndexWriter.java:3768)
>         at org.apache.lucene.index.ConcurrentMergeScheduler.doMerge(ConcurrentMergeScheduler.java:405)
>         at org.apache.lucene.index.ConcurrentMergeScheduler$MergeThread.run(ConcurrentMergeScheduler.java:482)
>
>
> REGRESSION:  org.apache.lucene.index.TestCompoundFile.testListAll
>
> Error Message:
>
>
> Stack Trace:
> java.lang.NullPointerException
>         at __randomizedtesting.SeedInfo.seed([3C4832D329799907:29ADD6530019DAFF]:0)
>         at org.apache.lucene.codecs.lucene49.Lucene49NormsConsumer$NormMap.add(Lucene49NormsConsumer.java:226)
>         at org.apache.lucene.codecs.lucene49.Lucene49NormsConsumer.addNumericField(Lucene49NormsConsumer.java:95)
>         at org.apache.lucene.index.NumericDocValuesWriter.flush(NumericDocValuesWriter.java:92)
>         at org.apache.lucene.index.DefaultIndexingChain.writeNorms(DefaultIndexingChain.java:207)
>         at org.apache.lucene.index.DefaultIndexingChain.flush(DefaultIndexingChain.java:94)
>         at org.apache.lucene.index.DocumentsWriterPerThread.flush(DocumentsWriterPerThread.java:439)
>         at org.apache.lucene.index.DocumentsWriter.doFlush(DocumentsWriter.java:510)
>         at org.apache.lucene.index.DocumentsWriter.flushAllThreads(DocumentsWriter.java:621)
>         at org.apache.lucene.index.IndexWriter.prepareCommitInternal(IndexWriter.java:2942)
>         at org.apache.lucene.index.IndexWriter.commitInternal(IndexWriter.java:3097)
>         at org.apache.lucene.index.IndexWriter.commit(IndexWriter.java:3064)
>         at org.apache.lucene.index.RandomIndexWriter.commit(RandomIndexWriter.java:260)
>         at org.apache.lucene.index.TestCompoundFile.testListAll(TestCompoundFile.java:825)
>         at sun.reflect.NativeMethodAccessorImpl.invoke0(Native Method)
>         at sun.reflect.NativeMethodAccessorImpl.invoke(NativeMethodAccessorImpl.java:94)
>         at sun.reflect.DelegatingMethodAccessorImpl.invoke(DelegatingMethodAccessorImpl.java:55)
>         at java.lang.reflect.Method.invoke(Method.java:619)
>         at com.carrotsearch.randomizedtesting.RandomizedRunner.invoke(RandomizedRunner.java:1618)
>         at com.carrotsearch.randomizedtesting.RandomizedRunner$6.evaluate(RandomizedRunner.java:827)
>         at com.carrotsearch.randomizedtesting.RandomizedRunner$7.evaluate(RandomizedRunner.java:863)
>         at com.carrotsearch.randomizedtesting.RandomizedRunner$8.evaluate(RandomizedRunner.java:877)
>         at org.apache.lucene.util.TestRuleSetupTeardownChained$1.evaluate(TestRuleSetupTeardownChained.java:50)
>         at org.apache.lucene.util.TestRuleFieldCacheSanity$1.evaluate(TestRuleFieldCacheSanity.java:51)
>         at org.apache.lucene.util.AbstractBeforeAfterRule$1.evaluate(AbstractBeforeAfterRule.java:46)
>         at com.carrotsearch.randomizedtesting.rules.SystemPropertiesInvariantRule$1.evaluate(SystemPropertiesInvariantRule.java:55)
>         at org.apache.lucene.util.TestRuleThreadAndTestName$1.evaluate(TestRuleThreadAndTestName.java:49)
>         at org.apache.lucene.util.TestRuleIgnoreAfterMaxFailures$1.evaluate(TestRuleIgnoreAfterMaxFailures.java:65)
>         at org.apache.lucene.util.TestRuleMarkFailure$1.evaluate(TestRuleMarkFailure.java:48)
>         at com.carrotsearch.randomizedtesting.rules.StatementAdapter.evaluate(StatementAdapter.java:36)
>         at com.carrotsearch.randomizedtesting.ThreadLeakControl$StatementRunner.run(ThreadLeakControl.java:365)
>         at com.carrotsearch.randomizedtesting.ThreadLeakControl.forkTimeoutingTask(ThreadLeakControl.java:798)
>         at com.carrotsearch.randomizedtesting.ThreadLeakControl$3.evaluate(ThreadLeakControl.java:458)
>         at com.carrotsearch.randomizedtesting.RandomizedRunner.runSingleTest(RandomizedRunner.java:836)
>         at com.carrotsearch.randomizedtesting.RandomizedRunner$3.evaluate(RandomizedRunner.java:738)
>         at com.carrotsearch.randomizedtesting.RandomizedRunner$4.evaluate(RandomizedRunner.java:772)
>         at com.carrotsearch.randomizedtesting.RandomizedRunner$5.evaluate(RandomizedRunner.java:783)
>         at org.apache.lucene.util.AbstractBeforeAfterRule$1.evaluate(AbstractBeforeAfterRule.java:46)
>         at org.apache.lucene.util.TestRuleStoreClassName$1.evaluate(TestRuleStoreClassName.java:42)
>         at com.carrotsearch.randomizedtesting.rules.SystemPropertiesInvariantRule$1.evaluate(SystemPropertiesInvariantRule.java:55)
>         at com.carrotsearch.randomizedtesting.rules.NoShadowingOrOverridesOnMethodsRule$1.evaluate(NoShadowingOrOverridesOnMethodsRule.java:39)
>         at com.carrotsearch.randomizedtesting.rules.NoShadowingOrOverridesOnMethodsRule$1.evaluate(NoShadowingOrOverridesOnMethodsRule.java:39)
>         at com.carrotsearch.randomizedtesting.rules.StatementAdapter.evaluate(StatementAdapter.java:36)
>         at com.carrotsearch.randomizedtesting.rules.StatementAdapter.evaluate(StatementAdapter.java:36)
>         at com.carrotsearch.randomizedtesting.rules.StatementAdapter.evaluate(StatementAdapter.java:36)
>         at org.apache.lucene.util.TestRuleAssertionsRequired$1.evaluate(TestRuleAssertionsRequired.java:54)
>         at org.apache.lucene.util.TestRuleMarkFailure$1.evaluate(TestRuleMarkFailure.java:48)
>         at org.apache.lucene.util.TestRuleIgnoreAfterMaxFailures$1.evaluate(TestRuleIgnoreAfterMaxFailures.java:65)
>         at org.apache.lucene.util.TestRuleIgnoreTestSuites$1.evaluate(TestRuleIgnoreTestSuites.java:55)
>         at com.carrotsearch.randomizedtesting.rules.StatementAdapter.evaluate(StatementAdapter.java:36)
>         at com.carrotsearch.randomizedtesting.ThreadLeakControl$StatementRunner.run(ThreadLeakControl.java:365)
>         at java.lang.Thread.run(Thread.java:853)
>
>
>
>
> Build Log:
> [...truncated 264 lines...]
>    [junit4] Suite: org.apache.lucene.index.TestCompoundFile
>    [junit4]   2> NOTE: reproduce with: ant test  -Dtestcase=TestCompoundFile -Dtests.method=testListAll -Dtests.seed=3C4832D329799907 -Dtests.multiplier=3 -Dtests.slow=true -Dtests.locale=it_IT_PREEURO -Dtests.timezone=Pacific/Easter -Dtests.asserts=false -Dtests.file.encoding=UTF-8
>    [junit4] ERROR   1.04s J0 | TestCompoundFile.testListAll <<<
>    [junit4]    > Throwable #1: java.lang.NullPointerException
>    [junit4]    >        at __randomizedtesting.SeedInfo.seed([3C4832D329799907:29ADD6530019DAFF]:0)
>    [junit4]    >        at org.apache.lucene.codecs.lucene49.Lucene49NormsConsumer$NormMap.add(Lucene49NormsConsumer.java:226)
>    [junit4]    >        at org.apache.lucene.codecs.lucene49.Lucene49NormsConsumer.addNumericField(Lucene49NormsConsumer.java:95)
>    [junit4]    >        at org.apache.lucene.index.NumericDocValuesWriter.flush(NumericDocValuesWriter.java:92)
>    [junit4]    >        at org.apache.lucene.index.DefaultIndexingChain.writeNorms(DefaultIndexingChain.java:207)
>    [junit4]    >        at org.apache.lucene.index.DefaultIndexingChain.flush(DefaultIndexingChain.java:94)
>    [junit4]    >        at org.apache.lucene.index.DocumentsWriterPerThread.flush(DocumentsWriterPerThread.java:439)
>    [junit4]    >        at org.apache.lucene.index.DocumentsWriter.doFlush(DocumentsWriter.java:510)
>    [junit4]    >        at org.apache.lucene.index.DocumentsWriter.flushAllThreads(DocumentsWriter.java:621)
>    [junit4]    >        at org.apache.lucene.index.IndexWriter.prepareCommitInternal(IndexWriter.java:2942)
>    [junit4]    >        at org.apache.lucene.index.IndexWriter.commitInternal(IndexWriter.java:3097)
>    [junit4]    >        at org.apache.lucene.index.IndexWriter.commit(IndexWriter.java:3064)
>    [junit4]    >        at org.apache.lucene.index.RandomIndexWriter.commit(RandomIndexWriter.java:260)
>    [junit4]    >        at org.apache.lucene.index.TestCompoundFile.testListAll(TestCompoundFile.java:825)
>    [junit4]    >        at java.lang.Thread.run(Thread.java:853)
>    [junit4]   2> NOTE: leaving temporary files on disk at: /mnt/ssd/jenkins/workspace/Lucene-Solr-4.10-Linux/lucene/build/core/test/J0/./lucene.index.TestCompoundFile-3C4832D329799907-001
>    [junit4]   2> NOTE: test params are: codec=Lucene410: {body=PostingsFormat(name=FSTPulsing41), id=FSTOrd41}, docValues:{}, sim=RandomSimilarityProvider(queryNorm=false,coord=yes): {body=DFR I(F)L3(800.0)}, locale=it_IT_PREEURO, timezone=Pacific/Easter
>    [junit4]   2> NOTE: Linux 3.13.0-39-generic amd64/IBM Corporation 1.7.0 (64-bit)/cpus=8,threads=1,free=80541352,total=242679808
>    [junit4]   2> NOTE: All tests run in this JVM: [TestPriorityQueue, TestCharTermAttributeImpl, TestSortRescorer, TestWorstCaseTestBehavior, TestFilterIterator, TestLucene40PostingsReader, TestPagedBytes, TestCompoundFile]
>    [junit4] Completed on J0 in 4.22s, 18 tests, 1 error <<< FAILURES!
>
> [...truncated 185 lines...]
>    [junit4] Suite: org.apache.lucene.codecs.compressing.TestCompressingTermVectorsFormat
>    [junit4]   2> NOTE: reproduce with: ant test  -Dtestcase=TestCompressingTermVectorsFormat -Dtests.method=testRamBytesUsed -Dtests.seed=3C4832D329799907 -Dtests.multiplier=3 -Dtests.slow=true -Dtests.locale=nl_NL_PREEURO -Dtests.timezone=Antarctica/DumontDUrville -Dtests.asserts=false -Dtests.file.encoding=UTF-8
>    [junit4] ERROR   0.12s J0 | TestCompressingTermVectorsFormat.testRamBytesUsed {#0 seed=[3C4832D329799907:CEEB2093E3068651]} <<<
>    [junit4]    > Throwable #1: java.lang.NullPointerException
>    [junit4]    >        at __randomizedtesting.SeedInfo.seed([3C4832D329799907:CEEB2093E3068651]:0)
>    [junit4]    >        at org.apache.lucene.codecs.lucene49.Lucene49NormsConsumer$NormMap.getOrd(Lucene49NormsConsumer.java:249)
>    [junit4]    >        at org.apache.lucene.codecs.lucene49.Lucene49NormsConsumer.addNumericField(Lucene49NormsConsumer.java:150)
>    [junit4]    >        at org.apache.lucene.codecs.DocValuesConsumer.mergeNumericField(DocValuesConsumer.java:129)
>    [junit4]    >        at org.apache.lucene.index.SegmentMerger.mergeNorms(SegmentMerger.java:255)
>    [junit4]    >        at org.apache.lucene.index.SegmentMerger.merge(SegmentMerger.java:133)
>    [junit4]    >        at org.apache.lucene.index.IndexWriter.mergeMiddle(IndexWriter.java:4173)
>    [junit4]    >        at org.apache.lucene.index.IndexWriter.merge(IndexWriter.java:3768)
>    [junit4]    >        at org.apache.lucene.index.SerialMergeScheduler.merge(SerialMergeScheduler.java:40)
>    [junit4]    >        at org.apache.lucene.index.IndexWriter.maybeMerge(IndexWriter.java:1970)
>    [junit4]    >        at org.apache.lucene.index.IndexWriter.forceMerge(IndexWriter.java:1797)
>    [junit4]    >        at org.apache.lucene.index.IndexWriter.forceMerge(IndexWriter.java:1754)
>    [junit4]    >        at org.apache.lucene.index.BaseIndexFileFormatTestCase.testRamBytesUsed(BaseIndexFileFormatTestCase.java:228)
>    [junit4]    >        at org.apache.lucene.index.BaseTermVectorsFormatTestCase.testRamBytesUsed(BaseTermVectorsFormatTestCase.java:61)
>    [junit4]    >        at java.lang.Thread.run(Thread.java:853)
>    [junit4]   2> nov 11, 2014 11:41:13 PM com.carrotsearch.randomizedtesting.RandomizedRunner$QueueUncaughtExceptionsHandler uncaughtException
>    [junit4]   2> WARNING: Uncaught exception in thread: Thread[Lucene Merge Thread #0,6,TGRP-TestCompressingTermVectorsFormat]
>    [junit4]   2> org.apache.lucene.index.MergePolicy$MergeException: java.lang.NullPointerException
>    [junit4]   2>        at __randomizedtesting.SeedInfo.seed([3C4832D329799907]:0)
>    [junit4]   2>        at org.apache.lucene.index.ConcurrentMergeScheduler.handleMergeException(ConcurrentMergeScheduler.java:545)
>    [junit4]   2>        at org.apache.lucene.index.ConcurrentMergeScheduler$MergeThread.run(ConcurrentMergeScheduler.java:518)
>    [junit4]   2> Caused by: java.lang.NullPointerException
>    [junit4]   2>        at org.apache.lucene.codecs.lucene49.Lucene49NormsConsumer$NormMap.getOrd(Lucene49NormsConsumer.java:249)
>    [junit4]   2>        at org.apache.lucene.codecs.lucene49.Lucene49NormsConsumer.addNumericField(Lucene49NormsConsumer.java:150)
>    [junit4]   2>        at org.apache.lucene.codecs.DocValuesConsumer.mergeNumericField(DocValuesConsumer.java:129)
>    [junit4]   2>        at org.apache.lucene.index.SegmentMerger.mergeNorms(SegmentMerger.java:255)
>    [junit4]   2>        at org.apache.lucene.index.SegmentMerger.merge(SegmentMerger.java:133)
>    [junit4]   2>        at org.apache.lucene.index.IndexWriter.mergeMiddle(IndexWriter.java:4173)
>    [junit4]   2>        at org.apache.lucene.index.IndexWriter.merge(IndexWriter.java:3768)
>    [junit4]   2>        at org.apache.lucene.index.ConcurrentMergeScheduler.doMerge(ConcurrentMergeScheduler.java:405)
>    [junit4]   2>        at org.apache.lucene.index.ConcurrentMergeScheduler$MergeThread.run(ConcurrentMergeScheduler.java:482)
>    [junit4]   2>
>    [junit4]   2> nov 11, 2014 11:41:13 PM com.carrotsearch.randomizedtesting.RandomizedRunner$QueueUncaughtExceptionsHandler uncaughtException
>    [junit4]   2> WARNING: Uncaught exception in thread: Thread[Lucene Merge Thread #1,6,TGRP-TestCompressingTermVectorsFormat]
>    [junit4]   2> org.apache.lucene.index.MergePolicy$MergeException: java.lang.NullPointerException
>    [junit4]   2>        at __randomizedtesting.SeedInfo.seed([3C4832D329799907]:0)
>    [junit4]   2>        at org.apache.lucene.index.ConcurrentMergeScheduler.handleMergeException(ConcurrentMergeScheduler.java:545)
>    [junit4]   2>        at org.apache.lucene.index.ConcurrentMergeScheduler$MergeThread.run(ConcurrentMergeScheduler.java:518)
>    [junit4]   2> Caused by: java.lang.NullPointerException
>    [junit4]   2>        at org.apache.lucene.codecs.lucene49.Lucene49NormsConsumer$NormMap.getOrd(Lucene49NormsConsumer.java:249)
>    [junit4]   2>        at org.apache.lucene.codecs.lucene49.Lucene49NormsConsumer.addNumericField(Lucene49NormsConsumer.java:150)
>    [junit4]   2>        at org.apache.lucene.codecs.DocValuesConsumer.mergeNumericField(DocValuesConsumer.java:129)
>    [junit4]   2>        at org.apache.lucene.index.SegmentMerger.mergeNorms(SegmentMerger.java:255)
>    [junit4]   2>        at org.apache.lucene.index.SegmentMerger.merge(SegmentMerger.java:133)
>    [junit4]   2>        at org.apache.lucene.index.IndexWriter.mergeMiddle(IndexWriter.java:4173)
>    [junit4]   2>        at org.apache.lucene.index.IndexWriter.merge(IndexWriter.java:3768)
>    [junit4]   2>        at org.apache.lucene.index.ConcurrentMergeScheduler.doMerge(ConcurrentMergeScheduler.java:405)
>    [junit4]   2>        at org.apache.lucene.index.ConcurrentMergeScheduler$MergeThread.run(ConcurrentMergeScheduler.java:482)
>    [junit4]   2>
>    [junit4]   2> nov 11, 2014 11:41:13 PM com.carrotsearch.randomizedtesting.RandomizedRunner$QueueUncaughtExceptionsHandler uncaughtException
>    [junit4]   2> WARNING: Uncaught exception in thread: Thread[Lucene Merge Thread #2,6,TGRP-TestCompressingTermVectorsFormat]
>    [junit4]   2> org.apache.lucene.index.MergePolicy$MergeException: java.lang.NullPointerException
>    [junit4]   2>        at __randomizedtesting.SeedInfo.seed([3C4832D329799907]:0)
>    [junit4]   2>        at org.apache.lucene.index.ConcurrentMergeScheduler.handleMergeException(ConcurrentMergeScheduler.java:545)
>    [junit4]   2>        at org.apache.lucene.index.ConcurrentMergeScheduler$MergeThread.run(ConcurrentMergeScheduler.java:518)
>    [junit4]   2> Caused by: java.lang.NullPointerException
>    [junit4]   2>        at org.apache.lucene.codecs.lucene49.Lucene49NormsConsumer$NormMap.getOrd(Lucene49NormsConsumer.java:249)
>    [junit4]   2>        at org.apache.lucene.codecs.lucene49.Lucene49NormsConsumer.addNumericField(Lucene49NormsConsumer.java:150)
>    [junit4]   2>        at org.apache.lucene.codecs.DocValuesConsumer.mergeNumericField(DocValuesConsumer.java:129)
>    [junit4]   2>        at org.apache.lucene.index.SegmentMerger.mergeNorms(SegmentMerger.java:255)
>    [junit4]   2>        at org.apache.lucene.index.SegmentMerger.merge(SegmentMerger.java:133)
>    [junit4]   2>        at org.apache.lucene.index.IndexWriter.mergeMiddle(IndexWriter.java:4173)
>    [junit4]   2>        at org.apache.lucene.index.IndexWriter.merge(IndexWriter.java:3768)
>    [junit4]   2>        at org.apache.lucene.index.ConcurrentMergeScheduler.doMerge(ConcurrentMergeScheduler.java:405)
>    [junit4]   2>        at org.apache.lucene.index.ConcurrentMergeScheduler$MergeThread.run(ConcurrentMergeScheduler.java:482)
>    [junit4]   2>
>    [junit4]   2> nov 11, 2014 11:41:13 PM com.carrotsearch.randomizedtesting.RandomizedRunner$QueueUncaughtExceptionsHandler uncaughtException
>    [junit4]   2> WARNING: Uncaught exception in thread: Thread[Lucene Merge Thread #3,6,TGRP-TestCompressingTermVectorsFormat]
>    [junit4]   2> org.apache.lucene.index.MergePolicy$MergeException: java.lang.NullPointerException
>    [junit4]   2>        at __randomizedtesting.SeedInfo.seed([3C4832D329799907]:0)
>    [junit4]   2>        at org.apache.lucene.index.ConcurrentMergeScheduler.handleMergeException(ConcurrentMergeScheduler.java:545)
>    [junit4]   2>        at org.apache.lucene.index.ConcurrentMergeScheduler$MergeThread.run(ConcurrentMergeScheduler.java:518)
>    [junit4]   2> Caused by: java.lang.NullPointerException
>    [junit4]   2>        at org.apache.lucene.codecs.lucene49.Lucene49NormsConsumer$NormMap.getOrd(Lucene49NormsConsumer.java:249)
>    [junit4]   2>        at org.apache.lucene.codecs.lucene49.Lucene49NormsConsumer.addNumericField(Lucene49NormsConsumer.java:150)
>    [junit4]   2>        at org.apache.lucene.codecs.DocValuesConsumer.mergeNumericField(DocValuesConsumer.java:129)
>    [junit4]   2>        at org.apache.lucene.index.SegmentMerger.mergeNorms(SegmentMerger.java:255)
>    [junit4]   2>        at org.apache.lucene.index.SegmentMerger.merge(SegmentMerger.java:133)
>    [junit4]   2>        at org.apache.lucene.index.IndexWriter.mergeMiddle(IndexWriter.java:4173)
>    [junit4]   2>        at org.apache.lucene.index.IndexWriter.merge(IndexWriter.java:3768)
>    [junit4]   2>        at org.apache.lucene.index.ConcurrentMergeScheduler.doMerge(ConcurrentMergeScheduler.java:405)
>    [junit4]   2>        at org.apache.lucene.index.ConcurrentMergeScheduler$MergeThread.run(ConcurrentMergeScheduler.java:482)
>    [junit4]   2>
>    [junit4]   2> nov 11, 2014 11:41:13 PM com.carrotsearch.randomizedtesting.RandomizedRunner$QueueUncaughtExceptionsHandler uncaughtException
>    [junit4]   2> WARNING: Uncaught exception in thread: Thread[Lucene Merge Thread #4,6,TGRP-TestCompressingTermVectorsFormat]
>    [junit4]   2> org.apache.lucene.index.MergePolicy$MergeException: java.lang.NullPointerException
>    [junit4]   2>        at __randomizedtesting.SeedInfo.seed([3C4832D329799907]:0)
>    [junit4]   2>        at org.apache.lucene.index.ConcurrentMergeScheduler.handleMergeException(ConcurrentMergeScheduler.java:545)
>    [junit4]   2>        at org.apache.lucene.index.ConcurrentMergeScheduler$MergeThread.run(ConcurrentMergeScheduler.java:518)
>    [junit4]   2> Caused by: java.lang.NullPointerException
>    [junit4]   2>        at org.apache.lucene.codecs.lucene49.Lucene49NormsConsumer$NormMap.getOrd(Lucene49NormsConsumer.java:249)
>    [junit4]   2>        at org.apache.lucene.codecs.lucene49.Lucene49NormsConsumer.addNumericField(Lucene49NormsConsumer.java:150)
>    [junit4]   2>        at org.apache.lucene.codecs.DocValuesConsumer.mergeNumericField(DocValuesConsumer.java:129)
>    [junit4]   2>        at org.apache.lucene.index.SegmentMerger.mergeNorms(SegmentMerger.java:255)
>    [junit4]   2>        at org.apache.lucene.index.SegmentMerger.merge(SegmentMerger.java:133)
>    [junit4]   2>        at org.apache.lucene.index.IndexWriter.mergeMiddle(IndexWriter.java:4173)
>    [junit4]   2>        at org.apache.lucene.index.IndexWriter.merge(IndexWriter.java:3768)
>    [junit4]   2>        at org.apache.lucene.index.ConcurrentMergeScheduler.doMerge(ConcurrentMergeScheduler.java:405)
>    [junit4]   2>        at org.apache.lucene.index.ConcurrentMergeScheduler$MergeThread.run(ConcurrentMergeScheduler.java:482)
>    [junit4]   2>
>    [junit4]   2> nov 11, 2014 11:41:14 PM com.carrotsearch.randomizedtesting.RandomizedRunner$QueueUncaughtExceptionsHandler uncaughtException
>    [junit4]   2> WARNING: Uncaught exception in thread: Thread[Lucene Merge Thread #6,6,TGRP-TestCompressingTermVectorsFormat]
>    [junit4]   2> org.apache.lucene.index.MergePolicy$MergeException: java.lang.NullPointerException
>    [junit4]   2>        at __randomizedtesting.SeedInfo.seed([3C4832D329799907]:0)
>    [junit4]   2>        at org.apache.lucene.index.ConcurrentMergeScheduler.handleMergeException(ConcurrentMergeScheduler.java:545)
>    [junit4]   2>        at org.apache.lucene.index.ConcurrentMergeScheduler$MergeThread.run(ConcurrentMergeScheduler.java:518)
>    [junit4]   2> Caused by: java.lang.NullPointerException
>    [junit4]   2>        at org.apache.lucene.codecs.lucene49.Lucene49NormsConsumer$NormMap.getOrd(Lucene49NormsConsumer.java:249)
>    [junit4]   2>        at org.apache.lucene.codecs.lucene49.Lucene49NormsConsumer.addNumericField(Lucene49NormsConsumer.java:150)
>    [junit4]   2>        at org.apache.lucene.codecs.DocValuesConsumer.mergeNumericField(DocValuesConsumer.java:129)
>    [junit4]   2>        at org.apache.lucene.index.SegmentMerger.mergeNorms(SegmentMerger.java:255)
>    [junit4]   2>        at org.apache.lucene.index.SegmentMerger.merge(SegmentMerger.java:133)
>    [junit4]   2>        at org.apache.lucene.index.IndexWriter.mergeMiddle(IndexWriter.java:4173)
>    [junit4]   2>        at org.apache.lucene.index.IndexWriter.merge(IndexWriter.java:3768)
>    [junit4]   2>        at org.apache.lucene.index.ConcurrentMergeScheduler.doMerge(ConcurrentMergeScheduler.java:405)
>    [junit4]   2>        at org.apache.lucene.index.ConcurrentMergeScheduler$MergeThread.run(ConcurrentMergeScheduler.java:482)
>    [junit4]   2>
>    [junit4]   2> nov 11, 2014 11:41:14 PM com.carrotsearch.randomizedtesting.RandomizedRunner$QueueUncaughtExceptionsHandler uncaughtException
>    [junit4]   2> WARNING: Uncaught exception in thread: Thread[Lucene Merge Thread #7,6,TGRP-TestCompressingTermVectorsFormat]
>    [junit4]   2> org.apache.lucene.index.MergePolicy$MergeException: java.lang.NullPointerException
>    [junit4]   2>        at __randomizedtesting.SeedInfo.seed([3C4832D329799907]:0)
>    [junit4]   2>        at org.apache.lucene.index.ConcurrentMergeScheduler.handleMergeException(ConcurrentMergeScheduler.java:545)
>    [junit4]   2>        at org.apache.lucene.index.ConcurrentMergeScheduler$MergeThread.run(ConcurrentMergeScheduler.java:518)
>    [junit4]   2> Caused by: java.lang.NullPointerException
>    [junit4]   2>        at org.apache.lucene.codecs.lucene49.Lucene49NormsConsumer$NormMap.getOrd(Lucene49NormsConsumer.java:249)
>    [junit4]   2>        at org.apache.lucene.codecs.lucene49.Lucene49NormsConsumer.addNumericField(Lucene49NormsConsumer.java:150)
>    [junit4]   2>        at org.apache.lucene.codecs.DocValuesConsumer.mergeNumericField(DocValuesConsumer.java:129)
>    [junit4]   2>        at org.apache.lucene.index.SegmentMerger.mergeNorms(SegmentMerger.java:255)
>    [junit4]   2>        at org.apache.lucene.index.SegmentMerger.merge(SegmentMerger.java:133)
>    [junit4]   2>        at org.apache.lucene.index.IndexWriter.mergeMiddle(IndexWriter.java:4173)
>    [junit4]   2>        at org.apache.lucene.index.IndexWriter.merge(IndexWriter.java:3768)
>    [junit4]   2>        at org.apache.lucene.index.ConcurrentMergeScheduler.doMerge(ConcurrentMergeScheduler.java:405)
>    [junit4]   2>        at org.apache.lucene.index.ConcurrentMergeScheduler$MergeThread.run(ConcurrentMergeScheduler.java:482)
>    [junit4]   2>
>    [junit4]   2> nov 11, 2014 11:41:15 PM com.carrotsearch.randomizedtesting.RandomizedRunner$QueueUncaughtExceptionsHandler uncaughtException
>    [junit4]   2> WARNING: Uncaught exception in thread: Thread[Lucene Merge Thread #8,6,TGRP-TestCompressingTermVectorsFormat]
>    [junit4]   2> org.apache.lucene.index.MergePolicy$MergeException: java.lang.NullPointerException
>    [junit4]   2>        at __randomizedtesting.SeedInfo.seed([3C4832D329799907]:0)
>    [junit4]   2>        at org.apache.lucene.index.ConcurrentMergeScheduler.handleMergeException(ConcurrentMergeScheduler.java:545)
>    [junit4]   2>        at org.apache.lucene.index.ConcurrentMergeScheduler$MergeThread.run(ConcurrentMergeScheduler.java:518)
>    [junit4]   2> Caused by: java.lang.NullPointerException
>    [junit4]   2>        at org.apache.lucene.codecs.lucene49.Lucene49NormsConsumer$NormMap.getOrd(Lucene49NormsConsumer.java:249)
>    [junit4]   2>        at org.apache.lucene.codecs.lucene49.Lucene49NormsConsumer.addNumericField(Lucene49NormsConsumer.java:150)
>    [junit4]   2>        at org.apache.lucene.codecs.DocValuesConsumer.mergeNumericField(DocValuesConsumer.java:129)
>    [junit4]   2>        at org.apache.lucene.index.SegmentMerger.mergeNorms(SegmentMerger.java:255)
>    [junit4]   2>        at org.apache.lucene.index.SegmentMerger.merge(SegmentMerger.java:133)
>    [junit4]   2>        at org.apache.lucene.index.IndexWriter.mergeMiddle(IndexWriter.java:4173)
>    [junit4]   2>        at org.apache.lucene.index.IndexWriter.merge(IndexWriter.java:3768)
>    [junit4]   2>        at org.apache.lucene.index.ConcurrentMergeScheduler.doMerge(ConcurrentMergeScheduler.java:405)
>    [junit4]   2>        at org.apache.lucene.index.ConcurrentMergeScheduler$MergeThread.run(ConcurrentMergeScheduler.java:482)
>    [junit4]   2>
>    [junit4]   2> nov 11, 2014 11:41:15 PM com.carrotsearch.randomizedtesting.RandomizedRunner$QueueUncaughtExceptionsHandler uncaughtException
>    [junit4]   2> WARNING: Uncaught exception in thread: Thread[Lucene Merge Thread #9,6,TGRP-TestCompressingTermVectorsFormat]
>    [junit4]   2> org.apache.lucene.index.MergePolicy$MergeException: java.lang.NullPointerException
>    [junit4]   2>        at __randomizedtesting.SeedInfo.seed([3C4832D329799907]:0)
>    [junit4]   2>        at org.apache.lucene.index.ConcurrentMergeScheduler.handleMergeException(ConcurrentMergeScheduler.java:545)
>    [junit4]   2>        at org.apache.lucene.index.ConcurrentMergeScheduler$MergeThread.run(ConcurrentMergeScheduler.java:518)
>    [junit4]   2> Caused by: java.lang.NullPointerException
>    [junit4]   2>        at org.apache.lucene.codecs.lucene49.Lucene49NormsConsumer$NormMap.getOrd(Lucene49NormsConsumer.java:249)
>    [junit4]   2>        at org.apache.lucene.codecs.lucene49.Lucene49NormsConsumer.addNumericField(Lucene49NormsConsumer.java:150)
>    [junit4]   2>        at org.apache.lucene.codecs.DocValuesConsumer.mergeNumericField(DocValuesConsumer.java:129)
>    [junit4]   2>        at org.apache.lucene.index.SegmentMerger.mergeNorms(SegmentMerger.java:255)
>    [junit4]   2>        at org.apache.lucene.index.SegmentMerger.merge(SegmentMerger.java:133)
>    [junit4]   2>        at org.apache.lucene.index.IndexWriter.mergeMiddle(IndexWriter.java:4173)
>    [junit4]   2>        at org.apache.lucene.index.IndexWriter.merge(IndexWriter.java:3768)
>    [junit4]   2>        at org.apache.lucene.index.ConcurrentMergeScheduler.doMerge(ConcurrentMergeScheduler.java:405)
>    [junit4]   2>        at org.apache.lucene.index.ConcurrentMergeScheduler$MergeThread.run(ConcurrentMergeScheduler.java:482)
>    [junit4]   2>
>    [junit4]   2> nov 11, 2014 11:41:15 PM com.carrotsearch.randomizedtesting.RandomizedRunner$QueueUncaughtExceptionsHandler uncaughtException
>    [junit4]   2> WARNING: Uncaught exception in thread: Thread[Lucene Merge Thread #10,6,TGRP-TestCompressingTermVectorsFormat]
>    [junit4]   2> org.apache.lucene.index.MergePolicy$MergeException: java.lang.NullPointerException
>    [junit4]   2>        at __randomizedtesting.SeedInfo.seed([3C4832D329799907]:0)
>    [junit4]   2>        at org.apache.lucene.index.ConcurrentMergeScheduler.handleMergeException(ConcurrentMergeScheduler.java:545)
>    [junit4]   2>        at org.apache.lucene.index.ConcurrentMergeScheduler$MergeThread.run(ConcurrentMergeScheduler.java:518)
>    [junit4]   2> Caused by: java.lang.NullPointerException
>    [junit4]   2>        at org.apache.lucene.codecs.lucene49.Lucene49NormsConsumer$NormMap.getOrd(Lucene49NormsConsumer.java:249)
>    [junit4]   2>        at org.apache.lucene.codecs.lucene49.Lucene49NormsConsumer.addNumericField(Lucene49NormsConsumer.java:150)
>    [junit4]   2>        at org.apache.lucene.codecs.DocValuesConsumer.mergeNumericField(DocValuesConsumer.java:129)
>    [junit4]   2>        at org.apache.lucene.index.SegmentMerger.mergeNorms(SegmentMerger.java:255)
>    [junit4]   2>        at org.apache.lucene.index.SegmentMerger.merge(SegmentMerger.java:133)
>    [junit4]   2>        at org.apache.lucene.index.IndexWriter.mergeMiddle(IndexWriter.java:4173)
>    [junit4]   2>        at org.apache.lucene.index.IndexWriter.merge(IndexWriter.java:3768)
>    [junit4]   2>        at org.apache.lucene.index.ConcurrentMergeScheduler.doMerge(ConcurrentMergeScheduler.java:405)
>    [junit4]   2>        at org.apache.lucene.index.ConcurrentMergeScheduler$MergeThread.run(ConcurrentMergeScheduler.java:482)
>    [junit4]   2>
>    [junit4]   2> nov 11, 2014 11:41:16 PM com.carrotsearch.randomizedtesting.RandomizedRunner$QueueUncaughtExceptionsHandler uncaughtException
>    [junit4]   2> WARNING: Uncaught exception in thread: Thread[Lucene Merge Thread #11,6,TGRP-TestCompressingTermVectorsFormat]
>    [junit4]   2> org.apache.lucene.index.MergePolicy$MergeException: java.lang.NullPointerException
>    [junit4]   2>        at __randomizedtesting.SeedInfo.seed([3C4832D329799907]:0)
>    [junit4]   2>        at org.apache.lucene.index.ConcurrentMergeScheduler.handleMergeException(ConcurrentMergeScheduler.java:545)
>    [junit4]   2>        at org.apache.lucene.index.ConcurrentMergeScheduler$MergeThread.run(ConcurrentMergeScheduler.java:518)
>    [junit4]   2> Caused by: java.lang.NullPointerException
>    [junit4]   2>        at org.apache.lucene.codecs.lucene49.Lucene49NormsConsumer$NormMap.getOrd(Lucene49NormsConsumer.java:249)
>    [junit4]   2>        at org.apache.lucene.codecs.lucene49.Lucene49NormsConsumer.addNumericField(Lucene49NormsConsumer.java:150)
>    [junit4]   2>        at org.apache.lucene.codecs.DocValuesConsumer.mergeNumericField(DocValuesConsumer.java:129)
>    [junit4]   2>        at org.apache.lucene.index.SegmentMerger.mergeNorms(SegmentMerger.java:255)
>    [junit4]   2>        at org.apache.lucene.index.SegmentMerger.merge(SegmentMerger.java:133)
>    [junit4]   2>        at org.apache.lucene.index.IndexWriter.mergeMiddle(IndexWriter.java:4173)
>    [junit4]   2>        at org.apache.lucene.index.IndexWriter.merge(IndexWriter.java:3768)
>    [junit4]   2>        at org.apache.lucene.index.ConcurrentMergeScheduler.doMerge(ConcurrentMergeScheduler.java:405)
>    [junit4]   2>        at org.apache.lucene.index.ConcurrentMergeScheduler$MergeThread.run(ConcurrentMergeScheduler.java:482)
>    [junit4]   2>
>    [junit4]   2> nov 11, 2014 11:41:16 PM com.carrotsearch.randomizedtesting.RandomizedRunner$QueueUncaughtExceptionsHandler uncaughtException
>    [junit4]   2> WARNING: Uncaught exception in thread: Thread[Lucene Merge Thread #12,6,TGRP-TestCompressingTermVectorsFormat]
>    [junit4]   2> org.apache.lucene.index.MergePolicy$MergeException: java.lang.NullPointerException
>    [junit4]   2>        at __randomizedtesting.SeedInfo.seed([3C4832D329799907]:0)
>    [junit4]   2>        at org.apache.lucene.index.ConcurrentMergeScheduler.handleMergeException(ConcurrentMergeScheduler.java:545)
>    [junit4]   2>        at org.apache.lucene.index.ConcurrentMergeScheduler$MergeThread.run(ConcurrentMergeScheduler.java:518)
>    [junit4]   2> Caused by: java.lang.NullPointerException
>    [junit4]   2>        at org.apache.lucene.codecs.lucene49.Lucene49NormsConsumer$NormMap.getOrd(Lucene49NormsConsumer.java:249)
>    [junit4]   2>        at org.apache.lucene.codecs.lucene49.Lucene49NormsConsumer.addNumericField(Lucene49NormsConsumer.java:150)
>    [junit4]   2>        at org.apache.lucene.codecs.DocValuesConsumer.mergeNumericField(DocValuesConsumer.java:129)
>    [junit4]   2>        at org.apache.lucene.index.SegmentMerger.mergeNorms(SegmentMerger.java:255)
>    [junit4]   2>        at org.apache.lucene.index.SegmentMerger.merge(SegmentMerger.java:133)
>    [junit4]   2>        at org.apache.lucene.index.IndexWriter.mergeMiddle(IndexWriter.java:4173)
>    [junit4]   2>        at org.apache.lucene.index.IndexWriter.merge(IndexWriter.java:3768)
>    [junit4]   2>        at org.apache.lucene.index.ConcurrentMergeScheduler.doMerge(ConcurrentMergeScheduler.java:405)
>    [junit4]   2>        at org.apache.lucene.index.ConcurrentMergeScheduler$MergeThread.run(ConcurrentMergeScheduler.java:482)
>    [junit4]   2>
>    [junit4]   2> nov 11, 2014 11:41:16 PM com.carrotsearch.randomizedtesting.RandomizedRunner$QueueUncaughtExceptionsHandler uncaughtException
>    [junit4]   2> WARNING: Uncaught exception in thread: Thread[Lucene Merge Thread #13,6,TGRP-TestCompressingTermVectorsFormat]
>    [junit4]   2> org.apache.lucene.index.MergePolicy$MergeException: java.lang.NullPointerException
>    [junit4]   2>        at __randomizedtesting.SeedInfo.seed([3C4832D329799907]:0)
>    [junit4]   2>        at org.apache.lucene.index.ConcurrentMergeScheduler.handleMergeException(ConcurrentMergeScheduler.java:545)
>    [junit4]   2>        at org.apache.lucene.index.ConcurrentMergeScheduler$MergeThread.run(ConcurrentMergeScheduler.java:518)
>    [junit4]   2> Caused by: java.lang.NullPointerException
>    [junit4]   2>        at org.apache.lucene.codecs.lucene49.Lucene49NormsConsumer$NormMap.getOrd(Lucene49NormsConsumer.java:249)
>    [junit4]   2>        at org.apache.lucene.codecs.lucene49.Lucene49NormsConsumer.addNumericField(Lucene49NormsConsumer.java:150)
>    [junit4]   2>        at org.apache.lucene.codecs.DocValuesConsumer.mergeNumericField(DocValuesConsumer.java:129)
>    [junit4]   2>        at org.apache.lucene.index.SegmentMerger.mergeNorms(SegmentMerger.java:255)
>    [junit4]   2>        at org.apache.lucene.index.SegmentMerger.merge(SegmentMerger.java:133)
>    [junit4]   2>        at org.apache.lucene.index.IndexWriter.mergeMiddle(IndexWriter.java:4173)
>    [junit4]   2>        at org.apache.lucene.index.IndexWriter.merge(IndexWriter.java:3768)
>    [junit4]   2>        at org.apache.lucene.index.ConcurrentMergeScheduler.doMerge(ConcurrentMergeScheduler.java:405)
>    [junit4]   2>        at org.apache.lucene.index.ConcurrentMergeScheduler$MergeThread.run(ConcurrentMergeScheduler.java:482)
>    [junit4]   2>
>    [junit4]   2> nov 11, 2014 11:41:17 PM com.carrotsearch.randomizedtesting.RandomizedRunner$QueueUncaughtExceptionsHandler uncaughtException
>    [junit4]   2> WARNING: Uncaught exception in thread: Thread[Lucene Merge Thread #14,6,TGRP-TestCompressingTermVectorsFormat]
>    [junit4]   2> org.apache.lucene.index.MergePolicy$MergeException: java.lang.NullPointerException
>    [junit4]   2>        at __randomizedtesting.SeedInfo.seed([3C4832D329799907]:0)
>    [junit4]   2>        at org.apache.lucene.index.ConcurrentMergeScheduler.handleMergeException(ConcurrentMergeScheduler.java:545)
>    [junit4]   2>        at org.apache.lucene.index.ConcurrentMergeScheduler$MergeThread.run(ConcurrentMergeScheduler.java:518)
>    [junit4]   2> Caused by: java.lang.NullPointerException
>    [junit4]   2>        at org.apache.lucene.codecs.lucene49.Lucene49NormsConsumer$NormMap.getOrd(Lucene49NormsConsumer.java:249)
>    [junit4]   2>        at org.apache.lucene.codecs.lucene49.Lucene49NormsConsumer.addNumericField(Lucene49NormsConsumer.java:150)
>    [junit4]   2>        at org.apache.lucene.codecs.DocValuesConsumer.mergeNumericField(DocValuesConsumer.java:129)
>    [junit4]   2>        at org.apache.lucene.index.SegmentMerger.mergeNorms(SegmentMerger.java:255)
>    [junit4]   2>        at org.apache.lucene.index.SegmentMerger.merge(SegmentMerger.java:133)
>    [junit4]   2>        at org.apache.lucene.index.IndexWriter.mergeMiddle(IndexWriter.java:4173)
>    [junit4]   2>        at org.apache.lucene.index.IndexWriter.merge(IndexWriter.java:3768)
>    [junit4]   2>        at org.apache.lucene.index.ConcurrentMergeScheduler.doMerge(ConcurrentMergeScheduler.java:405)
>    [junit4]   2>        at org.apache.lucene.index.ConcurrentMergeScheduler$MergeThread.run(ConcurrentMergeScheduler.java:482)
>    [junit4]   2>
>    [junit4]   2> nov 11, 2014 11:41:17 PM com.carrotsearch.randomizedtesting.RandomizedRunner$QueueUncaughtExceptionsHandler uncaughtException
>    [junit4]   2> WARNING: Uncaught exception in thread: Thread[Lucene Merge Thread #15,6,TGRP-TestCompressingTermVectorsFormat]
>    [junit4]   2> org.apache.lucene.index.MergePolicy$MergeException: java.lang.NullPointerException
>    [junit4]   2>        at __randomizedtesting.SeedInfo.seed([3C4832D329799907]:0)
>    [junit4]   2>        at org.apache.lucene.index.ConcurrentMergeScheduler.handleMergeException(ConcurrentMergeScheduler.java:545)
>    [junit4]   2>        at org.apache.lucene.index.ConcurrentMergeScheduler$MergeThread.run(ConcurrentMergeScheduler.java:518)
>    [junit4]   2> Caused by: java.lang.NullPointerException
>    [junit4]   2>        at org.apache.lucene.codecs.lucene49.Lucene49NormsConsumer$NormMap.getOrd(Lucene49NormsConsumer.java:249)
>    [junit4]   2>        at org.apache.lucene.codecs.lucene49.Lucene49NormsConsumer.addNumericField(Lucene49NormsConsumer.java:150)
>    [junit4]   2>        at org.apache.lucene.codecs.DocValuesConsumer.mergeNumericField(DocValuesConsumer.java:129)
>    [junit4]   2>        at org.apache.lucene.index.SegmentMerger.mergeNorms(SegmentMerger.java:255)
>    [junit4]   2>        at org.apache.lucene.index.SegmentMerger.merge(SegmentMerger.java:133)
>    [junit4]   2>        at org.apache.lucene.index.IndexWriter.mergeMiddle(IndexWriter.java:4173)
>    [junit4]   2>        at org.apache.lucene.index.IndexWriter.merge(IndexWriter.java:3768)
>    [junit4]   2>        at org.apache.lucene.index.ConcurrentMergeScheduler.doMerge(ConcurrentMergeScheduler.java:405)
>    [junit4]   2>        at org.apache.lucene.index.ConcurrentMergeScheduler$MergeThread.run(ConcurrentMergeScheduler.java:482)
>    [junit4]   2>
>    [junit4]   2> nov 11, 2014 11:41:18 PM com.carrotsearch.randomizedtesting.RandomizedRunner$QueueUncaughtExceptionsHandler uncaughtException
>    [junit4]   2> WARNING: Uncaught exception in thread: Thread[Lucene Merge Thread #16,6,TGRP-TestCompressingTermVectorsFormat]
>    [junit4]   2> org.apache.lucene.index.MergePolicy$MergeException: java.lang.NullPointerException
>    [junit4]   2>        at __randomizedtesting.SeedInfo.seed([3C4832D329799907]:0)
>    [junit4]   2>        at org.apache.lucene.index.ConcurrentMergeScheduler.handleMergeException(ConcurrentMergeScheduler.java:545)
>    [junit4]   2>        at org.apache.lucene.index.ConcurrentMergeScheduler$MergeThread.run(ConcurrentMergeScheduler.java:518)
>    [junit4]   2> Caused by: java.lang.NullPointerException
>    [junit4]   2>        at org.apache.lucene.codecs.lucene49.Lucene49NormsConsumer$NormMap.getOrd(Lucene49NormsConsumer.java:249)
>    [junit4]   2>        at org.apache.lucene.codecs.lucene49.Lucene49NormsConsumer.addNumericField(Lucene49NormsConsumer.java:150)
>    [junit4]   2>        at org.apache.lucene.codecs.DocValuesConsumer.mergeNumericField(DocValuesConsumer.java:129)
>    [junit4]   2>        at org.apache.lucene.index.SegmentMerger.mergeNorms(SegmentMerger.java:255)
>    [junit4]   2>        at org.apache.lucene.index.SegmentMerger.merge(SegmentMerger.java:133)
>    [junit4]   2>        at org.apache.lucene.index.IndexWriter.mergeMiddle(IndexWriter.java:4173)
>    [junit4]   2>        at org.apache.lucene.index.IndexWriter.merge(IndexWriter.java:3768)
>    [junit4]   2>        at org.apache.lucene.index.ConcurrentMergeScheduler.doMerge(ConcurrentMergeScheduler.java:405)
>    [junit4]   2>        at org.apache.lucene.index.ConcurrentMergeScheduler$MergeThread.run(ConcurrentMergeScheduler.java:482)
>    [junit4]   2>
>    [junit4]   2> nov 11, 2014 11:41:18 PM com.carrotsearch.randomizedtesting.RandomizedRunner$QueueUncaughtExceptionsHandler uncaughtException
>    [junit4]   2> WARNING: Uncaught exception in thread: Thread[Lucene Merge Thread #17,6,TGRP-TestCompressingTermVectorsFormat]
>    [junit4]   2> org.apache.lucene.index.MergePolicy$MergeException: java.lang.NullPointerException
>    [junit4]   2>        at __randomizedtesting.SeedInfo.seed([3C4832D329799907]:0)
>    [junit4]   2>        at org.apache.lucene.index.ConcurrentMergeScheduler.handleMergeException(ConcurrentMergeScheduler.java:545)
>    [junit4]   2>        at org.apache.lucene.index.ConcurrentMergeScheduler$MergeThread.run(ConcurrentMergeScheduler.java:518)
>    [junit4]   2> Caused by: java.lang.NullPointerException
>    [junit4]   2>        at org.apache.lucene.codecs.lucene49.Lucene49NormsConsumer$NormMap.getOrd(Lucene49NormsConsumer.java:249)
>    [junit4]   2>        at org.apache.lucene.codecs.lucene49.Lucene49NormsConsumer.addNumericField(Lucene49NormsConsumer.java:150)
>    [junit4]   2>        at org.apache.lucene.codecs.DocValuesConsumer.mergeNumericField(DocValuesConsumer.java:129)
>    [junit4]   2>        at org.apache.lucene.index.SegmentMerger.mergeNorms(SegmentMerger.java:255)
>    [junit4]   2>        at org.apache.lucene.index.SegmentMerger.merge(SegmentMerger.java:133)
>    [junit4]   2>        at org.apache.lucene.index.IndexWriter.mergeMiddle(IndexWriter.java:4173)
>    [junit4]   2>        at org.apache.lucene.index.IndexWriter.merge(IndexWriter.java:3768)
>    [junit4]   2>        at org.apache.lucene.index.ConcurrentMergeScheduler.doMerge(ConcurrentMergeScheduler.java:405)
>    [junit4]   2>        at org.apache.lucene.index.ConcurrentMergeScheduler$MergeThread.run(ConcurrentMergeScheduler.java:482)
>    [junit4]   2>
>    [junit4]   2> nov 11, 2014 11:41:18 PM com.carrotsearch.randomizedtesting.RandomizedRunner$QueueUncaughtExceptionsHandler uncaughtException
>    [junit4]   2> WARNING: Uncaught exception in thread: Thread[Lucene Merge Thread #5,6,TGRP-TestCompressingTermVectorsFormat]
>    [junit4]   2> org.apache.lucene.index.MergePolicy$MergeException: java.lang.NullPointerException
>    [junit4]   2>        at __randomizedtesting.SeedInfo.seed([3C4832D329799907]:0)
>    [junit4]   2>        at org.apache.lucene.index.ConcurrentMergeScheduler.handleMergeException(ConcurrentMergeScheduler.java:545)
>    [junit4]   2>        at org.apache.lucene.index.ConcurrentMergeScheduler$MergeThread.run(ConcurrentMergeScheduler.java:518)
>    [junit4]   2> Caused by: java.lang.NullPointerException
>    [junit4]   2>        at org.apache.lucene.codecs.lucene49.Lucene49NormsConsumer$NormMap.getOrd(Lucene49NormsConsumer.java:249)
>    [junit4]   2>        at org.apache.lucene.codecs.lucene49.Lucene49NormsConsumer.addNumericField(Lucene49NormsConsumer.java:150)
>    [junit4]   2>        at org.apache.lucene.codecs.DocValuesConsumer.mergeNumericField(DocValuesConsumer.java:129)
>    [junit4]   2>        at org.apache.lucene.index.SegmentMerger.mergeNorms(SegmentMerger.java:255)
>    [junit4]   2>        at org.apache.lucene.index.SegmentMerger.merge(SegmentMerger.java:133)
>    [junit4]   2>        at org.apache.lucene.index.IndexWriter.mergeMiddle(IndexWriter.java:4173)
>    [junit4]   2>        at org.apache.lucene.index.IndexWriter.merge(IndexWriter.java:3768)
>    [junit4]   2>        at org.apache.lucene.index.ConcurrentMergeScheduler.doMerge(ConcurrentMergeScheduler.java:405)
>    [junit4]   2>        at org.apache.lucene.index.ConcurrentMergeScheduler$MergeThread.run(ConcurrentMergeScheduler.java:482)
>    [junit4]   2>
>    [junit4]   2> nov 11, 2014 11:41:18 PM com.carrotsearch.randomizedtesting.RandomizedRunner$QueueUncaughtExceptionsHandler uncaughtException
>    [junit4]   2> WARNING: Uncaught exception in thread: Thread[Lucene Merge Thread #18,6,TGRP-TestCompressingTermVectorsFormat]
>    [junit4]   2> org.apache.lucene.index.MergePolicy$MergeException: java.lang.NullPointerException
>    [junit4]   2>        at __randomizedtesting.SeedInfo.seed([3C4832D329799907]:0)
>    [junit4]   2>        at org.apache.lucene.index.ConcurrentMergeScheduler.handleMergeException(ConcurrentMergeScheduler.java:545)
>    [junit4]   2>        at org.apache.lucene.index.ConcurrentMergeScheduler$MergeThread.run(ConcurrentMergeScheduler.java:518)
>    [junit4]   2> Caused by: java.lang.NullPointerException
>    [junit4]   2>        at org.apache.lucene.codecs.lucene49.Lucene49NormsConsumer$NormMap.getOrd(Lucene49NormsConsumer.java:249)
>    [junit4]   2>        at org.apache.lucene.codecs.lucene49.Lucene49NormsConsumer.addNumericField(Lucene49NormsConsumer.java:150)
>    [junit4]   2>        at org.apache.lucene.codecs.DocValuesConsumer.mergeNumericField(DocValuesConsumer.java:129)
>    [junit4]   2>        at org.apache.lucene.index.SegmentMerger.mergeNorms(SegmentMerger.java:255)
>    [junit4]   2>        at org.apache.lucene.index.SegmentMerger.merge(SegmentMerger.java:133)
>    [junit4]   2>        at org.apache.lucene.index.IndexWriter.mergeMiddle(IndexWriter.java:4173)
>    [junit4]   2>        at org.apache.lucene.index.IndexWriter.merge(IndexWriter.java:3768)
>    [junit4]   2>        at org.apache.lucene.index.ConcurrentMergeScheduler.doMerge(ConcurrentMergeScheduler.java:405)
>    [junit4]   2>        at org.apache.lucene.index.ConcurrentMergeScheduler$MergeThread.run(ConcurrentMergeScheduler.java:482)
>    [junit4]   2>
>    [junit4]   2> nov 11, 2014 11:41:19 PM com.carrotsearch.randomizedtesting.RandomizedRunner$QueueUncaughtExceptionsHandler uncaughtException
>    [junit4]   2> WARNING: Uncaught exception in thread: Thread[Lucene Merge Thread #20,6,TGRP-TestCompressingTermVectorsFormat]
>    [junit4]   2> org.apache.lucene.index.MergePolicy$MergeException: java.lang.NullPointerException
>    [junit4]   2>        at __randomizedtesting.SeedInfo.seed([3C4832D329799907]:0)
>    [junit4]   2>        at org.apache.lucene.index.ConcurrentMergeScheduler.handleMergeException(ConcurrentMergeScheduler.java:545)
>    [junit4]   2>        at org.apache.lucene.index.ConcurrentMergeScheduler$MergeThread.run(ConcurrentMergeScheduler.java:518)
>    [junit4]   2> Caused by: java.lang.NullPointerException
>    [junit4]   2>        at org.apache.lucene.codecs.lucene49.Lucene49NormsConsumer$NormMap.getOrd(Lucene49NormsConsumer.java:249)
>    [junit4]   2>        at org.apache.lucene.codecs.lucene49.Lucene49NormsConsumer.addNumericField(Lucene49NormsConsumer.java:150)
>    [junit4]   2>        at org.apache.lucene.codecs.DocValuesConsumer.mergeNumericField(DocValuesConsumer.java:129)
>    [junit4]   2>        at org.apache.lucene.index.SegmentMerger.mergeNorms(SegmentMerger.java:255)
>    [junit4]   2>        at org.apache.lucene.index.SegmentMerger.merge(SegmentMerger.java:133)
>    [junit4]   2>        at org.apache.lucene.index.IndexWriter.mergeMiddle(IndexWriter.java:4173)
>    [junit4]   2>        at org.apache.lucene.index.IndexWriter.merge(IndexWriter.java:3768)
>    [junit4]   2>        at org.apache.lucene.index.ConcurrentMergeScheduler.doMerge(ConcurrentMergeScheduler.java:405)
>    [junit4]   2>        at org.apache.lucene.index.ConcurrentMergeScheduler$MergeThread.run(ConcurrentMergeScheduler.java:482)
>    [junit4]   2>
>    [junit4]   2> nov 11, 2014 11:41:19 PM com.carrotsearch.randomizedtesting.RandomizedRunner$QueueUncaughtExceptionsHandler uncaughtException
>    [junit4]   2> WARNING: Uncaught exception in thread: Thread[Lucene Merge Thread #21,6,TGRP-TestCompressingTermVectorsFormat]
>    [junit4]   2> org.apache.lucene.index.MergePolicy$MergeException: java.lang.NullPointerException
>    [junit4]   2>        at __randomizedtesting.SeedInfo.seed([3C4832D329799907]:0)
>    [junit4]   2>        at org.apache.lucene.index.ConcurrentMergeScheduler.handleMergeException(ConcurrentMergeScheduler.java:545)
>    [junit4]   2>        at org.apache.lucene.index.ConcurrentMergeScheduler$MergeThread.run(ConcurrentMergeScheduler.java:518)
>    [junit4]   2> Caused by: java.lang.NullPointerException
>    [junit4]   2>        at org.apache.lucene.codecs.lucene49.Lucene49NormsConsumer$NormMap.getOrd(Lucene49NormsConsumer.java:249)
>    [junit4]   2>        at org.apache.lucene.codecs.lucene49.Lucene49NormsConsumer.addNumericField(Lucene49NormsConsumer.java:150)
>    [junit4]   2>        at org.apache.lucene.codecs.DocValuesConsumer.mergeNumericField(DocValuesConsumer.java:129)
>    [junit4]   2>        at org.apache.lucene.index.SegmentMerger.mergeNorms(SegmentMerger.java:255)
>    [junit4]   2>        at org.apache.lucene.index.SegmentMerger.merge(SegmentMerger.java:133)
>    [junit4]   2>        at org.apache.lucene.index.IndexWriter.mergeMiddle(IndexWriter.java:4173)
>    [junit4]   2>        at org.apache.lucene.index.IndexWriter.merge(IndexWriter.java:3768)
>    [junit4]   2>        at org.apache.lucene.index.ConcurrentMergeScheduler.doMerge(ConcurrentMergeScheduler.java:405)
>    [junit4]   2>        at org.apache.lucene.index.ConcurrentMergeScheduler$MergeThread.run(ConcurrentMergeScheduler.java:482)
>    [junit4]   2>
>    [junit4]   2> nov 11, 2014 11:41:19 PM com.carrotsearch.randomizedtesting.RandomizedRunner$QueueUncaughtExceptionsHandler uncaughtException
>    [junit4]   2> WARNING: Uncaught exception in thread: Thread[Lucene Merge Thread #22,6,TGRP-TestCompressingTermVectorsFormat]
>    [junit4]   2> org.apache.lucene.index.MergePolicy$MergeException: java.lang.NullPointerException
>    [junit4]   2>        at __randomizedtesting.SeedInfo.seed([3C4832D329799907]:0)
>    [junit4]   2>        at org.apache.lucene.index.ConcurrentMergeScheduler.handleMergeException(ConcurrentMergeScheduler.java:545)
>    [junit4]   2>        at org.apache.lucene.index.ConcurrentMergeScheduler$MergeThread.run(ConcurrentMergeScheduler.java:518)
>    [junit4]   2> Caused by: java.lang.NullPointerException
>    [junit4]   2>        at org.apache.lucene.codecs.lucene49.Lucene49NormsConsumer$NormMap.getOrd(Lucene49NormsConsumer.java:249)
>    [junit4]   2>        at org.apache.lucene.codecs.lucene49.Lucene49NormsConsumer.addNumericField(Lucene49NormsConsumer.java:150)
>    [junit4]   2>        at org.apache.lucene.codecs.DocValuesConsumer.mergeNumericField(DocValuesConsumer.java:129)
>    [junit4]   2>        at org.apache.lucene.index.SegmentMerger.mergeNorms(SegmentMerger.java:255)
>    [junit4]   2>        at org.apache.lucene.index.SegmentMerger.merge(SegmentMerger.java:133)
>    [junit4]   2>        at org.apache.lucene.index.IndexWriter.mergeMiddle(IndexWriter.java:4173)
>    [junit4]   2>        at org.apache.lucene.index.IndexWriter.merge(IndexWriter.java:3768)
>    [junit4]   2>        at org.apache.lucene.index.ConcurrentMergeScheduler.doMerge(ConcurrentMergeScheduler.java:405)
>    [junit4]   2>        at org.apache.lucene.index.ConcurrentMergeScheduler$MergeThread.run(ConcurrentMergeScheduler.java:482)
>    [junit4]   2>
>    [junit4]   2> nov 11, 2014 11:41:20 PM com.carrotsearch.randomizedtesting.RandomizedRunner$QueueUncaughtExceptionsHandler uncaughtException
>    [junit4]   2> WARNING: Uncaught exception in thread: Thread[Lucene Merge Thread #23,6,TGRP-TestCompressingTermVectorsFormat]
>    [junit4]   2> org.apache.lucene.index.MergePolicy$MergeException: java.lang.NullPointerException
>    [junit4]   2>        at __randomizedtesting.SeedInfo.seed([3C4832D329799907]:0)
>    [junit4]   2>        at org.apache.lucene.index.ConcurrentMergeScheduler.handleMergeException(ConcurrentMergeScheduler.java:545)
>    [junit4]   2>        at org.apache.lucene.index.ConcurrentMergeScheduler$MergeThread.run(ConcurrentMergeScheduler.java:518)
>    [junit4]   2> Caused by: java.lang.NullPointerException
>    [junit4]   2>        at org.apache.lucene.codecs.lucene49.Lucene49NormsConsumer$NormMap.getOrd(Lucene49NormsConsumer.java:249)
>    [junit4]   2>        at org.apache.lucene.codecs.lucene49.Lucene49NormsConsumer.addNumericField(Lucene49NormsConsumer.java:150)
>    [junit4]   2>        at org.apache.lucene.codecs.DocValuesConsumer.mergeNumericField(DocValuesConsumer.java:129)
>    [junit4]   2>        at org.apache.lucene.index.SegmentMerger.mergeNorms(SegmentMerger.java:255)
>    [junit4]   2>        at org.apache.lucene.index.SegmentMerger.merge(SegmentMerger.java:133)
>    [junit4]   2>        at org.apache.lucene.index.IndexWriter.mergeMiddle(IndexWriter.java:4173)
>    [junit4]   2>        at org.apache.lucene.index.IndexWriter.merge(IndexWriter.java:3768)
>    [junit4]   2>        at org.apache.lucene.index.ConcurrentMergeScheduler.doMerge(ConcurrentMergeScheduler.java:405)
>    [junit4]   2>        at org.apache.lucene.index.ConcurrentMergeScheduler$MergeThread.run(ConcurrentMergeScheduler.java:482)
>    [junit4]   2>
>    [junit4]   2> nov 11, 2014 11:41:20 PM com.carrotsearch.randomizedtesting.RandomizedRunner$QueueUncaughtExceptionsHandler uncaughtException
>    [junit4]   2> WARNING: Uncaught exception in thread: Thread[Lucene Merge Thread #24,6,TGRP-TestCompressingTermVectorsFormat]
>    [junit4]   2> org.apache.lucene.index.MergePolicy$MergeException: java.lang.NullPointerException
>    [junit4]   2>        at __randomizedtesting.SeedInfo.seed([3C4832D329799907]:0)
>    [junit4]   2>        at org.apache.lucene.index.ConcurrentMergeScheduler.handleMergeException(ConcurrentMergeScheduler.java:545)
>    [junit4]   2>        at org.apache.lucene.index.ConcurrentMergeScheduler$MergeThread.run(ConcurrentMergeScheduler.java:518)
>    [junit4]   2> Caused by: java.lang.NullPointerException
>    [junit4]   2>        at org.apache.lucene.codecs.lucene49.Lucene49NormsConsumer$NormMap.getOrd(Lucene49NormsConsumer.java:249)
>    [junit4]   2>        at org.apache.lucene.codecs.lucene49.Lucene49NormsConsumer.addNumericField(Lucene49NormsConsumer.java:150)
>    [junit4]   2>        at org.apache.lucene.codecs.DocValuesConsumer.mergeNumericField(DocValuesConsumer.java:129)
>    [junit4]   2>        at org.apache.lucene.index.SegmentMerger.mergeNorms(SegmentMerger.java:255)
>    [junit4]   2>        at org.apache.lucene.index.SegmentMerger.merge(SegmentMerger.java:133)
>    [junit4]   2>        at org.apache.lucene.index.IndexWriter.mergeMiddle(IndexWriter.java:4173)
>    [junit4]   2>        at org.apache.lucene.index.IndexWriter.merge(IndexWriter.java:3768)
>    [junit4]   2>        at org.apache.lucene.index.ConcurrentMergeScheduler.doMerge(ConcurrentMergeScheduler.java:405)
>    [junit4]   2>        at org.apache.lucene.index.ConcurrentMergeScheduler$MergeThread.run(ConcurrentMergeScheduler.java:482)
>    [junit4]   2>
>    [junit4]   2> nov 11, 2014 11:41:20 PM com.carrotsearch.randomizedtesting.RandomizedRunner$QueueUncaughtExceptionsHandler uncaughtException
>    [junit4]   2> WARNING: Uncaught exception in thread: Thread[Lucene Merge Thread #25,6,TGRP-TestCompressingTermVectorsFormat]
>    [junit4]   2> org.apache.lucene.index.MergePolicy$MergeException: java.lang.NullPointerException
>    [junit4]   2>        at __randomizedtesting.SeedInfo.seed([3C4832D329799907]:0)
>    [junit4]   2>        at org.apache.lucene.index.ConcurrentMergeScheduler.handleMergeException(ConcurrentMergeScheduler.java:545)
>    [junit4]   2>        at org.apache.lucene.index.ConcurrentMergeScheduler$MergeThread.run(ConcurrentMergeScheduler.java:518)
>    [junit4]   2> Caused by: java.lang.NullPointerException
>    [junit4]   2>        at org.apache.lucene.codecs.lucene49.Lucene49NormsConsumer$NormMap.getOrd(Lucene49NormsConsumer.java:249)
>    [junit4]   2>        at org.apache.lucene.codecs.lucene49.Lucene49NormsConsumer.addNumericField(Lucene49NormsConsumer.java:150)
>    [junit4]   2>        at org.apache.lucene.codecs.DocValuesConsumer.mergeNumericField(DocValuesConsumer.java:129)
>    [junit4]   2>        at org.apache.lucene.index.SegmentMerger.mergeNorms(SegmentMerger.java:255)
>    [junit4]   2>        at org.apache.lucene.index.SegmentMerger.merge(SegmentMerger.java:133)
>    [junit4]   2>        at org.apache.lucene.index.IndexWriter.mergeMiddle(IndexWriter.java:4173)
>    [junit4]   2>        at org.apache.lucene.index.IndexWriter.merge(IndexWriter.java:3768)
>    [junit4]   2>        at org.apache.lucene.index.ConcurrentMergeScheduler.doMerge(ConcurrentMergeScheduler.java:405)
>    [junit4]   2>        at org.apache.lucene.index.ConcurrentMergeScheduler$MergeThread.run(ConcurrentMergeScheduler.java:482)
>    [junit4]   2>
>    [junit4]   2> nov 11, 2014 11:41:21 PM com.carrotsearch.randomizedtesting.RandomizedRunner$QueueUncaughtExceptionsHandler uncaughtException
>    [junit4]   2> WARNING: Uncaught exception in thread: Thread[Lucene Merge Thread #26,6,TGRP-TestCompressingTermVectorsFormat]
>    [junit4]   2> org.apache.lucene.index.MergePolicy$MergeException: java.lang.NullPointerException
>    [junit4]   2>        at __randomizedtesting.SeedInfo.seed([3C4832D329799907]:0)
>    [junit4]   2>        at org.apache.lucene.index.ConcurrentMergeScheduler.handleMergeException(ConcurrentMergeScheduler.java:545)
>    [junit4]   2>        at org.apache.lucene.index.ConcurrentMergeScheduler$MergeThread.run(ConcurrentMergeScheduler.java:518)
>    [junit4]   2> Caused by: java.lang.NullPointerException
>    [junit4]   2>        at org.apache.lucene.codecs.lucene49.Lucene49NormsConsumer$NormMap.getOrd(Lucene49NormsConsumer.java:249)
>    [junit4]   2>        at org.apache.lucene.codecs.lucene49.Lucene49NormsConsumer.addNumericField(Lucene49NormsConsumer.java:150)
>    [junit4]   2>        at org.apache.lucene.codecs.DocValuesConsumer.mergeNumericField(DocValuesConsumer.java:129)
>    [junit4]   2>        at org.apache.lucene.index.SegmentMerger.mergeNorms(SegmentMerger.java:255)
>    [junit4]   2>        at org.apache.lucene.index.SegmentMerger.merge(SegmentMerger.java:133)
>    [junit4]   2>        at org.apache.lucene.index.IndexWriter.mergeMiddle(IndexWriter.java:4173)
>    [junit4]   2>        at org.apache.lucene.index.IndexWriter.merge(IndexWriter.java:3768)
>    [junit4]   2>        at org.apache.lucene.index.ConcurrentMergeScheduler.doMerge(ConcurrentMergeScheduler.java:405)
>    [junit4]   2>        at org.apache.lucene.index.ConcurrentMergeScheduler$MergeThread.run(ConcurrentMergeScheduler.java:482)
>    [junit4]   2>
>    [junit4]   2> nov 11, 2014 11:41:21 PM com.carrotsearch.randomizedtesting.RandomizedRunner$QueueUncaughtExceptionsHandler uncaughtException
>    [junit4]   2> WARNING: Uncaught exception in thread: Thread[Lucene Merge Thread #27,6,TGRP-TestCompressingTermVectorsFormat]
>    [junit4]   2> org.apache.lucene.index.MergePolicy$MergeException: java.lang.NullPointerException
>    [junit4]   2>        at __randomizedtesting.SeedInfo.seed([3C4832D329799907]:0)
>    [junit4]   2>        at org.apache.lucene.index.ConcurrentMergeScheduler.handleMergeException(ConcurrentMergeScheduler.java:545)
>    [junit4]   2>        at org.apache.lucene.index.ConcurrentMergeScheduler$MergeThread.run(ConcurrentMergeScheduler.java:518)
>    [junit4]   2> Caused by: java.lang.NullPointerException
>    [junit4]   2>        at org.apache.lucene.codecs.lucene49.Lucene49NormsConsumer$NormMap.getOrd(Lucene49NormsConsumer.java:249)
>    [junit4]   2>        at org.apache.lucene.codecs.lucene49.Lucene49NormsConsumer.addNumericField(Lucene49NormsConsumer.java:150)
>    [junit4]   2>        at org.apache.lucene.codecs.DocValuesConsumer.mergeNumericField(DocValuesConsumer.java:129)
>    [junit4]   2>        at org.apache.lucene.index.SegmentMerger.mergeNorms(SegmentMerger.java:255)
>    [junit4]   2>        at org.apache.lucene.index.SegmentMerger.merge(SegmentMerger.java:133)
>    [junit4]   2>        at org.apache.lucene.index.IndexWriter.mergeMiddle(IndexWriter.java:4173)
>    [junit4]   2>        at org.apache.lucene.index.IndexWriter.merge(IndexWriter.java:3768)
>    [junit4]   2>        at org.apache.lucene.index.ConcurrentMergeScheduler.doMerge(ConcurrentMergeScheduler.java:405)
>    [junit4]   2>        at org.apache.lucene.index.ConcurrentMergeScheduler$MergeThread.run(ConcurrentMergeScheduler.java:482)
>    [junit4]   2>
>    [junit4]   2> nov 11, 2014 11:41:22 PM com.carrotsearch.randomizedtesting.RandomizedRunner$QueueUncaughtExceptionsHandler uncaughtException
>    [junit4]   2> WARNING: Uncaught exception in thread: Thread[Lucene Merge Thread #28,6,TGRP-TestCompressingTermVectorsFormat]
>    [junit4]   2> org.apache.lucene.index.MergePolicy$MergeException: java.lang.NullPointerException
>    [junit4]   2>        at __randomizedtesting.SeedInfo.seed([3C4832D329799907]:0)
>    [junit4]   2>        at org.apache.lucene.index.ConcurrentMergeScheduler.handleMergeException(ConcurrentMergeScheduler.java:545)
>    [junit4]   2>        at org.apache.lucene.index.ConcurrentMergeScheduler$MergeThread.run(ConcurrentMergeScheduler.java:518)
>    [junit4]   2> Caused by: java.lang.NullPointerException
>    [junit4]   2>        at org.apache.lucene.codecs.lucene49.Lucene49NormsConsumer$NormMap.getOrd(Lucene49NormsConsumer.java:249)
>    [junit4]   2>        at org.apache.lucene.codecs.lucene49.Lucene49NormsConsumer.addNumericField(Lucene49NormsConsumer.java:150)
>    [junit4]   2>        at org.apache.lucene.codecs.DocValuesConsumer.mergeNumericField(DocValuesConsumer.java:129)
>    [junit4]   2>        at org.apache.lucene.index.SegmentMerger.mergeNorms(SegmentMerger.java:255)
>    [junit4]   2>        at org.apache.lucene.index.SegmentMerger.merge(SegmentMerger.java:133)
>    [junit4]   2>        at org.apache.lucene.index.IndexWriter.mergeMiddle(IndexWriter.java:4173)
>    [junit4]   2>        at org.apache.lucene.index.IndexWriter.merge(IndexWriter.java:3768)
>    [junit4]   2>        at org.apache.lucene.index.ConcurrentMergeScheduler.doMerge(ConcurrentMergeScheduler.java:405)
>    [junit4]   2>        at org.apache.lucene.index.ConcurrentMergeScheduler$MergeThread.run(ConcurrentMergeScheduler.java:482)
>    [junit4]   2>
>    [junit4]   2> nov 11, 2014 11:41:22 PM com.carrotsearch.randomizedtesting.RandomizedRunner$QueueUncaughtExceptionsHandler uncaughtException
>    [junit4]   2> WARNING: Uncaught exception in thread: Thread[Lucene Merge Thread #29,6,TGRP-TestCompressingTermVectorsFormat]
>    [junit4]   2> org.apache.lucene.index.MergePolicy$MergeException: java.lang.NullPointerException
>    [junit4]   2>        at __randomizedtesting.SeedInfo.seed([3C4832D329799907]:0)
>    [junit4]   2>        at org.apache.lucene.index.ConcurrentMergeScheduler.handleMergeException(ConcurrentMergeScheduler.java:545)
>    [junit4]   2>        at org.apache.lucene.index.ConcurrentMergeScheduler$MergeThread.run(ConcurrentMergeScheduler.java:518)
>    [junit4]   2> Caused by: java.lang.NullPointerException
>    [junit4]   2>        at org.apache.lucene.codecs.lucene49.Lucene49NormsConsumer$NormMap.getOrd(Lucene49NormsConsumer.java:249)
>    [junit4]   2>        at org.apache.lucene.codecs.lucene49.Lucene49NormsConsumer.addNumericField(Lucene49NormsConsumer.java:150)
>    [junit4]   2>        at org.apache.lucene.codecs.DocValuesConsumer.mergeNumericField(DocValuesConsumer.java:129)
>    [junit4]   2>        at org.apache.lucene.index.SegmentMerger.mergeNorms(SegmentMerger.java:255)
>    [junit4]   2>        at org.apache.lucene.index.SegmentMerger.merge(SegmentMerger.java:133)
>    [junit4]   2>        at org.apache.lucene.index.IndexWriter.mergeMiddle(IndexWriter.java:4173)
>    [junit4]   2>        at org.apache.lucene.index.IndexWriter.merge(IndexWriter.java:3768)
>    [junit4]   2>        at org.apache.lucene.index.ConcurrentMergeScheduler.doMerge(ConcurrentMergeScheduler.java:405)
>    [junit4]   2>        at org.apache.lucene.index.ConcurrentMergeScheduler$MergeThread.run(ConcurrentMergeScheduler.java:482)
>    [junit4]   2>
>    [junit4]   2> nov 11, 2014 11:41:22 PM com.carrotsearch.randomizedtesting.RandomizedRunner$QueueUncaughtExceptionsHandler uncaughtException
>    [junit4]   2> WARNING: Uncaught exception in thread: Thread[Lucene Merge Thread #30,6,TGRP-TestCompressingTermVectorsFormat]
>    [junit4]   2> org.apache.lucene.index.MergePolicy$MergeException: java.lang.NullPointerException
>    [junit4]   2>        at __randomizedtesting.SeedInfo.seed([3C4832D329799907]:0)
>    [junit4]   2>        at org.apache.lucene.index.ConcurrentMergeScheduler.handleMergeException(ConcurrentMergeScheduler.java:545)
>    [junit4]   2>        at org.apache.lucene.index.ConcurrentMergeScheduler$MergeThread.run(ConcurrentMergeScheduler.java:518)
>    [junit4]   2> Caused by: java.lang.NullPointerException
>    [junit4]   2>        at org.apache.lucene.codecs.lucene49.Lucene49NormsConsumer$NormMap.getOrd(Lucene49NormsConsumer.java:249)
>    [junit4]   2>        at org.apache.lucene.codecs.lucene49.Lucene49NormsConsumer.addNumericField(Lucene49NormsConsumer.java:150)
>    [junit4]   2>        at org.apache.lucene.codecs.DocValuesConsumer.mergeNumericField(DocValuesConsumer.java:129)
>    [junit4]   2>        at org.apache.lucene.index.SegmentMerger.mergeNorms(SegmentMerger.java:255)
>    [junit4]   2>        at org.apache.lucene.index.SegmentMerger.merge(SegmentMerger.java:133)
>    [junit4]   2>        at org.apache.lucene.index.IndexWriter.mergeMiddle(IndexWriter.java:4173)
>    [junit4]   2>        at org.apache.lucene.index.IndexWriter.merge(IndexWriter.java:3768)
>    [junit4]   2>        at org.apache.lucene.index.ConcurrentMergeScheduler.doMerge(ConcurrentMergeScheduler.java:405)
>    [junit4]   2>        at org.apache.lucene.index.ConcurrentMergeScheduler$MergeThread.run(ConcurrentMergeScheduler.java:482)
>    [junit4]   2>
>    [junit4]   2> nov 11, 2014 11:41:23 PM com.carrotsearch.randomizedtesting.RandomizedRunner$QueueUncaughtExceptionsHandler uncaughtException
>    [junit4]   2> WARNING: Uncaught exception in thread: Thread[Lucene Merge Thread #31,6,TGRP-TestCompressingTermVectorsFormat]
>    [junit4]   2> org.apache.lucene.index.MergePolicy$MergeException: java.lang.NullPointerException
>    [junit4]   2>        at __randomizedtesting.SeedInfo.seed([3C4832D329799907]:0)
>    [junit4]   2>        at org.apache.lucene.index.ConcurrentMergeScheduler.handleMergeException(ConcurrentMergeScheduler.java:545)
>    [junit4]   2>        at org.apache.lucene.index.ConcurrentMergeScheduler$MergeThread.run(ConcurrentMergeScheduler.java:518)
>    [junit4]   2> Caused by: java.lang.NullPointerException
>    [junit4]   2>        at org.apache.lucene.codecs.lucene49.Lucene49NormsConsumer$NormMap.getOrd(Lucene49NormsConsumer.java:249)
>    [junit4]   2>        at org.apache.lucene.codecs.lucene49.Lucene49NormsConsumer.addNumericField(Lucene49NormsConsumer.java:150)
>    [junit4]   2>        at org.apache.lucene.codecs.DocValuesConsumer.mergeNumericField(DocValuesConsumer.java:129)
>    [junit4]   2>        at org.apache.lucene.index.SegmentMerger.mergeNorms(SegmentMerger.java:255)
>    [junit4]   2>        at org.apache.lucene.index.SegmentMerger.merge(SegmentMerger.java:133)
>    [junit4]   2>        at org.apache.lucene.index.IndexWriter.mergeMiddle(IndexWriter.java:4173)
>    [junit4]   2>        at org.apache.lucene.index.IndexWriter.merge(IndexWriter.java:3768)
>    [junit4]   2>        at org.apache.lucene.index.ConcurrentMergeScheduler.doMerge(ConcurrentMergeScheduler.java:405)
>    [junit4]   2>        at org.apache.lucene.index.ConcurrentMergeScheduler$MergeThread.run(ConcurrentMergeScheduler.java:482)
>    [junit4]   2>
>    [junit4]   2> nov 11, 2014 11:41:23 PM com.carrotsearch.randomizedtesting.RandomizedRunner$QueueUncaughtExceptionsHandler uncaughtException
>    [junit4]   2> WARNING: Uncaught exception in thread: Thread[Lucene Merge Thread #32,6,TGRP-TestCompressingTermVectorsFormat]
>    [junit4]   2> org.apache.lucene.index.MergePolicy$MergeException: java.lang.NullPointerException
>    [junit4]   2>        at __randomizedtesting.SeedInfo.seed([3C4832D329799907]:0)
>    [junit4]   2>        at org.apache.lucene.index.ConcurrentMergeScheduler.handleMergeException(ConcurrentMergeScheduler.java:545)
>    [junit4]   2>        at org.apache.lucene.index.ConcurrentMergeScheduler$MergeThread.run(ConcurrentMergeScheduler.java:518)
>    [junit4]   2> Caused by: java.lang.NullPointerException
>    [junit4]   2>        at org.apache.lucene.codecs.lucene49.Lucene49NormsConsumer$NormMap.getOrd(Lucene49NormsConsumer.java:249)
>    [junit4]   2>        at org.apache.lucene.codecs.lucene49.Lucene49NormsConsumer.addNumericField(Lucene49NormsConsumer.java:150)
>    [junit4]   2>        at org.apache.lucene.codecs.DocValuesConsumer.mergeNumericField(DocValuesConsumer.java:129)
>    [junit4]   2>        at org.apache.lucene.index.SegmentMerger.mergeNorms(SegmentMerger.java:255)
>    [junit4]   2>        at org.apache.lucene.index.SegmentMerger.merge(SegmentMerger.java:133)
>    [junit4]   2>        at org.apache.lucene.index.IndexWriter.mergeMiddle(IndexWriter.java:4173)
>    [junit4]   2>        at org.apache.lucene.index.IndexWriter.merge(IndexWriter.java:3768)
>    [junit4]   2>        at org.apache.lucene.index.ConcurrentMergeScheduler.doMerge(ConcurrentMergeScheduler.java:405)
>    [junit4]   2>        at org.apache.lucene.index.ConcurrentMergeScheduler$MergeThread.run(ConcurrentMergeScheduler.java:482)
>    [junit4]   2>
>    [junit4]   2> nov 11, 2014 11:41:23 PM com.carrotsearch.randomizedtesting.RandomizedRunner$QueueUncaughtExceptionsHandler uncaughtException
>    [junit4]   2> WARNING: Uncaught exception in thread: Thread[Lucene Merge Thread #33,6,TGRP-TestCompressingTermVectorsFormat]
>    [junit4]   2> org.apache.lucene.index.MergePolicy$MergeException: java.lang.NullPointerException
>    [junit4]   2>        at __randomizedtesting.SeedInfo.seed([3C4832D329799907]:0)
>    [junit4]   2>        at org.apache.lucene.index.ConcurrentMergeScheduler.handleMergeException(ConcurrentMergeScheduler.java:545)
>    [junit4]   2>        at org.apache.lucene.index.ConcurrentMergeScheduler$MergeThread.run(ConcurrentMergeScheduler.java:518)
>    [junit4]   2> Caused by: java.lang.NullPointerException
>    [junit4]   2>        at org.apache.lucene.codecs.lucene49.Lucene49NormsConsumer$NormMap.getOrd(Lucene49NormsConsumer.java:249)
>    [junit4]   2>        at org.apache.lucene.codecs.lucene49.Lucene49NormsConsumer.addNumericField(Lucene49NormsConsumer.java:150)
>    [junit4]   2>        at org.apache.lucene.codecs.DocValuesConsumer.mergeNumericField(DocValuesConsumer.java:129)
>    [junit4]   2>        at org.apache.lucene.index.SegmentMerger.mergeNorms(SegmentMerger.java:255)
>    [junit4]   2>        at org.apache.lucene.index.SegmentMerger.merge(SegmentMerger.java:133)
>    [junit4]   2>        at org.apache.lucene.index.IndexWriter.mergeMiddle(IndexWriter.java:4173)
>    [junit4]   2>        at org.apache.lucene.index.IndexWriter.merge(IndexWriter.java:3768)
>    [junit4]   2>        at org.apache.lucene.index.ConcurrentMergeScheduler.doMerge(ConcurrentMergeScheduler.java:405)
>    [junit4]   2>        at org.apache.lucene.index.ConcurrentMergeScheduler$MergeThread.run(ConcurrentMergeScheduler.java:482)
>    [junit4]   2>
>    [junit4]   2> nov 11, 2014 11:41:24 PM com.carrotsearch.randomizedtesting.RandomizedRunner$QueueUncaughtExceptionsHandler uncaughtException
>    [junit4]   2> WARNING: Uncaught exception in thread: Thread[Lucene Merge Thread #34,6,TGRP-TestCompressingTermVectorsFormat]
>    [junit4]   2> org.apache.lucene.index.MergePolicy$MergeException: java.lang.NullPointerException
>    [junit4]   2>        at __randomizedtesting.SeedInfo.seed([3C4832D329799907]:0)
>    [junit4]   2>        at org.apache.lucene.index.ConcurrentMergeScheduler.handleMergeException(ConcurrentMergeScheduler.java:545)
>    [junit4]   2>        at org.apache.lucene.index.ConcurrentMergeScheduler$MergeThread.run(ConcurrentMergeScheduler.java:518)
>    [junit4]   2> Caused by: java.lang.NullPointerException
>    [junit4]   2>        at org.apache.lucene.codecs.lucene49.Lucene49NormsConsumer$NormMap.getOrd(Lucene49NormsConsumer.java:249)
>    [junit4]   2>        at org.apache.lucene.codecs.lucene49.Lucene49NormsConsumer.addNumericField(Lucene49NormsConsumer.java:150)
>    [junit4]   2>        at org.apache.lucene.codecs.DocValuesConsumer.mergeNumericField(DocValuesConsumer.java:129)
>    [junit4]   2>        at org.apache.lucene.index.SegmentMerger.mergeNorms(SegmentMerger.java:255)
>    [junit4]   2>        at org.apache.lucene.index.SegmentMerger.merge(SegmentMerger.java:133)
>    [junit4]   2>        at org.apache.lucene.index.IndexWriter.mergeMiddle(IndexWriter.java:4173)
>    [junit4]   2>        at org.apache.lucene.index.IndexWriter.merge(IndexWriter.java:3768)
>    [junit4]   2>        at org.apache.lucene.index.ConcurrentMergeScheduler.doMerge(ConcurrentMergeScheduler.java:405)
>    [junit4]   2>        at org.apache.lucene.index.ConcurrentMergeScheduler$MergeThread.run(ConcurrentMergeScheduler.java:482)
>    [junit4]   2>
>    [junit4]   2> nov 11, 2014 11:41:24 PM com.carrotsearch.randomizedtesting.RandomizedRunner$QueueUncaughtExceptionsHandler uncaughtException
>    [junit4]   2> WARNING: Uncaught exception in thread: Thread[Lucene Merge Thread #19,6,TGRP-TestCompressingTermVectorsFormat]
>    [junit4]   2> org.apache.lucene.index.MergePolicy$MergeException: java.lang.NullPointerException
>    [junit4]   2>        at __randomizedtesting.SeedInfo.seed([3C4832D329799907]:0)
>    [junit4]   2>        at org.apache.lucene.index.ConcurrentMergeScheduler.handleMergeException(ConcurrentMergeScheduler.java:545)
>    [junit4]   2>        at org.apache.lucene.index.ConcurrentMergeScheduler$MergeThread.run(ConcurrentMergeScheduler.java:518)
>    [junit4]   2> Caused by: java.lang.NullPointerException
>    [junit4]   2>        at org.apache.lucene.codecs.lucene49.Lucene49NormsConsumer$NormMap.getOrd(Lucene49NormsConsumer.java:249)
>    [junit4]   2>        at org.apache.lucene.codecs.lucene49.Lucene49NormsConsumer.addNumericField(Lucene49NormsConsumer.java:150)
>    [junit4]   2>        at org.apache.lucene.codecs.DocValuesConsumer.mergeNumericField(DocValuesConsumer.java:129)
>    [junit4]   2>        at org.apache.lucene.index.SegmentMerger.mergeNorms(SegmentMerger.java:255)
>    [junit4]   2>        at org.apache.lucene.index.SegmentMerger.merge(SegmentMerger.java:133)
>    [junit4]   2>        at org.apache.lucene.index.IndexWriter.mergeMiddle(IndexWriter.java:4173)
>    [junit4]   2>        at org.apache.lucene.index.IndexWriter.merge(IndexWriter.java:3768)
>    [junit4]   2>        at org.apache.lucene.index.ConcurrentMergeScheduler.doMerge(ConcurrentMergeScheduler.java:405)
>    [junit4]   2>        at org.apache.lucene.index.ConcurrentMergeScheduler$MergeThread.run(ConcurrentMergeScheduler.java:482)
>    [junit4]   2>
>    [junit4]   2> nov 11, 2014 11:41:24 PM com.carrotsearch.randomizedtesting.RandomizedRunner$QueueUncaughtExceptionsHandler uncaughtException
>    [junit4]   2> WARNING: Uncaught exception in thread: Thread[Lucene Merge Thread #35,6,TGRP-TestCompressingTermVectorsFormat]
>    [junit4]   2> org.apache.lucene.index.MergePolicy$MergeException: java.lang.NullPointerException
>    [junit4]   2>        at __randomizedtesting.SeedInfo.seed([3C4832D329799907]:0)
>    [junit4]   2>        at org.apache.lucene.index.ConcurrentMergeScheduler.handleMergeException(ConcurrentMergeScheduler.java:545)
>    [junit4]   2>        at org.apache.lucene.index.ConcurrentMergeScheduler$MergeThread.run(ConcurrentMergeScheduler.java:518)
>    [junit4]   2> Caused by: java.lang.NullPointerException
>    [junit4]   2>        at org.apache.lucene.codecs.lucene49.Lucene49NormsConsumer$NormMap.getOrd(Lucene49NormsConsumer.java:249)
>    [junit4]   2>        at org.apache.lucene.codecs.lucene49.Lucene49NormsConsumer.addNumericField(Lucene49NormsConsumer.java:150)
>    [junit4]   2>        at org.apache.lucene.codecs.DocValuesConsumer.mergeNumericField(DocValuesConsumer.java:129)
>    [junit4]   2>        at org.apache.lucene.index.SegmentMerger.mergeNorms(SegmentMerger.java:255)
>    [junit4]   2>        at org.apache.lucene.index.SegmentMerger.merge(SegmentMerger.java:133)
>    [junit4]   2>        at org.apache.lucene.index.IndexWriter.mergeMiddle(IndexWriter.java:4173)
>    [junit4]   2>        at org.apache.lucene.index.IndexWriter.merge(IndexWriter.java:3768)
>    [junit4]   2>        at org.apache.lucene.index.ConcurrentMergeScheduler.doMerge(ConcurrentMergeScheduler.java:405)
>    [junit4]   2>        at org.apache.lucene.index.ConcurrentMergeScheduler$MergeThread.run(ConcurrentMergeScheduler.java:482)
>    [junit4]   2>
>    [junit4]   2> nov 11, 2014 11:41:25 PM com.carrotsearch.randomizedtesting.RandomizedRunner$QueueUncaughtExceptionsHandler uncaughtException
>    [junit4]   2> WARNING: Uncaught exception in thread: Thread[Lucene Merge Thread #36,6,TGRP-TestCompressingTermVectorsFormat]
>    [junit4]   2> org.apache.lucene.index.MergePolicy$MergeException: java.lang.NullPointerException
>    [junit4]   2>        at __randomizedtesting.SeedInfo.seed([3C4832D329799907]:0)
>    [junit4]   2>        at org.apache.lucene.index.ConcurrentMergeScheduler.handleMergeException(ConcurrentMergeScheduler.java:545)
>    [junit4]   2>        at org.apache.lucene.index.ConcurrentMergeScheduler$MergeThread.run(ConcurrentMergeScheduler.java:518)
>    [junit4]   2> Caused by: java.lang.NullPointerException
>    [junit4]   2>        at org.apache.lucene.codecs.lucene49.Lucene49NormsConsumer$NormMap.getOrd(Lucene49NormsConsumer.java:249)
>    [junit4]   2>        at org.apache.lucene.codecs.lucene49.Lucene49NormsConsumer.addNumericField(Lucene49NormsConsumer.java:150)
>    [junit4]   2>        at org.apache.lucene.codecs.DocValuesConsumer.mergeNumericField(DocValuesConsumer.java:129)
>    [junit4]   2>        at org.apache.lucene.index.SegmentMerger.mergeNorms(SegmentMerger.java:255)
>    [junit4]   2>        at org.apache.lucene.index.SegmentMerger.merge(SegmentMerger.java:133)
>    [junit4]   2>        at org.apache.lucene.index.IndexWriter.mergeMiddle(IndexWriter.java:4173)
>    [junit4]   2>        at org.apache.lucene.index.IndexWriter.merge(IndexWriter.java:3768)
>    [junit4]   2>        at org.apache.lucene.index.ConcurrentMergeScheduler.doMerge(ConcurrentMergeScheduler.java:405)
>    [junit4]   2>        at org.apache.lucene.index.ConcurrentMergeScheduler$MergeThread.run(ConcurrentMergeScheduler.java:482)
>    [junit4]   2>
>    [junit4]   2> nov 11, 2014 11:41:25 PM com.carrotsearch.randomizedtesting.RandomizedRunner$QueueUncaughtExceptionsHandler uncaughtException
>    [junit4]   2> WARNING: Uncaught exception in thread: Thread[Lucene Merge Thread #38,6,TGRP-TestCompressingTermVectorsFormat]
>    [junit4]   2> org.apache.lucene.index.MergePolicy$MergeException: java.lang.NullPointerException
>    [junit4]   2>        at __randomizedtesting.SeedInfo.seed([3C4832D329799907]:0)
>    [junit4]   2>        at org.apache.lucene.index.ConcurrentMergeScheduler.handleMergeException(ConcurrentMergeScheduler.java:545)
>    [junit4]   2>        at org.apache.lucene.index.ConcurrentMergeScheduler$MergeThread.run(ConcurrentMergeScheduler.java:518)
>    [junit4]   2> Caused by: java.lang.NullPointerException
>    [junit4]   2>        at org.apache.lucene.codecs.lucene49.Lucene49NormsConsumer$NormMap.getOrd(Lucene49NormsConsumer.java:249)
>    [junit4]   2>        at org.apache.lucene.codecs.lucene49.Lucene49NormsConsumer.addNumericField(Lucene49NormsConsumer.java:150)
>    [junit4]   2>        at org.apache.lucene.codecs.DocValuesConsumer.mergeNumericField(DocValuesConsumer.java:129)
>    [junit4]   2>        at org.apache.lucene.index.SegmentMerger.mergeNorms(SegmentMerger.java:255)
>    [junit4]   2>        at org.apache.lucene.index.SegmentMerger.merge(SegmentMerger.java:133)
>    [junit4]   2>        at org.apache.lucene.index.IndexWriter.mergeMiddle(IndexWriter.java:4173)
>    [junit4]   2>        at org.apache.lucene.index.IndexWriter.merge(IndexWriter.java:3768)
>    [junit4]   2>        at org.apache.lucene.index.ConcurrentMergeScheduler.doMerge(ConcurrentMergeScheduler.java:405)
>    [junit4]   2>        at org.apache.lucene.index.ConcurrentMergeScheduler$MergeThread.run(ConcurrentMergeScheduler.java:482)
>    [junit4]   2>
>    [junit4]   2> nov 11, 2014 11:41:25 PM com.carrotsearch.randomizedtesting.RandomizedRunner$QueueUncaughtExceptionsHandler uncaughtException
>    [junit4]   2> WARNING: Uncaught exception in thread: Thread[Lucene Merge Thread #39,6,TGRP-TestCompressingTermVectorsFormat]
>    [junit4]   2> org.apache.lucene.index.MergePolicy$MergeException: java.lang.NullPointerException
>    [junit4]   2>        at __randomizedtesting.SeedInfo.seed([3C4832D329799907]:0)
>    [junit4]   2>        at org.apache.lucene.index.ConcurrentMergeScheduler.handleMergeException(ConcurrentMergeScheduler.java:545)
>    [junit4]   2>        at org.apache.lucene.index.ConcurrentMergeScheduler$MergeThread.run(ConcurrentMergeScheduler.java:518)
>    [junit4]   2> Caused by: java.lang.NullPointerException
>    [junit4]   2>        at org.apache.lucene.codecs.lucene49.Lucene49NormsConsumer$NormMap.getOrd(Lucene49NormsConsumer.java:249)
>    [junit4]   2>        at org.apache.lucene.codecs.lucene49.Lucene49NormsConsumer.addNumericField(Lucene49NormsConsumer.java:150)
>    [junit4]   2>        at org.apache.lucene.codecs.DocValuesConsumer.mergeNumericField(DocValuesConsumer.java:129)
>    [junit4]   2>        at org.apache.lucene.index.SegmentMerger.mergeNorms(SegmentMerger.java:255)
>    [junit4]   2>        at org.apache.lucene.index.SegmentMerger.merge(SegmentMerger.java:133)
>    [junit4]   2>        at org.apache.lucene.index.IndexWriter.mergeMiddle(IndexWriter.java:4173)
>    [junit4]   2>        at org.apache.lucene.index.IndexWriter.merge(IndexWriter.java:3768)
>    [junit4]   2>        at org.apache.lucene.index.ConcurrentMergeScheduler.doMerge(ConcurrentMergeScheduler.java:405)
>    [junit4]   2>        at org.apache.lucene.index.ConcurrentMergeScheduler$MergeThread.run(ConcurrentMergeScheduler.java:482)
>    [junit4]   2>
>    [junit4]   2> nov 11, 2014 11:41:26 PM com.carrotsearch.randomizedtesting.RandomizedRunner$QueueUncaughtExceptionsHandler uncaughtException
>    [junit4]   2> WARNING: Uncaught exception in thread: Thread[Lucene Merge Thread #40,6,TGRP-TestCompressingTermVectorsFormat]
>    [junit4]   2> org.apache.lucene.index.MergePolicy$MergeException: java.lang.NullPointerException
>    [junit4]   2>        at __randomizedtesting.SeedInfo.seed([3C4832D329799907]:0)
>    [junit4]   2>        at org.apache.lucene.index.ConcurrentMergeScheduler.handleMergeException(ConcurrentMergeScheduler.java:545)
>    [junit4]   2>        at org.apache.lucene.index.ConcurrentMergeScheduler$MergeThread.run(ConcurrentMergeScheduler.java:518)
>    [junit4]   2> Caused by: java.lang.NullPointerException
>    [junit4]   2>        at org.apache.lucene.codecs.lucene49.Lucene49NormsConsumer$NormMap.getOrd(Lucene49NormsConsumer.java:249)
>    [junit4]   2>        at org.apache.lucene.codecs.lucene49.Lucene49NormsConsumer.addNumericField(Lucene49NormsConsumer.java:150)
>    [junit4]   2>        at org.apache.lucene.codecs.DocValuesConsumer.mergeNumericField(DocValuesConsumer.java:129)
>    [junit4]   2>        at org.apache.lucene.index.SegmentMerger.mergeNorms(SegmentMerger.java:255)
>    [junit4]   2>        at org.apache.lucene.index.SegmentMerger.merge(SegmentMerger.java:133)
>    [junit4]   2>        at org.apache.lucene.index.IndexWriter.mergeMiddle(IndexWriter.java:4173)
>    [junit4]   2>        at org.apache.lucene.index.IndexWriter.merge(IndexWriter.java:3768)
>    [junit4]   2>        at org.apache.lucene.index.ConcurrentMergeScheduler.doMerge(ConcurrentMergeScheduler.java:405)
>    [junit4]   2>        at org.apache.lucene.index.ConcurrentMergeScheduler$MergeThread.run(ConcurrentMergeScheduler.java:482)
>    [junit4]   2>
>    [junit4]   2> nov 11, 2014 11:41:26 PM com.carrotsearch.randomizedtesting.RandomizedRunner$QueueUncaughtExceptionsHandler uncaughtException
>    [junit4]   2> WARNING: Uncaught exception in thread: Thread[Lucene Merge Thread #41,6,TGRP-TestCompressingTermVectorsFormat]
>    [junit4]   2> org.apache.lucene.index.MergePolicy$MergeException: java.lang.NullPointerException
>    [junit4]   2>        at __randomizedtesting.SeedInfo.seed([3C4832D329799907]:0)
>    [junit4]   2>        at org.apache.lucene.index.ConcurrentMergeScheduler.handleMergeException(ConcurrentMergeScheduler.java:545)
>    [junit4]   2>        at org.apache.lucene.index.ConcurrentMergeScheduler$MergeThread.run(ConcurrentMergeScheduler.java:518)
>    [junit4]   2> Caused by: java.lang.NullPointerException
>    [junit4]   2>        at org.apache.lucene.codecs.lucene49.Lucene49NormsConsumer$NormMap.getOrd(Lucene49NormsConsumer.java:249)
>    [junit4]   2>        at org.apache.lucene.codecs.lucene49.Lucene49NormsConsumer.addNumericField(Lucene49NormsConsumer.java:150)
>    [junit4]   2>        at org.apache.lucene.codecs.DocValuesConsumer.mergeNumericField(DocValuesConsumer.java:129)
>    [junit4]   2>        at org.apache.lucene.index.SegmentMerger.mergeNorms(SegmentMerger.java:255)
>    [junit4]   2>        at org.apache.lucene.index.SegmentMerger.merge(SegmentMerger.java:133)
>    [junit4]   2>        at org.apache.lucene.index.IndexWriter.mergeMiddle(IndexWriter.java:4173)
>    [junit4]   2>        at org.apache.lucene.index.IndexWriter.merge(IndexWriter.java:3768)
>    [junit4]   2>        at org.apache.lucene.index.ConcurrentMergeScheduler.doMerge(ConcurrentMergeScheduler.java:405)
>    [junit4]   2>        at org.apache.lucene.index.ConcurrentMergeScheduler$MergeThread.run(ConcurrentMergeScheduler.java:482)
>    [junit4]   2>
>    [junit4]   2> nov 11, 2014 11:41:26 PM com.carrotsearch.randomizedtesting.RandomizedRunner$QueueUncaughtExceptionsHandler uncaughtException
>    [junit4]   2> WARNING: Uncaught exception in thread: Thread[Lucene Merge Thread #42,6,TGRP-TestCompressingTermVectorsFormat]
>    [junit4]   2> org.apache.lucene.index.MergePolicy$MergeException: java.lang.NullPointerException
>    [junit4]   2>        at __randomizedtesting.SeedInfo.seed([3C4832D329799907]:0)
>    [junit4]   2>        at org.apache.lucene.index.ConcurrentMergeScheduler.handleMergeException(ConcurrentMergeScheduler.java:545)
>    [junit4]   2>        at org.apache.lucene.index.ConcurrentMergeScheduler$MergeThread.run(ConcurrentMergeScheduler.java:518)
>    [junit4]   2> Caused by: java.lang.NullPointerException
>    [junit4]   2>        at org.apache.lucene.codecs.lucene49.Lucene49NormsConsumer$NormMap.getOrd(Lucene49NormsConsumer.java:249)
>    [junit4]   2>        at org.apache.lucene.codecs.lucene49.Lucene49NormsConsumer.addNumericField(Lucene49NormsConsumer.java:150)
>    [junit4]   2>        at org.apache.lucene.codecs.DocValuesConsumer.mergeNumericField(DocValuesConsumer.java:129)
>    [junit4]   2>        at org.apache.lucene.index.SegmentMerger.mergeNorms(SegmentMerger.java:255)
>    [junit4]   2>        at org.apache.lucene.index.SegmentMerger.merge(SegmentMerger.java:133)
>    [junit4]   2>        at org.apache.lucene.index.IndexWriter.mergeMiddle(IndexWriter.java:4173)
>    [junit4]   2>        at org.apache.lucene.index.IndexWriter.merge(IndexWriter.java:3768)
>    [junit4]   2>        at org.apache.lucene.index.ConcurrentMergeScheduler.doMerge(ConcurrentMergeScheduler.java:405)
>    [junit4]   2>        at org.apache.lucene.index.ConcurrentMergeScheduler$MergeThread.run(ConcurrentMergeScheduler.java:482)
>    [junit4]   2>
>    [junit4]   2> nov 11, 2014 11:41:27 PM com.carrotsearch.randomizedtesting.RandomizedRunner$QueueUncaughtExceptionsHandler uncaughtException
>    [junit4]   2> WARNING: Uncaught exception in thread: Thread[Lucene Merge Thread #43,6,TGRP-TestCompressingTermVectorsFormat]
>    [junit4]   2> org.apache.lucene.index.MergePolicy$MergeException: java.lang.NullPointerException
>    [junit4]   2>        at __randomizedtesting.SeedInfo.seed([3C4832D329
>
> [...truncated too long message...]
>
> d(Lucene49NormsConsumer.java:249)
>    [junit4]    >        at org.apache.lucene.codecs.lucene49.Lucene49NormsConsumer.addNumericField(Lucene49NormsConsumer.java:150)
>    [junit4]    >        at org.apache.lucene.codecs.DocValuesConsumer.mergeNumericField(DocValuesConsumer.java:129)
>    [junit4]    >        at org.apache.lucene.index.SegmentMerger.mergeNorms(SegmentMerger.java:255)
>    [junit4]    >        at org.apache.lucene.index.SegmentMerger.merge(SegmentMerger.java:133)
>    [junit4]    >        at org.apache.lucene.index.IndexWriter.mergeMiddle(IndexWriter.java:4173)
>    [junit4]    >        at org.apache.lucene.index.IndexWriter.merge(IndexWriter.java:3768)
>    [junit4]    >        at org.apache.lucene.index.ConcurrentMergeScheduler.doMerge(ConcurrentMergeScheduler.java:405)
>    [junit4]    >        at org.apache.lucene.index.ConcurrentMergeScheduler$MergeThread.run(ConcurrentMergeScheduler.java:482)Throwable #382: com.carrotsearch.randomizedtesting.UncaughtExceptionError: Captured an uncaught exception in thread: Thread[id=520, name=Lucene Merge Thread #382, state=RUNNABLE, group=TGRP-TestCompressingTermVectorsFormat]
>    [junit4]    > Caused by: org.apache.lucene.index.MergePolicy$MergeException: java.lang.NullPointerException
>    [junit4]    >        at __randomizedtesting.SeedInfo.seed([3C4832D329799907]:0)
>    [junit4]    >        at org.apache.lucene.index.ConcurrentMergeScheduler.handleMergeException(ConcurrentMergeScheduler.java:545)
>    [junit4]    >        at org.apache.lucene.index.ConcurrentMergeScheduler$MergeThread.run(ConcurrentMergeScheduler.java:518)
>    [junit4]    > Caused by: java.lang.NullPointerException
>    [junit4]    >        at org.apache.lucene.codecs.lucene49.Lucene49NormsConsumer$NormMap.getOrd(Lucene49NormsConsumer.java:249)
>    [junit4]    >        at org.apache.lucene.codecs.lucene49.Lucene49NormsConsumer.addNumericField(Lucene49NormsConsumer.java:150)
>    [junit4]    >        at org.apache.lucene.codecs.DocValuesConsumer.mergeNumericField(DocValuesConsumer.java:129)
>    [junit4]    >        at org.apache.lucene.index.SegmentMerger.mergeNorms(SegmentMerger.java:255)
>    [junit4]    >        at org.apache.lucene.index.SegmentMerger.merge(SegmentMerger.java:133)
>    [junit4]    >        at org.apache.lucene.index.IndexWriter.mergeMiddle(IndexWriter.java:4173)
>    [junit4]    >        at org.apache.lucene.index.IndexWriter.merge(IndexWriter.java:3768)
>    [junit4]    >        at org.apache.lucene.index.ConcurrentMergeScheduler.doMerge(ConcurrentMergeScheduler.java:405)
>    [junit4]    >        at org.apache.lucene.index.ConcurrentMergeScheduler$MergeThread.run(ConcurrentMergeScheduler.java:482)Throwable #383: com.carrotsearch.randomizedtesting.UncaughtExceptionError: Captured an uncaught exception in thread: Thread[id=521, name=Lucene Merge Thread #383, state=RUNNABLE, group=TGRP-TestCompressingTermVectorsFormat]
>    [junit4]    > Caused by: org.apache.lucene.index.MergePolicy$MergeException: java.lang.NullPointerException
>    [junit4]    >        at __randomizedtesting.SeedInfo.seed([3C4832D329799907]:0)
>    [junit4]    >        at org.apache.lucene.index.ConcurrentMergeScheduler.handleMergeException(ConcurrentMergeScheduler.java:545)
>    [junit4]    >        at org.apache.lucene.index.ConcurrentMergeScheduler$MergeThread.run(ConcurrentMergeScheduler.java:518)
>    [junit4]    > Caused by: java.lang.NullPointerException
>    [junit4]    >        at org.apache.lucene.codecs.lucene49.Lucene49NormsConsumer$NormMap.getOrd(Lucene49NormsConsumer.java:249)
>    [junit4]    >        at org.apache.lucene.codecs.lucene49.Lucene49NormsConsumer.addNumericField(Lucene49NormsConsumer.java:150)
>    [junit4]    >        at org.apache.lucene.codecs.DocValuesConsumer.mergeNumericField(DocValuesConsumer.java:129)
>    [junit4]    >        at org.apache.lucene.index.SegmentMerger.mergeNorms(SegmentMerger.java:255)
>    [junit4]    >        at org.apache.lucene.index.SegmentMerger.merge(SegmentMerger.java:133)
>    [junit4]    >        at org.apache.lucene.index.IndexWriter.mergeMiddle(IndexWriter.java:4173)
>    [junit4]    >        at org.apache.lucene.index.IndexWriter.merge(IndexWriter.java:3768)
>    [junit4]    >        at org.apache.lucene.index.ConcurrentMergeScheduler.doMerge(ConcurrentMergeScheduler.java:405)
>    [junit4]    >        at org.apache.lucene.index.ConcurrentMergeScheduler$MergeThread.run(ConcurrentMergeScheduler.java:482)Throwable #384: com.carrotsearch.randomizedtesting.UncaughtExceptionError: Captured an uncaught exception in thread: Thread[id=504, name=Lucene Merge Thread #366, state=RUNNABLE, group=TGRP-TestCompressingTermVectorsFormat]
>    [junit4]    > Caused by: org.apache.lucene.index.MergePolicy$MergeException: java.lang.NullPointerException
>    [junit4]    >        at __randomizedtesting.SeedInfo.seed([3C4832D329799907]:0)
>    [junit4]    >        at org.apache.lucene.index.ConcurrentMergeScheduler.handleMergeException(ConcurrentMergeScheduler.java:545)
>    [junit4]    >        at org.apache.lucene.index.ConcurrentMergeScheduler$MergeThread.run(ConcurrentMergeScheduler.java:518)
>    [junit4]    > Caused by: java.lang.NullPointerException
>    [junit4]    >        at org.apache.lucene.codecs.lucene49.Lucene49NormsConsumer$NormMap.getOrd(Lucene49NormsConsumer.java:249)
>    [junit4]    >        at org.apache.lucene.codecs.lucene49.Lucene49NormsConsumer.addNumericField(Lucene49NormsConsumer.java:150)
>    [junit4]    >        at org.apache.lucene.codecs.DocValuesConsumer.mergeNumericField(DocValuesConsumer.java:129)
>    [junit4]    >        at org.apache.lucene.index.SegmentMerger.mergeNorms(SegmentMerger.java:255)
>    [junit4]    >        at org.apache.lucene.index.SegmentMerger.merge(SegmentMerger.java:133)
>    [junit4]    >        at org.apache.lucene.index.IndexWriter.mergeMiddle(IndexWriter.java:4173)
>    [junit4]    >        at org.apache.lucene.index.IndexWriter.merge(IndexWriter.java:3768)
>    [junit4]    >        at org.apache.lucene.index.ConcurrentMergeScheduler.doMerge(ConcurrentMergeScheduler.java:405)
>    [junit4]    >        at org.apache.lucene.index.ConcurrentMergeScheduler$MergeThread.run(ConcurrentMergeScheduler.java:482)Throwable #385: com.carrotsearch.randomizedtesting.UncaughtExceptionError: Captured an uncaught exception in thread: Thread[id=522, name=Lucene Merge Thread #384, state=RUNNABLE, group=TGRP-TestCompressingTermVectorsFormat]
>    [junit4]    > Caused by: org.apache.lucene.index.MergePolicy$MergeException: java.lang.NullPointerException
>    [junit4]    >        at __randomizedtesting.SeedInfo.seed([3C4832D329799907]:0)
>    [junit4]    >        at org.apache.lucene.index.ConcurrentMergeScheduler.handleMergeException(ConcurrentMergeScheduler.java:545)
>    [junit4]    >        at org.apache.lucene.index.ConcurrentMergeScheduler$MergeThread.run(ConcurrentMergeScheduler.java:518)
>    [junit4]    > Caused by: java.lang.NullPointerException
>    [junit4]    >        at org.apache.lucene.codecs.lucene49.Lucene49NormsConsumer$NormMap.getOrd(Lucene49NormsConsumer.java:249)
>    [junit4]    >        at org.apache.lucene.codecs.lucene49.Lucene49NormsConsumer.addNumericField(Lucene49NormsConsumer.java:150)
>    [junit4]    >        at org.apache.lucene.codecs.DocValuesConsumer.mergeNumericField(DocValuesConsumer.java:129)
>    [junit4]    >        at org.apache.lucene.index.SegmentMerger.mergeNorms(SegmentMerger.java:255)
>    [junit4]    >        at org.apache.lucene.index.SegmentMerger.merge(SegmentMerger.java:133)
>    [junit4]    >        at org.apache.lucene.index.IndexWriter.mergeMiddle(IndexWriter.java:4173)
>    [junit4]    >        at org.apache.lucene.index.IndexWriter.merge(IndexWriter.java:3768)
>    [junit4]    >        at org.apache.lucene.index.ConcurrentMergeScheduler.doMerge(ConcurrentMergeScheduler.java:405)
>    [junit4]    >        at org.apache.lucene.index.ConcurrentMergeScheduler$MergeThread.run(ConcurrentMergeScheduler.java:482)
>    [junit4]   2> NOTE: leaving temporary files on disk at: /mnt/ssd/jenkins/workspace/Lucene-Solr-4.10-Linux/lucene/build/core/test/J0/./lucene.codecs.compressing.TestCompressingTermVectorsFormat-3C4832D329799907-001
>    [junit4]   2> NOTE: test params are: codec=Lucene46, sim=DefaultSimilarity, locale=nl_NL_PREEURO, timezone=Antarctica/DumontDUrville
>    [junit4]   2> NOTE: Linux 3.13.0-39-generic amd64/IBM Corporation 1.7.0 (64-bit)/cpus=8,threads=1,free=70388520,total=244121600
>    [junit4]   2> NOTE: All tests run in this JVM: [TestPriorityQueue, TestCharTermAttributeImpl, TestSortRescorer, TestWorstCaseTestBehavior, TestFilterIterator, TestLucene40PostingsReader, TestPagedBytes, TestCompoundFile, TestSimpleExplanations, TestDoc, TestDocTermOrdsRewriteMethod, TestReuseDocsEnum, TestConcurrentMergeScheduler, TestSloppyPhraseQuery, TestIsCurrent, TestSearch, TestTermInfosReaderIndex, TestLookaheadTokenFilter, TestCrash, TestTryDelete, TestTopScoreDocCollector, TestDocIdSet, TestExplanations, TestCompressingTermVectorsFormat]
>    [junit4] Completed on J0 in 268.96s, 50 tests, 2 errors <<< FAILURES!
>
> [...truncated 1335 lines...]
> BUILD FAILED
> /mnt/ssd/jenkins/workspace/Lucene-Solr-4.10-Linux/build.xml:474: The following error occurred while executing this line:
> /mnt/ssd/jenkins/workspace/Lucene-Solr-4.10-Linux/build.xml:467: The following error occurred while executing this line:
> /mnt/ssd/jenkins/workspace/Lucene-Solr-4.10-Linux/build.xml:45: The following error occurred while executing this line:
> /mnt/ssd/jenkins/workspace/Lucene-Solr-4.10-Linux/extra-targets.xml:37: The following error occurred while executing this line:
> /mnt/ssd/jenkins/workspace/Lucene-Solr-4.10-Linux/lucene/build.xml:49: The following error occurred while executing this line:
> /mnt/ssd/jenkins/workspace/Lucene-Solr-4.10-Linux/lucene/common-build.xml:1350: The following error occurred while executing this line:
> /mnt/ssd/jenkins/workspace/Lucene-Solr-4.10-Linux/lucene/common-build.xml:970: There were test failures: 420 suites, 3739 tests, 3 errors, 161 ignored (150 assumptions)
>
> Total time: 29 minutes 2 seconds
> Build step 'Invoke Ant' marked build as failure
> [description-setter] Description set: Java: 64bit/ibm-j9-jdk7 -Xjit:exclude={org/apache/lucene/util/fst/FST.pack(IIF)Lorg/apache/lucene/util/fst/FST;} (asserts: false)
> Archiving artifacts
> Recording test results
> Email was triggered for: Failure - Any
> Sending email for trigger: Failure - Any
>
>
>
>
> ---------------------------------------------------------------------
> To unsubscribe, e-mail: dev-unsubscribe@lucene.apache.org
> For additional commands, e-mail: dev-help@lucene.apache.org

---------------------------------------------------------------------
To unsubscribe, e-mail: dev-unsubscribe@lucene.apache.org
For additional commands, e-mail: dev-help@lucene.apache.org


[JENKINS] Lucene-Solr-4.10-Linux (64bit/ibm-j9-jdk7) - Build # 76 - Still Failing!

Posted by Policeman Jenkins Server <je...@thetaphi.de>.
Build: http://jenkins.thetaphi.de/job/Lucene-Solr-4.10-Linux/76/
Java: 64bit/ibm-j9-jdk7 -Xjit:exclude={org/apache/lucene/util/fst/FST.pack(IIF)Lorg/apache/lucene/util/fst/FST;} (asserts: false)

3 tests failed.
FAILED:  org.apache.lucene.codecs.compressing.TestCompressingTermVectorsFormat.testRamBytesUsed {#0 seed=[3C4832D329799907:CEEB2093E3068651]}

Error Message:


Stack Trace:
java.lang.NullPointerException
	at __randomizedtesting.SeedInfo.seed([3C4832D329799907:CEEB2093E3068651]:0)
	at org.apache.lucene.codecs.lucene49.Lucene49NormsConsumer$NormMap.getOrd(Lucene49NormsConsumer.java:249)
	at org.apache.lucene.codecs.lucene49.Lucene49NormsConsumer.addNumericField(Lucene49NormsConsumer.java:150)
	at org.apache.lucene.codecs.DocValuesConsumer.mergeNumericField(DocValuesConsumer.java:129)
	at org.apache.lucene.index.SegmentMerger.mergeNorms(SegmentMerger.java:255)
	at org.apache.lucene.index.SegmentMerger.merge(SegmentMerger.java:133)
	at org.apache.lucene.index.IndexWriter.mergeMiddle(IndexWriter.java:4173)
	at org.apache.lucene.index.IndexWriter.merge(IndexWriter.java:3768)
	at org.apache.lucene.index.SerialMergeScheduler.merge(SerialMergeScheduler.java:40)
	at org.apache.lucene.index.IndexWriter.maybeMerge(IndexWriter.java:1970)
	at org.apache.lucene.index.IndexWriter.forceMerge(IndexWriter.java:1797)
	at org.apache.lucene.index.IndexWriter.forceMerge(IndexWriter.java:1754)
	at org.apache.lucene.index.BaseIndexFileFormatTestCase.testRamBytesUsed(BaseIndexFileFormatTestCase.java:228)
	at org.apache.lucene.index.BaseTermVectorsFormatTestCase.testRamBytesUsed(BaseTermVectorsFormatTestCase.java:61)
	at sun.reflect.NativeMethodAccessorImpl.invoke0(Native Method)
	at sun.reflect.NativeMethodAccessorImpl.invoke(NativeMethodAccessorImpl.java:94)
	at sun.reflect.DelegatingMethodAccessorImpl.invoke(DelegatingMethodAccessorImpl.java:55)
	at java.lang.reflect.Method.invoke(Method.java:619)
	at com.carrotsearch.randomizedtesting.RandomizedRunner.invoke(RandomizedRunner.java:1618)
	at com.carrotsearch.randomizedtesting.RandomizedRunner$6.evaluate(RandomizedRunner.java:827)
	at com.carrotsearch.randomizedtesting.RandomizedRunner$7.evaluate(RandomizedRunner.java:863)
	at com.carrotsearch.randomizedtesting.RandomizedRunner$8.evaluate(RandomizedRunner.java:877)
	at org.apache.lucene.util.TestRuleSetupTeardownChained$1.evaluate(TestRuleSetupTeardownChained.java:50)
	at org.apache.lucene.util.TestRuleFieldCacheSanity$1.evaluate(TestRuleFieldCacheSanity.java:51)
	at org.apache.lucene.util.AbstractBeforeAfterRule$1.evaluate(AbstractBeforeAfterRule.java:46)
	at com.carrotsearch.randomizedtesting.rules.SystemPropertiesInvariantRule$1.evaluate(SystemPropertiesInvariantRule.java:55)
	at org.apache.lucene.util.TestRuleThreadAndTestName$1.evaluate(TestRuleThreadAndTestName.java:49)
	at org.apache.lucene.util.TestRuleIgnoreAfterMaxFailures$1.evaluate(TestRuleIgnoreAfterMaxFailures.java:65)
	at org.apache.lucene.util.TestRuleMarkFailure$1.evaluate(TestRuleMarkFailure.java:48)
	at com.carrotsearch.randomizedtesting.rules.StatementAdapter.evaluate(StatementAdapter.java:36)
	at com.carrotsearch.randomizedtesting.ThreadLeakControl$StatementRunner.run(ThreadLeakControl.java:365)
	at com.carrotsearch.randomizedtesting.ThreadLeakControl.forkTimeoutingTask(ThreadLeakControl.java:798)
	at com.carrotsearch.randomizedtesting.ThreadLeakControl$3.evaluate(ThreadLeakControl.java:458)
	at com.carrotsearch.randomizedtesting.RandomizedRunner.runSingleTest(RandomizedRunner.java:836)
	at com.carrotsearch.randomizedtesting.RandomizedRunner$3.evaluate(RandomizedRunner.java:738)
	at com.carrotsearch.randomizedtesting.RandomizedRunner$4.evaluate(RandomizedRunner.java:772)
	at com.carrotsearch.randomizedtesting.RandomizedRunner$5.evaluate(RandomizedRunner.java:783)
	at org.apache.lucene.util.AbstractBeforeAfterRule$1.evaluate(AbstractBeforeAfterRule.java:46)
	at org.apache.lucene.util.TestRuleStoreClassName$1.evaluate(TestRuleStoreClassName.java:42)
	at com.carrotsearch.randomizedtesting.rules.SystemPropertiesInvariantRule$1.evaluate(SystemPropertiesInvariantRule.java:55)
	at com.carrotsearch.randomizedtesting.rules.NoShadowingOrOverridesOnMethodsRule$1.evaluate(NoShadowingOrOverridesOnMethodsRule.java:39)
	at com.carrotsearch.randomizedtesting.rules.NoShadowingOrOverridesOnMethodsRule$1.evaluate(NoShadowingOrOverridesOnMethodsRule.java:39)
	at com.carrotsearch.randomizedtesting.rules.StatementAdapter.evaluate(StatementAdapter.java:36)
	at com.carrotsearch.randomizedtesting.rules.StatementAdapter.evaluate(StatementAdapter.java:36)
	at com.carrotsearch.randomizedtesting.rules.StatementAdapter.evaluate(StatementAdapter.java:36)
	at org.apache.lucene.util.TestRuleAssertionsRequired$1.evaluate(TestRuleAssertionsRequired.java:54)
	at org.apache.lucene.util.TestRuleMarkFailure$1.evaluate(TestRuleMarkFailure.java:48)
	at org.apache.lucene.util.TestRuleIgnoreAfterMaxFailures$1.evaluate(TestRuleIgnoreAfterMaxFailures.java:65)
	at org.apache.lucene.util.TestRuleIgnoreTestSuites$1.evaluate(TestRuleIgnoreTestSuites.java:55)
	at com.carrotsearch.randomizedtesting.rules.StatementAdapter.evaluate(StatementAdapter.java:36)
	at com.carrotsearch.randomizedtesting.ThreadLeakControl$StatementRunner.run(ThreadLeakControl.java:365)
	at java.lang.Thread.run(Thread.java:853)


FAILED:  org.apache.lucene.codecs.compressing.TestCompressingTermVectorsFormat.testRamBytesUsed {#1 seed=[3C4832D329799907:7ABD9C6FD7C44D7D]}

Error Message:
Captured an uncaught exception in thread: Thread[id=138, name=Lucene Merge Thread #0, state=RUNNABLE, group=TGRP-TestCompressingTermVectorsFormat]

Stack Trace:
com.carrotsearch.randomizedtesting.UncaughtExceptionError: Captured an uncaught exception in thread: Thread[id=138, name=Lucene Merge Thread #0, state=RUNNABLE, group=TGRP-TestCompressingTermVectorsFormat]
Caused by: org.apache.lucene.index.MergePolicy$MergeException: java.lang.NullPointerException
	at __randomizedtesting.SeedInfo.seed([3C4832D329799907]:0)
	at org.apache.lucene.index.ConcurrentMergeScheduler.handleMergeException(ConcurrentMergeScheduler.java:545)
	at org.apache.lucene.index.ConcurrentMergeScheduler$MergeThread.run(ConcurrentMergeScheduler.java:518)
Caused by: java.lang.NullPointerException
	at org.apache.lucene.codecs.lucene49.Lucene49NormsConsumer$NormMap.getOrd(Lucene49NormsConsumer.java:249)
	at org.apache.lucene.codecs.lucene49.Lucene49NormsConsumer.addNumericField(Lucene49NormsConsumer.java:150)
	at org.apache.lucene.codecs.DocValuesConsumer.mergeNumericField(DocValuesConsumer.java:129)
	at org.apache.lucene.index.SegmentMerger.mergeNorms(SegmentMerger.java:255)
	at org.apache.lucene.index.SegmentMerger.merge(SegmentMerger.java:133)
	at org.apache.lucene.index.IndexWriter.mergeMiddle(IndexWriter.java:4173)
	at org.apache.lucene.index.IndexWriter.merge(IndexWriter.java:3768)
	at org.apache.lucene.index.ConcurrentMergeScheduler.doMerge(ConcurrentMergeScheduler.java:405)
	at org.apache.lucene.index.ConcurrentMergeScheduler$MergeThread.run(ConcurrentMergeScheduler.java:482)


REGRESSION:  org.apache.lucene.index.TestCompoundFile.testListAll

Error Message:


Stack Trace:
java.lang.NullPointerException
	at __randomizedtesting.SeedInfo.seed([3C4832D329799907:29ADD6530019DAFF]:0)
	at org.apache.lucene.codecs.lucene49.Lucene49NormsConsumer$NormMap.add(Lucene49NormsConsumer.java:226)
	at org.apache.lucene.codecs.lucene49.Lucene49NormsConsumer.addNumericField(Lucene49NormsConsumer.java:95)
	at org.apache.lucene.index.NumericDocValuesWriter.flush(NumericDocValuesWriter.java:92)
	at org.apache.lucene.index.DefaultIndexingChain.writeNorms(DefaultIndexingChain.java:207)
	at org.apache.lucene.index.DefaultIndexingChain.flush(DefaultIndexingChain.java:94)
	at org.apache.lucene.index.DocumentsWriterPerThread.flush(DocumentsWriterPerThread.java:439)
	at org.apache.lucene.index.DocumentsWriter.doFlush(DocumentsWriter.java:510)
	at org.apache.lucene.index.DocumentsWriter.flushAllThreads(DocumentsWriter.java:621)
	at org.apache.lucene.index.IndexWriter.prepareCommitInternal(IndexWriter.java:2942)
	at org.apache.lucene.index.IndexWriter.commitInternal(IndexWriter.java:3097)
	at org.apache.lucene.index.IndexWriter.commit(IndexWriter.java:3064)
	at org.apache.lucene.index.RandomIndexWriter.commit(RandomIndexWriter.java:260)
	at org.apache.lucene.index.TestCompoundFile.testListAll(TestCompoundFile.java:825)
	at sun.reflect.NativeMethodAccessorImpl.invoke0(Native Method)
	at sun.reflect.NativeMethodAccessorImpl.invoke(NativeMethodAccessorImpl.java:94)
	at sun.reflect.DelegatingMethodAccessorImpl.invoke(DelegatingMethodAccessorImpl.java:55)
	at java.lang.reflect.Method.invoke(Method.java:619)
	at com.carrotsearch.randomizedtesting.RandomizedRunner.invoke(RandomizedRunner.java:1618)
	at com.carrotsearch.randomizedtesting.RandomizedRunner$6.evaluate(RandomizedRunner.java:827)
	at com.carrotsearch.randomizedtesting.RandomizedRunner$7.evaluate(RandomizedRunner.java:863)
	at com.carrotsearch.randomizedtesting.RandomizedRunner$8.evaluate(RandomizedRunner.java:877)
	at org.apache.lucene.util.TestRuleSetupTeardownChained$1.evaluate(TestRuleSetupTeardownChained.java:50)
	at org.apache.lucene.util.TestRuleFieldCacheSanity$1.evaluate(TestRuleFieldCacheSanity.java:51)
	at org.apache.lucene.util.AbstractBeforeAfterRule$1.evaluate(AbstractBeforeAfterRule.java:46)
	at com.carrotsearch.randomizedtesting.rules.SystemPropertiesInvariantRule$1.evaluate(SystemPropertiesInvariantRule.java:55)
	at org.apache.lucene.util.TestRuleThreadAndTestName$1.evaluate(TestRuleThreadAndTestName.java:49)
	at org.apache.lucene.util.TestRuleIgnoreAfterMaxFailures$1.evaluate(TestRuleIgnoreAfterMaxFailures.java:65)
	at org.apache.lucene.util.TestRuleMarkFailure$1.evaluate(TestRuleMarkFailure.java:48)
	at com.carrotsearch.randomizedtesting.rules.StatementAdapter.evaluate(StatementAdapter.java:36)
	at com.carrotsearch.randomizedtesting.ThreadLeakControl$StatementRunner.run(ThreadLeakControl.java:365)
	at com.carrotsearch.randomizedtesting.ThreadLeakControl.forkTimeoutingTask(ThreadLeakControl.java:798)
	at com.carrotsearch.randomizedtesting.ThreadLeakControl$3.evaluate(ThreadLeakControl.java:458)
	at com.carrotsearch.randomizedtesting.RandomizedRunner.runSingleTest(RandomizedRunner.java:836)
	at com.carrotsearch.randomizedtesting.RandomizedRunner$3.evaluate(RandomizedRunner.java:738)
	at com.carrotsearch.randomizedtesting.RandomizedRunner$4.evaluate(RandomizedRunner.java:772)
	at com.carrotsearch.randomizedtesting.RandomizedRunner$5.evaluate(RandomizedRunner.java:783)
	at org.apache.lucene.util.AbstractBeforeAfterRule$1.evaluate(AbstractBeforeAfterRule.java:46)
	at org.apache.lucene.util.TestRuleStoreClassName$1.evaluate(TestRuleStoreClassName.java:42)
	at com.carrotsearch.randomizedtesting.rules.SystemPropertiesInvariantRule$1.evaluate(SystemPropertiesInvariantRule.java:55)
	at com.carrotsearch.randomizedtesting.rules.NoShadowingOrOverridesOnMethodsRule$1.evaluate(NoShadowingOrOverridesOnMethodsRule.java:39)
	at com.carrotsearch.randomizedtesting.rules.NoShadowingOrOverridesOnMethodsRule$1.evaluate(NoShadowingOrOverridesOnMethodsRule.java:39)
	at com.carrotsearch.randomizedtesting.rules.StatementAdapter.evaluate(StatementAdapter.java:36)
	at com.carrotsearch.randomizedtesting.rules.StatementAdapter.evaluate(StatementAdapter.java:36)
	at com.carrotsearch.randomizedtesting.rules.StatementAdapter.evaluate(StatementAdapter.java:36)
	at org.apache.lucene.util.TestRuleAssertionsRequired$1.evaluate(TestRuleAssertionsRequired.java:54)
	at org.apache.lucene.util.TestRuleMarkFailure$1.evaluate(TestRuleMarkFailure.java:48)
	at org.apache.lucene.util.TestRuleIgnoreAfterMaxFailures$1.evaluate(TestRuleIgnoreAfterMaxFailures.java:65)
	at org.apache.lucene.util.TestRuleIgnoreTestSuites$1.evaluate(TestRuleIgnoreTestSuites.java:55)
	at com.carrotsearch.randomizedtesting.rules.StatementAdapter.evaluate(StatementAdapter.java:36)
	at com.carrotsearch.randomizedtesting.ThreadLeakControl$StatementRunner.run(ThreadLeakControl.java:365)
	at java.lang.Thread.run(Thread.java:853)




Build Log:
[...truncated 264 lines...]
   [junit4] Suite: org.apache.lucene.index.TestCompoundFile
   [junit4]   2> NOTE: reproduce with: ant test  -Dtestcase=TestCompoundFile -Dtests.method=testListAll -Dtests.seed=3C4832D329799907 -Dtests.multiplier=3 -Dtests.slow=true -Dtests.locale=it_IT_PREEURO -Dtests.timezone=Pacific/Easter -Dtests.asserts=false -Dtests.file.encoding=UTF-8
   [junit4] ERROR   1.04s J0 | TestCompoundFile.testListAll <<<
   [junit4]    > Throwable #1: java.lang.NullPointerException
   [junit4]    > 	at __randomizedtesting.SeedInfo.seed([3C4832D329799907:29ADD6530019DAFF]:0)
   [junit4]    > 	at org.apache.lucene.codecs.lucene49.Lucene49NormsConsumer$NormMap.add(Lucene49NormsConsumer.java:226)
   [junit4]    > 	at org.apache.lucene.codecs.lucene49.Lucene49NormsConsumer.addNumericField(Lucene49NormsConsumer.java:95)
   [junit4]    > 	at org.apache.lucene.index.NumericDocValuesWriter.flush(NumericDocValuesWriter.java:92)
   [junit4]    > 	at org.apache.lucene.index.DefaultIndexingChain.writeNorms(DefaultIndexingChain.java:207)
   [junit4]    > 	at org.apache.lucene.index.DefaultIndexingChain.flush(DefaultIndexingChain.java:94)
   [junit4]    > 	at org.apache.lucene.index.DocumentsWriterPerThread.flush(DocumentsWriterPerThread.java:439)
   [junit4]    > 	at org.apache.lucene.index.DocumentsWriter.doFlush(DocumentsWriter.java:510)
   [junit4]    > 	at org.apache.lucene.index.DocumentsWriter.flushAllThreads(DocumentsWriter.java:621)
   [junit4]    > 	at org.apache.lucene.index.IndexWriter.prepareCommitInternal(IndexWriter.java:2942)
   [junit4]    > 	at org.apache.lucene.index.IndexWriter.commitInternal(IndexWriter.java:3097)
   [junit4]    > 	at org.apache.lucene.index.IndexWriter.commit(IndexWriter.java:3064)
   [junit4]    > 	at org.apache.lucene.index.RandomIndexWriter.commit(RandomIndexWriter.java:260)
   [junit4]    > 	at org.apache.lucene.index.TestCompoundFile.testListAll(TestCompoundFile.java:825)
   [junit4]    > 	at java.lang.Thread.run(Thread.java:853)
   [junit4]   2> NOTE: leaving temporary files on disk at: /mnt/ssd/jenkins/workspace/Lucene-Solr-4.10-Linux/lucene/build/core/test/J0/./lucene.index.TestCompoundFile-3C4832D329799907-001
   [junit4]   2> NOTE: test params are: codec=Lucene410: {body=PostingsFormat(name=FSTPulsing41), id=FSTOrd41}, docValues:{}, sim=RandomSimilarityProvider(queryNorm=false,coord=yes): {body=DFR I(F)L3(800.0)}, locale=it_IT_PREEURO, timezone=Pacific/Easter
   [junit4]   2> NOTE: Linux 3.13.0-39-generic amd64/IBM Corporation 1.7.0 (64-bit)/cpus=8,threads=1,free=80541352,total=242679808
   [junit4]   2> NOTE: All tests run in this JVM: [TestPriorityQueue, TestCharTermAttributeImpl, TestSortRescorer, TestWorstCaseTestBehavior, TestFilterIterator, TestLucene40PostingsReader, TestPagedBytes, TestCompoundFile]
   [junit4] Completed on J0 in 4.22s, 18 tests, 1 error <<< FAILURES!

[...truncated 185 lines...]
   [junit4] Suite: org.apache.lucene.codecs.compressing.TestCompressingTermVectorsFormat
   [junit4]   2> NOTE: reproduce with: ant test  -Dtestcase=TestCompressingTermVectorsFormat -Dtests.method=testRamBytesUsed -Dtests.seed=3C4832D329799907 -Dtests.multiplier=3 -Dtests.slow=true -Dtests.locale=nl_NL_PREEURO -Dtests.timezone=Antarctica/DumontDUrville -Dtests.asserts=false -Dtests.file.encoding=UTF-8
   [junit4] ERROR   0.12s J0 | TestCompressingTermVectorsFormat.testRamBytesUsed {#0 seed=[3C4832D329799907:CEEB2093E3068651]} <<<
   [junit4]    > Throwable #1: java.lang.NullPointerException
   [junit4]    > 	at __randomizedtesting.SeedInfo.seed([3C4832D329799907:CEEB2093E3068651]:0)
   [junit4]    > 	at org.apache.lucene.codecs.lucene49.Lucene49NormsConsumer$NormMap.getOrd(Lucene49NormsConsumer.java:249)
   [junit4]    > 	at org.apache.lucene.codecs.lucene49.Lucene49NormsConsumer.addNumericField(Lucene49NormsConsumer.java:150)
   [junit4]    > 	at org.apache.lucene.codecs.DocValuesConsumer.mergeNumericField(DocValuesConsumer.java:129)
   [junit4]    > 	at org.apache.lucene.index.SegmentMerger.mergeNorms(SegmentMerger.java:255)
   [junit4]    > 	at org.apache.lucene.index.SegmentMerger.merge(SegmentMerger.java:133)
   [junit4]    > 	at org.apache.lucene.index.IndexWriter.mergeMiddle(IndexWriter.java:4173)
   [junit4]    > 	at org.apache.lucene.index.IndexWriter.merge(IndexWriter.java:3768)
   [junit4]    > 	at org.apache.lucene.index.SerialMergeScheduler.merge(SerialMergeScheduler.java:40)
   [junit4]    > 	at org.apache.lucene.index.IndexWriter.maybeMerge(IndexWriter.java:1970)
   [junit4]    > 	at org.apache.lucene.index.IndexWriter.forceMerge(IndexWriter.java:1797)
   [junit4]    > 	at org.apache.lucene.index.IndexWriter.forceMerge(IndexWriter.java:1754)
   [junit4]    > 	at org.apache.lucene.index.BaseIndexFileFormatTestCase.testRamBytesUsed(BaseIndexFileFormatTestCase.java:228)
   [junit4]    > 	at org.apache.lucene.index.BaseTermVectorsFormatTestCase.testRamBytesUsed(BaseTermVectorsFormatTestCase.java:61)
   [junit4]    > 	at java.lang.Thread.run(Thread.java:853)
   [junit4]   2> nov 11, 2014 11:41:13 PM com.carrotsearch.randomizedtesting.RandomizedRunner$QueueUncaughtExceptionsHandler uncaughtException
   [junit4]   2> WARNING: Uncaught exception in thread: Thread[Lucene Merge Thread #0,6,TGRP-TestCompressingTermVectorsFormat]
   [junit4]   2> org.apache.lucene.index.MergePolicy$MergeException: java.lang.NullPointerException
   [junit4]   2> 	at __randomizedtesting.SeedInfo.seed([3C4832D329799907]:0)
   [junit4]   2> 	at org.apache.lucene.index.ConcurrentMergeScheduler.handleMergeException(ConcurrentMergeScheduler.java:545)
   [junit4]   2> 	at org.apache.lucene.index.ConcurrentMergeScheduler$MergeThread.run(ConcurrentMergeScheduler.java:518)
   [junit4]   2> Caused by: java.lang.NullPointerException
   [junit4]   2> 	at org.apache.lucene.codecs.lucene49.Lucene49NormsConsumer$NormMap.getOrd(Lucene49NormsConsumer.java:249)
   [junit4]   2> 	at org.apache.lucene.codecs.lucene49.Lucene49NormsConsumer.addNumericField(Lucene49NormsConsumer.java:150)
   [junit4]   2> 	at org.apache.lucene.codecs.DocValuesConsumer.mergeNumericField(DocValuesConsumer.java:129)
   [junit4]   2> 	at org.apache.lucene.index.SegmentMerger.mergeNorms(SegmentMerger.java:255)
   [junit4]   2> 	at org.apache.lucene.index.SegmentMerger.merge(SegmentMerger.java:133)
   [junit4]   2> 	at org.apache.lucene.index.IndexWriter.mergeMiddle(IndexWriter.java:4173)
   [junit4]   2> 	at org.apache.lucene.index.IndexWriter.merge(IndexWriter.java:3768)
   [junit4]   2> 	at org.apache.lucene.index.ConcurrentMergeScheduler.doMerge(ConcurrentMergeScheduler.java:405)
   [junit4]   2> 	at org.apache.lucene.index.ConcurrentMergeScheduler$MergeThread.run(ConcurrentMergeScheduler.java:482)
   [junit4]   2> 
   [junit4]   2> nov 11, 2014 11:41:13 PM com.carrotsearch.randomizedtesting.RandomizedRunner$QueueUncaughtExceptionsHandler uncaughtException
   [junit4]   2> WARNING: Uncaught exception in thread: Thread[Lucene Merge Thread #1,6,TGRP-TestCompressingTermVectorsFormat]
   [junit4]   2> org.apache.lucene.index.MergePolicy$MergeException: java.lang.NullPointerException
   [junit4]   2> 	at __randomizedtesting.SeedInfo.seed([3C4832D329799907]:0)
   [junit4]   2> 	at org.apache.lucene.index.ConcurrentMergeScheduler.handleMergeException(ConcurrentMergeScheduler.java:545)
   [junit4]   2> 	at org.apache.lucene.index.ConcurrentMergeScheduler$MergeThread.run(ConcurrentMergeScheduler.java:518)
   [junit4]   2> Caused by: java.lang.NullPointerException
   [junit4]   2> 	at org.apache.lucene.codecs.lucene49.Lucene49NormsConsumer$NormMap.getOrd(Lucene49NormsConsumer.java:249)
   [junit4]   2> 	at org.apache.lucene.codecs.lucene49.Lucene49NormsConsumer.addNumericField(Lucene49NormsConsumer.java:150)
   [junit4]   2> 	at org.apache.lucene.codecs.DocValuesConsumer.mergeNumericField(DocValuesConsumer.java:129)
   [junit4]   2> 	at org.apache.lucene.index.SegmentMerger.mergeNorms(SegmentMerger.java:255)
   [junit4]   2> 	at org.apache.lucene.index.SegmentMerger.merge(SegmentMerger.java:133)
   [junit4]   2> 	at org.apache.lucene.index.IndexWriter.mergeMiddle(IndexWriter.java:4173)
   [junit4]   2> 	at org.apache.lucene.index.IndexWriter.merge(IndexWriter.java:3768)
   [junit4]   2> 	at org.apache.lucene.index.ConcurrentMergeScheduler.doMerge(ConcurrentMergeScheduler.java:405)
   [junit4]   2> 	at org.apache.lucene.index.ConcurrentMergeScheduler$MergeThread.run(ConcurrentMergeScheduler.java:482)
   [junit4]   2> 
   [junit4]   2> nov 11, 2014 11:41:13 PM com.carrotsearch.randomizedtesting.RandomizedRunner$QueueUncaughtExceptionsHandler uncaughtException
   [junit4]   2> WARNING: Uncaught exception in thread: Thread[Lucene Merge Thread #2,6,TGRP-TestCompressingTermVectorsFormat]
   [junit4]   2> org.apache.lucene.index.MergePolicy$MergeException: java.lang.NullPointerException
   [junit4]   2> 	at __randomizedtesting.SeedInfo.seed([3C4832D329799907]:0)
   [junit4]   2> 	at org.apache.lucene.index.ConcurrentMergeScheduler.handleMergeException(ConcurrentMergeScheduler.java:545)
   [junit4]   2> 	at org.apache.lucene.index.ConcurrentMergeScheduler$MergeThread.run(ConcurrentMergeScheduler.java:518)
   [junit4]   2> Caused by: java.lang.NullPointerException
   [junit4]   2> 	at org.apache.lucene.codecs.lucene49.Lucene49NormsConsumer$NormMap.getOrd(Lucene49NormsConsumer.java:249)
   [junit4]   2> 	at org.apache.lucene.codecs.lucene49.Lucene49NormsConsumer.addNumericField(Lucene49NormsConsumer.java:150)
   [junit4]   2> 	at org.apache.lucene.codecs.DocValuesConsumer.mergeNumericField(DocValuesConsumer.java:129)
   [junit4]   2> 	at org.apache.lucene.index.SegmentMerger.mergeNorms(SegmentMerger.java:255)
   [junit4]   2> 	at org.apache.lucene.index.SegmentMerger.merge(SegmentMerger.java:133)
   [junit4]   2> 	at org.apache.lucene.index.IndexWriter.mergeMiddle(IndexWriter.java:4173)
   [junit4]   2> 	at org.apache.lucene.index.IndexWriter.merge(IndexWriter.java:3768)
   [junit4]   2> 	at org.apache.lucene.index.ConcurrentMergeScheduler.doMerge(ConcurrentMergeScheduler.java:405)
   [junit4]   2> 	at org.apache.lucene.index.ConcurrentMergeScheduler$MergeThread.run(ConcurrentMergeScheduler.java:482)
   [junit4]   2> 
   [junit4]   2> nov 11, 2014 11:41:13 PM com.carrotsearch.randomizedtesting.RandomizedRunner$QueueUncaughtExceptionsHandler uncaughtException
   [junit4]   2> WARNING: Uncaught exception in thread: Thread[Lucene Merge Thread #3,6,TGRP-TestCompressingTermVectorsFormat]
   [junit4]   2> org.apache.lucene.index.MergePolicy$MergeException: java.lang.NullPointerException
   [junit4]   2> 	at __randomizedtesting.SeedInfo.seed([3C4832D329799907]:0)
   [junit4]   2> 	at org.apache.lucene.index.ConcurrentMergeScheduler.handleMergeException(ConcurrentMergeScheduler.java:545)
   [junit4]   2> 	at org.apache.lucene.index.ConcurrentMergeScheduler$MergeThread.run(ConcurrentMergeScheduler.java:518)
   [junit4]   2> Caused by: java.lang.NullPointerException
   [junit4]   2> 	at org.apache.lucene.codecs.lucene49.Lucene49NormsConsumer$NormMap.getOrd(Lucene49NormsConsumer.java:249)
   [junit4]   2> 	at org.apache.lucene.codecs.lucene49.Lucene49NormsConsumer.addNumericField(Lucene49NormsConsumer.java:150)
   [junit4]   2> 	at org.apache.lucene.codecs.DocValuesConsumer.mergeNumericField(DocValuesConsumer.java:129)
   [junit4]   2> 	at org.apache.lucene.index.SegmentMerger.mergeNorms(SegmentMerger.java:255)
   [junit4]   2> 	at org.apache.lucene.index.SegmentMerger.merge(SegmentMerger.java:133)
   [junit4]   2> 	at org.apache.lucene.index.IndexWriter.mergeMiddle(IndexWriter.java:4173)
   [junit4]   2> 	at org.apache.lucene.index.IndexWriter.merge(IndexWriter.java:3768)
   [junit4]   2> 	at org.apache.lucene.index.ConcurrentMergeScheduler.doMerge(ConcurrentMergeScheduler.java:405)
   [junit4]   2> 	at org.apache.lucene.index.ConcurrentMergeScheduler$MergeThread.run(ConcurrentMergeScheduler.java:482)
   [junit4]   2> 
   [junit4]   2> nov 11, 2014 11:41:13 PM com.carrotsearch.randomizedtesting.RandomizedRunner$QueueUncaughtExceptionsHandler uncaughtException
   [junit4]   2> WARNING: Uncaught exception in thread: Thread[Lucene Merge Thread #4,6,TGRP-TestCompressingTermVectorsFormat]
   [junit4]   2> org.apache.lucene.index.MergePolicy$MergeException: java.lang.NullPointerException
   [junit4]   2> 	at __randomizedtesting.SeedInfo.seed([3C4832D329799907]:0)
   [junit4]   2> 	at org.apache.lucene.index.ConcurrentMergeScheduler.handleMergeException(ConcurrentMergeScheduler.java:545)
   [junit4]   2> 	at org.apache.lucene.index.ConcurrentMergeScheduler$MergeThread.run(ConcurrentMergeScheduler.java:518)
   [junit4]   2> Caused by: java.lang.NullPointerException
   [junit4]   2> 	at org.apache.lucene.codecs.lucene49.Lucene49NormsConsumer$NormMap.getOrd(Lucene49NormsConsumer.java:249)
   [junit4]   2> 	at org.apache.lucene.codecs.lucene49.Lucene49NormsConsumer.addNumericField(Lucene49NormsConsumer.java:150)
   [junit4]   2> 	at org.apache.lucene.codecs.DocValuesConsumer.mergeNumericField(DocValuesConsumer.java:129)
   [junit4]   2> 	at org.apache.lucene.index.SegmentMerger.mergeNorms(SegmentMerger.java:255)
   [junit4]   2> 	at org.apache.lucene.index.SegmentMerger.merge(SegmentMerger.java:133)
   [junit4]   2> 	at org.apache.lucene.index.IndexWriter.mergeMiddle(IndexWriter.java:4173)
   [junit4]   2> 	at org.apache.lucene.index.IndexWriter.merge(IndexWriter.java:3768)
   [junit4]   2> 	at org.apache.lucene.index.ConcurrentMergeScheduler.doMerge(ConcurrentMergeScheduler.java:405)
   [junit4]   2> 	at org.apache.lucene.index.ConcurrentMergeScheduler$MergeThread.run(ConcurrentMergeScheduler.java:482)
   [junit4]   2> 
   [junit4]   2> nov 11, 2014 11:41:14 PM com.carrotsearch.randomizedtesting.RandomizedRunner$QueueUncaughtExceptionsHandler uncaughtException
   [junit4]   2> WARNING: Uncaught exception in thread: Thread[Lucene Merge Thread #6,6,TGRP-TestCompressingTermVectorsFormat]
   [junit4]   2> org.apache.lucene.index.MergePolicy$MergeException: java.lang.NullPointerException
   [junit4]   2> 	at __randomizedtesting.SeedInfo.seed([3C4832D329799907]:0)
   [junit4]   2> 	at org.apache.lucene.index.ConcurrentMergeScheduler.handleMergeException(ConcurrentMergeScheduler.java:545)
   [junit4]   2> 	at org.apache.lucene.index.ConcurrentMergeScheduler$MergeThread.run(ConcurrentMergeScheduler.java:518)
   [junit4]   2> Caused by: java.lang.NullPointerException
   [junit4]   2> 	at org.apache.lucene.codecs.lucene49.Lucene49NormsConsumer$NormMap.getOrd(Lucene49NormsConsumer.java:249)
   [junit4]   2> 	at org.apache.lucene.codecs.lucene49.Lucene49NormsConsumer.addNumericField(Lucene49NormsConsumer.java:150)
   [junit4]   2> 	at org.apache.lucene.codecs.DocValuesConsumer.mergeNumericField(DocValuesConsumer.java:129)
   [junit4]   2> 	at org.apache.lucene.index.SegmentMerger.mergeNorms(SegmentMerger.java:255)
   [junit4]   2> 	at org.apache.lucene.index.SegmentMerger.merge(SegmentMerger.java:133)
   [junit4]   2> 	at org.apache.lucene.index.IndexWriter.mergeMiddle(IndexWriter.java:4173)
   [junit4]   2> 	at org.apache.lucene.index.IndexWriter.merge(IndexWriter.java:3768)
   [junit4]   2> 	at org.apache.lucene.index.ConcurrentMergeScheduler.doMerge(ConcurrentMergeScheduler.java:405)
   [junit4]   2> 	at org.apache.lucene.index.ConcurrentMergeScheduler$MergeThread.run(ConcurrentMergeScheduler.java:482)
   [junit4]   2> 
   [junit4]   2> nov 11, 2014 11:41:14 PM com.carrotsearch.randomizedtesting.RandomizedRunner$QueueUncaughtExceptionsHandler uncaughtException
   [junit4]   2> WARNING: Uncaught exception in thread: Thread[Lucene Merge Thread #7,6,TGRP-TestCompressingTermVectorsFormat]
   [junit4]   2> org.apache.lucene.index.MergePolicy$MergeException: java.lang.NullPointerException
   [junit4]   2> 	at __randomizedtesting.SeedInfo.seed([3C4832D329799907]:0)
   [junit4]   2> 	at org.apache.lucene.index.ConcurrentMergeScheduler.handleMergeException(ConcurrentMergeScheduler.java:545)
   [junit4]   2> 	at org.apache.lucene.index.ConcurrentMergeScheduler$MergeThread.run(ConcurrentMergeScheduler.java:518)
   [junit4]   2> Caused by: java.lang.NullPointerException
   [junit4]   2> 	at org.apache.lucene.codecs.lucene49.Lucene49NormsConsumer$NormMap.getOrd(Lucene49NormsConsumer.java:249)
   [junit4]   2> 	at org.apache.lucene.codecs.lucene49.Lucene49NormsConsumer.addNumericField(Lucene49NormsConsumer.java:150)
   [junit4]   2> 	at org.apache.lucene.codecs.DocValuesConsumer.mergeNumericField(DocValuesConsumer.java:129)
   [junit4]   2> 	at org.apache.lucene.index.SegmentMerger.mergeNorms(SegmentMerger.java:255)
   [junit4]   2> 	at org.apache.lucene.index.SegmentMerger.merge(SegmentMerger.java:133)
   [junit4]   2> 	at org.apache.lucene.index.IndexWriter.mergeMiddle(IndexWriter.java:4173)
   [junit4]   2> 	at org.apache.lucene.index.IndexWriter.merge(IndexWriter.java:3768)
   [junit4]   2> 	at org.apache.lucene.index.ConcurrentMergeScheduler.doMerge(ConcurrentMergeScheduler.java:405)
   [junit4]   2> 	at org.apache.lucene.index.ConcurrentMergeScheduler$MergeThread.run(ConcurrentMergeScheduler.java:482)
   [junit4]   2> 
   [junit4]   2> nov 11, 2014 11:41:15 PM com.carrotsearch.randomizedtesting.RandomizedRunner$QueueUncaughtExceptionsHandler uncaughtException
   [junit4]   2> WARNING: Uncaught exception in thread: Thread[Lucene Merge Thread #8,6,TGRP-TestCompressingTermVectorsFormat]
   [junit4]   2> org.apache.lucene.index.MergePolicy$MergeException: java.lang.NullPointerException
   [junit4]   2> 	at __randomizedtesting.SeedInfo.seed([3C4832D329799907]:0)
   [junit4]   2> 	at org.apache.lucene.index.ConcurrentMergeScheduler.handleMergeException(ConcurrentMergeScheduler.java:545)
   [junit4]   2> 	at org.apache.lucene.index.ConcurrentMergeScheduler$MergeThread.run(ConcurrentMergeScheduler.java:518)
   [junit4]   2> Caused by: java.lang.NullPointerException
   [junit4]   2> 	at org.apache.lucene.codecs.lucene49.Lucene49NormsConsumer$NormMap.getOrd(Lucene49NormsConsumer.java:249)
   [junit4]   2> 	at org.apache.lucene.codecs.lucene49.Lucene49NormsConsumer.addNumericField(Lucene49NormsConsumer.java:150)
   [junit4]   2> 	at org.apache.lucene.codecs.DocValuesConsumer.mergeNumericField(DocValuesConsumer.java:129)
   [junit4]   2> 	at org.apache.lucene.index.SegmentMerger.mergeNorms(SegmentMerger.java:255)
   [junit4]   2> 	at org.apache.lucene.index.SegmentMerger.merge(SegmentMerger.java:133)
   [junit4]   2> 	at org.apache.lucene.index.IndexWriter.mergeMiddle(IndexWriter.java:4173)
   [junit4]   2> 	at org.apache.lucene.index.IndexWriter.merge(IndexWriter.java:3768)
   [junit4]   2> 	at org.apache.lucene.index.ConcurrentMergeScheduler.doMerge(ConcurrentMergeScheduler.java:405)
   [junit4]   2> 	at org.apache.lucene.index.ConcurrentMergeScheduler$MergeThread.run(ConcurrentMergeScheduler.java:482)
   [junit4]   2> 
   [junit4]   2> nov 11, 2014 11:41:15 PM com.carrotsearch.randomizedtesting.RandomizedRunner$QueueUncaughtExceptionsHandler uncaughtException
   [junit4]   2> WARNING: Uncaught exception in thread: Thread[Lucene Merge Thread #9,6,TGRP-TestCompressingTermVectorsFormat]
   [junit4]   2> org.apache.lucene.index.MergePolicy$MergeException: java.lang.NullPointerException
   [junit4]   2> 	at __randomizedtesting.SeedInfo.seed([3C4832D329799907]:0)
   [junit4]   2> 	at org.apache.lucene.index.ConcurrentMergeScheduler.handleMergeException(ConcurrentMergeScheduler.java:545)
   [junit4]   2> 	at org.apache.lucene.index.ConcurrentMergeScheduler$MergeThread.run(ConcurrentMergeScheduler.java:518)
   [junit4]   2> Caused by: java.lang.NullPointerException
   [junit4]   2> 	at org.apache.lucene.codecs.lucene49.Lucene49NormsConsumer$NormMap.getOrd(Lucene49NormsConsumer.java:249)
   [junit4]   2> 	at org.apache.lucene.codecs.lucene49.Lucene49NormsConsumer.addNumericField(Lucene49NormsConsumer.java:150)
   [junit4]   2> 	at org.apache.lucene.codecs.DocValuesConsumer.mergeNumericField(DocValuesConsumer.java:129)
   [junit4]   2> 	at org.apache.lucene.index.SegmentMerger.mergeNorms(SegmentMerger.java:255)
   [junit4]   2> 	at org.apache.lucene.index.SegmentMerger.merge(SegmentMerger.java:133)
   [junit4]   2> 	at org.apache.lucene.index.IndexWriter.mergeMiddle(IndexWriter.java:4173)
   [junit4]   2> 	at org.apache.lucene.index.IndexWriter.merge(IndexWriter.java:3768)
   [junit4]   2> 	at org.apache.lucene.index.ConcurrentMergeScheduler.doMerge(ConcurrentMergeScheduler.java:405)
   [junit4]   2> 	at org.apache.lucene.index.ConcurrentMergeScheduler$MergeThread.run(ConcurrentMergeScheduler.java:482)
   [junit4]   2> 
   [junit4]   2> nov 11, 2014 11:41:15 PM com.carrotsearch.randomizedtesting.RandomizedRunner$QueueUncaughtExceptionsHandler uncaughtException
   [junit4]   2> WARNING: Uncaught exception in thread: Thread[Lucene Merge Thread #10,6,TGRP-TestCompressingTermVectorsFormat]
   [junit4]   2> org.apache.lucene.index.MergePolicy$MergeException: java.lang.NullPointerException
   [junit4]   2> 	at __randomizedtesting.SeedInfo.seed([3C4832D329799907]:0)
   [junit4]   2> 	at org.apache.lucene.index.ConcurrentMergeScheduler.handleMergeException(ConcurrentMergeScheduler.java:545)
   [junit4]   2> 	at org.apache.lucene.index.ConcurrentMergeScheduler$MergeThread.run(ConcurrentMergeScheduler.java:518)
   [junit4]   2> Caused by: java.lang.NullPointerException
   [junit4]   2> 	at org.apache.lucene.codecs.lucene49.Lucene49NormsConsumer$NormMap.getOrd(Lucene49NormsConsumer.java:249)
   [junit4]   2> 	at org.apache.lucene.codecs.lucene49.Lucene49NormsConsumer.addNumericField(Lucene49NormsConsumer.java:150)
   [junit4]   2> 	at org.apache.lucene.codecs.DocValuesConsumer.mergeNumericField(DocValuesConsumer.java:129)
   [junit4]   2> 	at org.apache.lucene.index.SegmentMerger.mergeNorms(SegmentMerger.java:255)
   [junit4]   2> 	at org.apache.lucene.index.SegmentMerger.merge(SegmentMerger.java:133)
   [junit4]   2> 	at org.apache.lucene.index.IndexWriter.mergeMiddle(IndexWriter.java:4173)
   [junit4]   2> 	at org.apache.lucene.index.IndexWriter.merge(IndexWriter.java:3768)
   [junit4]   2> 	at org.apache.lucene.index.ConcurrentMergeScheduler.doMerge(ConcurrentMergeScheduler.java:405)
   [junit4]   2> 	at org.apache.lucene.index.ConcurrentMergeScheduler$MergeThread.run(ConcurrentMergeScheduler.java:482)
   [junit4]   2> 
   [junit4]   2> nov 11, 2014 11:41:16 PM com.carrotsearch.randomizedtesting.RandomizedRunner$QueueUncaughtExceptionsHandler uncaughtException
   [junit4]   2> WARNING: Uncaught exception in thread: Thread[Lucene Merge Thread #11,6,TGRP-TestCompressingTermVectorsFormat]
   [junit4]   2> org.apache.lucene.index.MergePolicy$MergeException: java.lang.NullPointerException
   [junit4]   2> 	at __randomizedtesting.SeedInfo.seed([3C4832D329799907]:0)
   [junit4]   2> 	at org.apache.lucene.index.ConcurrentMergeScheduler.handleMergeException(ConcurrentMergeScheduler.java:545)
   [junit4]   2> 	at org.apache.lucene.index.ConcurrentMergeScheduler$MergeThread.run(ConcurrentMergeScheduler.java:518)
   [junit4]   2> Caused by: java.lang.NullPointerException
   [junit4]   2> 	at org.apache.lucene.codecs.lucene49.Lucene49NormsConsumer$NormMap.getOrd(Lucene49NormsConsumer.java:249)
   [junit4]   2> 	at org.apache.lucene.codecs.lucene49.Lucene49NormsConsumer.addNumericField(Lucene49NormsConsumer.java:150)
   [junit4]   2> 	at org.apache.lucene.codecs.DocValuesConsumer.mergeNumericField(DocValuesConsumer.java:129)
   [junit4]   2> 	at org.apache.lucene.index.SegmentMerger.mergeNorms(SegmentMerger.java:255)
   [junit4]   2> 	at org.apache.lucene.index.SegmentMerger.merge(SegmentMerger.java:133)
   [junit4]   2> 	at org.apache.lucene.index.IndexWriter.mergeMiddle(IndexWriter.java:4173)
   [junit4]   2> 	at org.apache.lucene.index.IndexWriter.merge(IndexWriter.java:3768)
   [junit4]   2> 	at org.apache.lucene.index.ConcurrentMergeScheduler.doMerge(ConcurrentMergeScheduler.java:405)
   [junit4]   2> 	at org.apache.lucene.index.ConcurrentMergeScheduler$MergeThread.run(ConcurrentMergeScheduler.java:482)
   [junit4]   2> 
   [junit4]   2> nov 11, 2014 11:41:16 PM com.carrotsearch.randomizedtesting.RandomizedRunner$QueueUncaughtExceptionsHandler uncaughtException
   [junit4]   2> WARNING: Uncaught exception in thread: Thread[Lucene Merge Thread #12,6,TGRP-TestCompressingTermVectorsFormat]
   [junit4]   2> org.apache.lucene.index.MergePolicy$MergeException: java.lang.NullPointerException
   [junit4]   2> 	at __randomizedtesting.SeedInfo.seed([3C4832D329799907]:0)
   [junit4]   2> 	at org.apache.lucene.index.ConcurrentMergeScheduler.handleMergeException(ConcurrentMergeScheduler.java:545)
   [junit4]   2> 	at org.apache.lucene.index.ConcurrentMergeScheduler$MergeThread.run(ConcurrentMergeScheduler.java:518)
   [junit4]   2> Caused by: java.lang.NullPointerException
   [junit4]   2> 	at org.apache.lucene.codecs.lucene49.Lucene49NormsConsumer$NormMap.getOrd(Lucene49NormsConsumer.java:249)
   [junit4]   2> 	at org.apache.lucene.codecs.lucene49.Lucene49NormsConsumer.addNumericField(Lucene49NormsConsumer.java:150)
   [junit4]   2> 	at org.apache.lucene.codecs.DocValuesConsumer.mergeNumericField(DocValuesConsumer.java:129)
   [junit4]   2> 	at org.apache.lucene.index.SegmentMerger.mergeNorms(SegmentMerger.java:255)
   [junit4]   2> 	at org.apache.lucene.index.SegmentMerger.merge(SegmentMerger.java:133)
   [junit4]   2> 	at org.apache.lucene.index.IndexWriter.mergeMiddle(IndexWriter.java:4173)
   [junit4]   2> 	at org.apache.lucene.index.IndexWriter.merge(IndexWriter.java:3768)
   [junit4]   2> 	at org.apache.lucene.index.ConcurrentMergeScheduler.doMerge(ConcurrentMergeScheduler.java:405)
   [junit4]   2> 	at org.apache.lucene.index.ConcurrentMergeScheduler$MergeThread.run(ConcurrentMergeScheduler.java:482)
   [junit4]   2> 
   [junit4]   2> nov 11, 2014 11:41:16 PM com.carrotsearch.randomizedtesting.RandomizedRunner$QueueUncaughtExceptionsHandler uncaughtException
   [junit4]   2> WARNING: Uncaught exception in thread: Thread[Lucene Merge Thread #13,6,TGRP-TestCompressingTermVectorsFormat]
   [junit4]   2> org.apache.lucene.index.MergePolicy$MergeException: java.lang.NullPointerException
   [junit4]   2> 	at __randomizedtesting.SeedInfo.seed([3C4832D329799907]:0)
   [junit4]   2> 	at org.apache.lucene.index.ConcurrentMergeScheduler.handleMergeException(ConcurrentMergeScheduler.java:545)
   [junit4]   2> 	at org.apache.lucene.index.ConcurrentMergeScheduler$MergeThread.run(ConcurrentMergeScheduler.java:518)
   [junit4]   2> Caused by: java.lang.NullPointerException
   [junit4]   2> 	at org.apache.lucene.codecs.lucene49.Lucene49NormsConsumer$NormMap.getOrd(Lucene49NormsConsumer.java:249)
   [junit4]   2> 	at org.apache.lucene.codecs.lucene49.Lucene49NormsConsumer.addNumericField(Lucene49NormsConsumer.java:150)
   [junit4]   2> 	at org.apache.lucene.codecs.DocValuesConsumer.mergeNumericField(DocValuesConsumer.java:129)
   [junit4]   2> 	at org.apache.lucene.index.SegmentMerger.mergeNorms(SegmentMerger.java:255)
   [junit4]   2> 	at org.apache.lucene.index.SegmentMerger.merge(SegmentMerger.java:133)
   [junit4]   2> 	at org.apache.lucene.index.IndexWriter.mergeMiddle(IndexWriter.java:4173)
   [junit4]   2> 	at org.apache.lucene.index.IndexWriter.merge(IndexWriter.java:3768)
   [junit4]   2> 	at org.apache.lucene.index.ConcurrentMergeScheduler.doMerge(ConcurrentMergeScheduler.java:405)
   [junit4]   2> 	at org.apache.lucene.index.ConcurrentMergeScheduler$MergeThread.run(ConcurrentMergeScheduler.java:482)
   [junit4]   2> 
   [junit4]   2> nov 11, 2014 11:41:17 PM com.carrotsearch.randomizedtesting.RandomizedRunner$QueueUncaughtExceptionsHandler uncaughtException
   [junit4]   2> WARNING: Uncaught exception in thread: Thread[Lucene Merge Thread #14,6,TGRP-TestCompressingTermVectorsFormat]
   [junit4]   2> org.apache.lucene.index.MergePolicy$MergeException: java.lang.NullPointerException
   [junit4]   2> 	at __randomizedtesting.SeedInfo.seed([3C4832D329799907]:0)
   [junit4]   2> 	at org.apache.lucene.index.ConcurrentMergeScheduler.handleMergeException(ConcurrentMergeScheduler.java:545)
   [junit4]   2> 	at org.apache.lucene.index.ConcurrentMergeScheduler$MergeThread.run(ConcurrentMergeScheduler.java:518)
   [junit4]   2> Caused by: java.lang.NullPointerException
   [junit4]   2> 	at org.apache.lucene.codecs.lucene49.Lucene49NormsConsumer$NormMap.getOrd(Lucene49NormsConsumer.java:249)
   [junit4]   2> 	at org.apache.lucene.codecs.lucene49.Lucene49NormsConsumer.addNumericField(Lucene49NormsConsumer.java:150)
   [junit4]   2> 	at org.apache.lucene.codecs.DocValuesConsumer.mergeNumericField(DocValuesConsumer.java:129)
   [junit4]   2> 	at org.apache.lucene.index.SegmentMerger.mergeNorms(SegmentMerger.java:255)
   [junit4]   2> 	at org.apache.lucene.index.SegmentMerger.merge(SegmentMerger.java:133)
   [junit4]   2> 	at org.apache.lucene.index.IndexWriter.mergeMiddle(IndexWriter.java:4173)
   [junit4]   2> 	at org.apache.lucene.index.IndexWriter.merge(IndexWriter.java:3768)
   [junit4]   2> 	at org.apache.lucene.index.ConcurrentMergeScheduler.doMerge(ConcurrentMergeScheduler.java:405)
   [junit4]   2> 	at org.apache.lucene.index.ConcurrentMergeScheduler$MergeThread.run(ConcurrentMergeScheduler.java:482)
   [junit4]   2> 
   [junit4]   2> nov 11, 2014 11:41:17 PM com.carrotsearch.randomizedtesting.RandomizedRunner$QueueUncaughtExceptionsHandler uncaughtException
   [junit4]   2> WARNING: Uncaught exception in thread: Thread[Lucene Merge Thread #15,6,TGRP-TestCompressingTermVectorsFormat]
   [junit4]   2> org.apache.lucene.index.MergePolicy$MergeException: java.lang.NullPointerException
   [junit4]   2> 	at __randomizedtesting.SeedInfo.seed([3C4832D329799907]:0)
   [junit4]   2> 	at org.apache.lucene.index.ConcurrentMergeScheduler.handleMergeException(ConcurrentMergeScheduler.java:545)
   [junit4]   2> 	at org.apache.lucene.index.ConcurrentMergeScheduler$MergeThread.run(ConcurrentMergeScheduler.java:518)
   [junit4]   2> Caused by: java.lang.NullPointerException
   [junit4]   2> 	at org.apache.lucene.codecs.lucene49.Lucene49NormsConsumer$NormMap.getOrd(Lucene49NormsConsumer.java:249)
   [junit4]   2> 	at org.apache.lucene.codecs.lucene49.Lucene49NormsConsumer.addNumericField(Lucene49NormsConsumer.java:150)
   [junit4]   2> 	at org.apache.lucene.codecs.DocValuesConsumer.mergeNumericField(DocValuesConsumer.java:129)
   [junit4]   2> 	at org.apache.lucene.index.SegmentMerger.mergeNorms(SegmentMerger.java:255)
   [junit4]   2> 	at org.apache.lucene.index.SegmentMerger.merge(SegmentMerger.java:133)
   [junit4]   2> 	at org.apache.lucene.index.IndexWriter.mergeMiddle(IndexWriter.java:4173)
   [junit4]   2> 	at org.apache.lucene.index.IndexWriter.merge(IndexWriter.java:3768)
   [junit4]   2> 	at org.apache.lucene.index.ConcurrentMergeScheduler.doMerge(ConcurrentMergeScheduler.java:405)
   [junit4]   2> 	at org.apache.lucene.index.ConcurrentMergeScheduler$MergeThread.run(ConcurrentMergeScheduler.java:482)
   [junit4]   2> 
   [junit4]   2> nov 11, 2014 11:41:18 PM com.carrotsearch.randomizedtesting.RandomizedRunner$QueueUncaughtExceptionsHandler uncaughtException
   [junit4]   2> WARNING: Uncaught exception in thread: Thread[Lucene Merge Thread #16,6,TGRP-TestCompressingTermVectorsFormat]
   [junit4]   2> org.apache.lucene.index.MergePolicy$MergeException: java.lang.NullPointerException
   [junit4]   2> 	at __randomizedtesting.SeedInfo.seed([3C4832D329799907]:0)
   [junit4]   2> 	at org.apache.lucene.index.ConcurrentMergeScheduler.handleMergeException(ConcurrentMergeScheduler.java:545)
   [junit4]   2> 	at org.apache.lucene.index.ConcurrentMergeScheduler$MergeThread.run(ConcurrentMergeScheduler.java:518)
   [junit4]   2> Caused by: java.lang.NullPointerException
   [junit4]   2> 	at org.apache.lucene.codecs.lucene49.Lucene49NormsConsumer$NormMap.getOrd(Lucene49NormsConsumer.java:249)
   [junit4]   2> 	at org.apache.lucene.codecs.lucene49.Lucene49NormsConsumer.addNumericField(Lucene49NormsConsumer.java:150)
   [junit4]   2> 	at org.apache.lucene.codecs.DocValuesConsumer.mergeNumericField(DocValuesConsumer.java:129)
   [junit4]   2> 	at org.apache.lucene.index.SegmentMerger.mergeNorms(SegmentMerger.java:255)
   [junit4]   2> 	at org.apache.lucene.index.SegmentMerger.merge(SegmentMerger.java:133)
   [junit4]   2> 	at org.apache.lucene.index.IndexWriter.mergeMiddle(IndexWriter.java:4173)
   [junit4]   2> 	at org.apache.lucene.index.IndexWriter.merge(IndexWriter.java:3768)
   [junit4]   2> 	at org.apache.lucene.index.ConcurrentMergeScheduler.doMerge(ConcurrentMergeScheduler.java:405)
   [junit4]   2> 	at org.apache.lucene.index.ConcurrentMergeScheduler$MergeThread.run(ConcurrentMergeScheduler.java:482)
   [junit4]   2> 
   [junit4]   2> nov 11, 2014 11:41:18 PM com.carrotsearch.randomizedtesting.RandomizedRunner$QueueUncaughtExceptionsHandler uncaughtException
   [junit4]   2> WARNING: Uncaught exception in thread: Thread[Lucene Merge Thread #17,6,TGRP-TestCompressingTermVectorsFormat]
   [junit4]   2> org.apache.lucene.index.MergePolicy$MergeException: java.lang.NullPointerException
   [junit4]   2> 	at __randomizedtesting.SeedInfo.seed([3C4832D329799907]:0)
   [junit4]   2> 	at org.apache.lucene.index.ConcurrentMergeScheduler.handleMergeException(ConcurrentMergeScheduler.java:545)
   [junit4]   2> 	at org.apache.lucene.index.ConcurrentMergeScheduler$MergeThread.run(ConcurrentMergeScheduler.java:518)
   [junit4]   2> Caused by: java.lang.NullPointerException
   [junit4]   2> 	at org.apache.lucene.codecs.lucene49.Lucene49NormsConsumer$NormMap.getOrd(Lucene49NormsConsumer.java:249)
   [junit4]   2> 	at org.apache.lucene.codecs.lucene49.Lucene49NormsConsumer.addNumericField(Lucene49NormsConsumer.java:150)
   [junit4]   2> 	at org.apache.lucene.codecs.DocValuesConsumer.mergeNumericField(DocValuesConsumer.java:129)
   [junit4]   2> 	at org.apache.lucene.index.SegmentMerger.mergeNorms(SegmentMerger.java:255)
   [junit4]   2> 	at org.apache.lucene.index.SegmentMerger.merge(SegmentMerger.java:133)
   [junit4]   2> 	at org.apache.lucene.index.IndexWriter.mergeMiddle(IndexWriter.java:4173)
   [junit4]   2> 	at org.apache.lucene.index.IndexWriter.merge(IndexWriter.java:3768)
   [junit4]   2> 	at org.apache.lucene.index.ConcurrentMergeScheduler.doMerge(ConcurrentMergeScheduler.java:405)
   [junit4]   2> 	at org.apache.lucene.index.ConcurrentMergeScheduler$MergeThread.run(ConcurrentMergeScheduler.java:482)
   [junit4]   2> 
   [junit4]   2> nov 11, 2014 11:41:18 PM com.carrotsearch.randomizedtesting.RandomizedRunner$QueueUncaughtExceptionsHandler uncaughtException
   [junit4]   2> WARNING: Uncaught exception in thread: Thread[Lucene Merge Thread #5,6,TGRP-TestCompressingTermVectorsFormat]
   [junit4]   2> org.apache.lucene.index.MergePolicy$MergeException: java.lang.NullPointerException
   [junit4]   2> 	at __randomizedtesting.SeedInfo.seed([3C4832D329799907]:0)
   [junit4]   2> 	at org.apache.lucene.index.ConcurrentMergeScheduler.handleMergeException(ConcurrentMergeScheduler.java:545)
   [junit4]   2> 	at org.apache.lucene.index.ConcurrentMergeScheduler$MergeThread.run(ConcurrentMergeScheduler.java:518)
   [junit4]   2> Caused by: java.lang.NullPointerException
   [junit4]   2> 	at org.apache.lucene.codecs.lucene49.Lucene49NormsConsumer$NormMap.getOrd(Lucene49NormsConsumer.java:249)
   [junit4]   2> 	at org.apache.lucene.codecs.lucene49.Lucene49NormsConsumer.addNumericField(Lucene49NormsConsumer.java:150)
   [junit4]   2> 	at org.apache.lucene.codecs.DocValuesConsumer.mergeNumericField(DocValuesConsumer.java:129)
   [junit4]   2> 	at org.apache.lucene.index.SegmentMerger.mergeNorms(SegmentMerger.java:255)
   [junit4]   2> 	at org.apache.lucene.index.SegmentMerger.merge(SegmentMerger.java:133)
   [junit4]   2> 	at org.apache.lucene.index.IndexWriter.mergeMiddle(IndexWriter.java:4173)
   [junit4]   2> 	at org.apache.lucene.index.IndexWriter.merge(IndexWriter.java:3768)
   [junit4]   2> 	at org.apache.lucene.index.ConcurrentMergeScheduler.doMerge(ConcurrentMergeScheduler.java:405)
   [junit4]   2> 	at org.apache.lucene.index.ConcurrentMergeScheduler$MergeThread.run(ConcurrentMergeScheduler.java:482)
   [junit4]   2> 
   [junit4]   2> nov 11, 2014 11:41:18 PM com.carrotsearch.randomizedtesting.RandomizedRunner$QueueUncaughtExceptionsHandler uncaughtException
   [junit4]   2> WARNING: Uncaught exception in thread: Thread[Lucene Merge Thread #18,6,TGRP-TestCompressingTermVectorsFormat]
   [junit4]   2> org.apache.lucene.index.MergePolicy$MergeException: java.lang.NullPointerException
   [junit4]   2> 	at __randomizedtesting.SeedInfo.seed([3C4832D329799907]:0)
   [junit4]   2> 	at org.apache.lucene.index.ConcurrentMergeScheduler.handleMergeException(ConcurrentMergeScheduler.java:545)
   [junit4]   2> 	at org.apache.lucene.index.ConcurrentMergeScheduler$MergeThread.run(ConcurrentMergeScheduler.java:518)
   [junit4]   2> Caused by: java.lang.NullPointerException
   [junit4]   2> 	at org.apache.lucene.codecs.lucene49.Lucene49NormsConsumer$NormMap.getOrd(Lucene49NormsConsumer.java:249)
   [junit4]   2> 	at org.apache.lucene.codecs.lucene49.Lucene49NormsConsumer.addNumericField(Lucene49NormsConsumer.java:150)
   [junit4]   2> 	at org.apache.lucene.codecs.DocValuesConsumer.mergeNumericField(DocValuesConsumer.java:129)
   [junit4]   2> 	at org.apache.lucene.index.SegmentMerger.mergeNorms(SegmentMerger.java:255)
   [junit4]   2> 	at org.apache.lucene.index.SegmentMerger.merge(SegmentMerger.java:133)
   [junit4]   2> 	at org.apache.lucene.index.IndexWriter.mergeMiddle(IndexWriter.java:4173)
   [junit4]   2> 	at org.apache.lucene.index.IndexWriter.merge(IndexWriter.java:3768)
   [junit4]   2> 	at org.apache.lucene.index.ConcurrentMergeScheduler.doMerge(ConcurrentMergeScheduler.java:405)
   [junit4]   2> 	at org.apache.lucene.index.ConcurrentMergeScheduler$MergeThread.run(ConcurrentMergeScheduler.java:482)
   [junit4]   2> 
   [junit4]   2> nov 11, 2014 11:41:19 PM com.carrotsearch.randomizedtesting.RandomizedRunner$QueueUncaughtExceptionsHandler uncaughtException
   [junit4]   2> WARNING: Uncaught exception in thread: Thread[Lucene Merge Thread #20,6,TGRP-TestCompressingTermVectorsFormat]
   [junit4]   2> org.apache.lucene.index.MergePolicy$MergeException: java.lang.NullPointerException
   [junit4]   2> 	at __randomizedtesting.SeedInfo.seed([3C4832D329799907]:0)
   [junit4]   2> 	at org.apache.lucene.index.ConcurrentMergeScheduler.handleMergeException(ConcurrentMergeScheduler.java:545)
   [junit4]   2> 	at org.apache.lucene.index.ConcurrentMergeScheduler$MergeThread.run(ConcurrentMergeScheduler.java:518)
   [junit4]   2> Caused by: java.lang.NullPointerException
   [junit4]   2> 	at org.apache.lucene.codecs.lucene49.Lucene49NormsConsumer$NormMap.getOrd(Lucene49NormsConsumer.java:249)
   [junit4]   2> 	at org.apache.lucene.codecs.lucene49.Lucene49NormsConsumer.addNumericField(Lucene49NormsConsumer.java:150)
   [junit4]   2> 	at org.apache.lucene.codecs.DocValuesConsumer.mergeNumericField(DocValuesConsumer.java:129)
   [junit4]   2> 	at org.apache.lucene.index.SegmentMerger.mergeNorms(SegmentMerger.java:255)
   [junit4]   2> 	at org.apache.lucene.index.SegmentMerger.merge(SegmentMerger.java:133)
   [junit4]   2> 	at org.apache.lucene.index.IndexWriter.mergeMiddle(IndexWriter.java:4173)
   [junit4]   2> 	at org.apache.lucene.index.IndexWriter.merge(IndexWriter.java:3768)
   [junit4]   2> 	at org.apache.lucene.index.ConcurrentMergeScheduler.doMerge(ConcurrentMergeScheduler.java:405)
   [junit4]   2> 	at org.apache.lucene.index.ConcurrentMergeScheduler$MergeThread.run(ConcurrentMergeScheduler.java:482)
   [junit4]   2> 
   [junit4]   2> nov 11, 2014 11:41:19 PM com.carrotsearch.randomizedtesting.RandomizedRunner$QueueUncaughtExceptionsHandler uncaughtException
   [junit4]   2> WARNING: Uncaught exception in thread: Thread[Lucene Merge Thread #21,6,TGRP-TestCompressingTermVectorsFormat]
   [junit4]   2> org.apache.lucene.index.MergePolicy$MergeException: java.lang.NullPointerException
   [junit4]   2> 	at __randomizedtesting.SeedInfo.seed([3C4832D329799907]:0)
   [junit4]   2> 	at org.apache.lucene.index.ConcurrentMergeScheduler.handleMergeException(ConcurrentMergeScheduler.java:545)
   [junit4]   2> 	at org.apache.lucene.index.ConcurrentMergeScheduler$MergeThread.run(ConcurrentMergeScheduler.java:518)
   [junit4]   2> Caused by: java.lang.NullPointerException
   [junit4]   2> 	at org.apache.lucene.codecs.lucene49.Lucene49NormsConsumer$NormMap.getOrd(Lucene49NormsConsumer.java:249)
   [junit4]   2> 	at org.apache.lucene.codecs.lucene49.Lucene49NormsConsumer.addNumericField(Lucene49NormsConsumer.java:150)
   [junit4]   2> 	at org.apache.lucene.codecs.DocValuesConsumer.mergeNumericField(DocValuesConsumer.java:129)
   [junit4]   2> 	at org.apache.lucene.index.SegmentMerger.mergeNorms(SegmentMerger.java:255)
   [junit4]   2> 	at org.apache.lucene.index.SegmentMerger.merge(SegmentMerger.java:133)
   [junit4]   2> 	at org.apache.lucene.index.IndexWriter.mergeMiddle(IndexWriter.java:4173)
   [junit4]   2> 	at org.apache.lucene.index.IndexWriter.merge(IndexWriter.java:3768)
   [junit4]   2> 	at org.apache.lucene.index.ConcurrentMergeScheduler.doMerge(ConcurrentMergeScheduler.java:405)
   [junit4]   2> 	at org.apache.lucene.index.ConcurrentMergeScheduler$MergeThread.run(ConcurrentMergeScheduler.java:482)
   [junit4]   2> 
   [junit4]   2> nov 11, 2014 11:41:19 PM com.carrotsearch.randomizedtesting.RandomizedRunner$QueueUncaughtExceptionsHandler uncaughtException
   [junit4]   2> WARNING: Uncaught exception in thread: Thread[Lucene Merge Thread #22,6,TGRP-TestCompressingTermVectorsFormat]
   [junit4]   2> org.apache.lucene.index.MergePolicy$MergeException: java.lang.NullPointerException
   [junit4]   2> 	at __randomizedtesting.SeedInfo.seed([3C4832D329799907]:0)
   [junit4]   2> 	at org.apache.lucene.index.ConcurrentMergeScheduler.handleMergeException(ConcurrentMergeScheduler.java:545)
   [junit4]   2> 	at org.apache.lucene.index.ConcurrentMergeScheduler$MergeThread.run(ConcurrentMergeScheduler.java:518)
   [junit4]   2> Caused by: java.lang.NullPointerException
   [junit4]   2> 	at org.apache.lucene.codecs.lucene49.Lucene49NormsConsumer$NormMap.getOrd(Lucene49NormsConsumer.java:249)
   [junit4]   2> 	at org.apache.lucene.codecs.lucene49.Lucene49NormsConsumer.addNumericField(Lucene49NormsConsumer.java:150)
   [junit4]   2> 	at org.apache.lucene.codecs.DocValuesConsumer.mergeNumericField(DocValuesConsumer.java:129)
   [junit4]   2> 	at org.apache.lucene.index.SegmentMerger.mergeNorms(SegmentMerger.java:255)
   [junit4]   2> 	at org.apache.lucene.index.SegmentMerger.merge(SegmentMerger.java:133)
   [junit4]   2> 	at org.apache.lucene.index.IndexWriter.mergeMiddle(IndexWriter.java:4173)
   [junit4]   2> 	at org.apache.lucene.index.IndexWriter.merge(IndexWriter.java:3768)
   [junit4]   2> 	at org.apache.lucene.index.ConcurrentMergeScheduler.doMerge(ConcurrentMergeScheduler.java:405)
   [junit4]   2> 	at org.apache.lucene.index.ConcurrentMergeScheduler$MergeThread.run(ConcurrentMergeScheduler.java:482)
   [junit4]   2> 
   [junit4]   2> nov 11, 2014 11:41:20 PM com.carrotsearch.randomizedtesting.RandomizedRunner$QueueUncaughtExceptionsHandler uncaughtException
   [junit4]   2> WARNING: Uncaught exception in thread: Thread[Lucene Merge Thread #23,6,TGRP-TestCompressingTermVectorsFormat]
   [junit4]   2> org.apache.lucene.index.MergePolicy$MergeException: java.lang.NullPointerException
   [junit4]   2> 	at __randomizedtesting.SeedInfo.seed([3C4832D329799907]:0)
   [junit4]   2> 	at org.apache.lucene.index.ConcurrentMergeScheduler.handleMergeException(ConcurrentMergeScheduler.java:545)
   [junit4]   2> 	at org.apache.lucene.index.ConcurrentMergeScheduler$MergeThread.run(ConcurrentMergeScheduler.java:518)
   [junit4]   2> Caused by: java.lang.NullPointerException
   [junit4]   2> 	at org.apache.lucene.codecs.lucene49.Lucene49NormsConsumer$NormMap.getOrd(Lucene49NormsConsumer.java:249)
   [junit4]   2> 	at org.apache.lucene.codecs.lucene49.Lucene49NormsConsumer.addNumericField(Lucene49NormsConsumer.java:150)
   [junit4]   2> 	at org.apache.lucene.codecs.DocValuesConsumer.mergeNumericField(DocValuesConsumer.java:129)
   [junit4]   2> 	at org.apache.lucene.index.SegmentMerger.mergeNorms(SegmentMerger.java:255)
   [junit4]   2> 	at org.apache.lucene.index.SegmentMerger.merge(SegmentMerger.java:133)
   [junit4]   2> 	at org.apache.lucene.index.IndexWriter.mergeMiddle(IndexWriter.java:4173)
   [junit4]   2> 	at org.apache.lucene.index.IndexWriter.merge(IndexWriter.java:3768)
   [junit4]   2> 	at org.apache.lucene.index.ConcurrentMergeScheduler.doMerge(ConcurrentMergeScheduler.java:405)
   [junit4]   2> 	at org.apache.lucene.index.ConcurrentMergeScheduler$MergeThread.run(ConcurrentMergeScheduler.java:482)
   [junit4]   2> 
   [junit4]   2> nov 11, 2014 11:41:20 PM com.carrotsearch.randomizedtesting.RandomizedRunner$QueueUncaughtExceptionsHandler uncaughtException
   [junit4]   2> WARNING: Uncaught exception in thread: Thread[Lucene Merge Thread #24,6,TGRP-TestCompressingTermVectorsFormat]
   [junit4]   2> org.apache.lucene.index.MergePolicy$MergeException: java.lang.NullPointerException
   [junit4]   2> 	at __randomizedtesting.SeedInfo.seed([3C4832D329799907]:0)
   [junit4]   2> 	at org.apache.lucene.index.ConcurrentMergeScheduler.handleMergeException(ConcurrentMergeScheduler.java:545)
   [junit4]   2> 	at org.apache.lucene.index.ConcurrentMergeScheduler$MergeThread.run(ConcurrentMergeScheduler.java:518)
   [junit4]   2> Caused by: java.lang.NullPointerException
   [junit4]   2> 	at org.apache.lucene.codecs.lucene49.Lucene49NormsConsumer$NormMap.getOrd(Lucene49NormsConsumer.java:249)
   [junit4]   2> 	at org.apache.lucene.codecs.lucene49.Lucene49NormsConsumer.addNumericField(Lucene49NormsConsumer.java:150)
   [junit4]   2> 	at org.apache.lucene.codecs.DocValuesConsumer.mergeNumericField(DocValuesConsumer.java:129)
   [junit4]   2> 	at org.apache.lucene.index.SegmentMerger.mergeNorms(SegmentMerger.java:255)
   [junit4]   2> 	at org.apache.lucene.index.SegmentMerger.merge(SegmentMerger.java:133)
   [junit4]   2> 	at org.apache.lucene.index.IndexWriter.mergeMiddle(IndexWriter.java:4173)
   [junit4]   2> 	at org.apache.lucene.index.IndexWriter.merge(IndexWriter.java:3768)
   [junit4]   2> 	at org.apache.lucene.index.ConcurrentMergeScheduler.doMerge(ConcurrentMergeScheduler.java:405)
   [junit4]   2> 	at org.apache.lucene.index.ConcurrentMergeScheduler$MergeThread.run(ConcurrentMergeScheduler.java:482)
   [junit4]   2> 
   [junit4]   2> nov 11, 2014 11:41:20 PM com.carrotsearch.randomizedtesting.RandomizedRunner$QueueUncaughtExceptionsHandler uncaughtException
   [junit4]   2> WARNING: Uncaught exception in thread: Thread[Lucene Merge Thread #25,6,TGRP-TestCompressingTermVectorsFormat]
   [junit4]   2> org.apache.lucene.index.MergePolicy$MergeException: java.lang.NullPointerException
   [junit4]   2> 	at __randomizedtesting.SeedInfo.seed([3C4832D329799907]:0)
   [junit4]   2> 	at org.apache.lucene.index.ConcurrentMergeScheduler.handleMergeException(ConcurrentMergeScheduler.java:545)
   [junit4]   2> 	at org.apache.lucene.index.ConcurrentMergeScheduler$MergeThread.run(ConcurrentMergeScheduler.java:518)
   [junit4]   2> Caused by: java.lang.NullPointerException
   [junit4]   2> 	at org.apache.lucene.codecs.lucene49.Lucene49NormsConsumer$NormMap.getOrd(Lucene49NormsConsumer.java:249)
   [junit4]   2> 	at org.apache.lucene.codecs.lucene49.Lucene49NormsConsumer.addNumericField(Lucene49NormsConsumer.java:150)
   [junit4]   2> 	at org.apache.lucene.codecs.DocValuesConsumer.mergeNumericField(DocValuesConsumer.java:129)
   [junit4]   2> 	at org.apache.lucene.index.SegmentMerger.mergeNorms(SegmentMerger.java:255)
   [junit4]   2> 	at org.apache.lucene.index.SegmentMerger.merge(SegmentMerger.java:133)
   [junit4]   2> 	at org.apache.lucene.index.IndexWriter.mergeMiddle(IndexWriter.java:4173)
   [junit4]   2> 	at org.apache.lucene.index.IndexWriter.merge(IndexWriter.java:3768)
   [junit4]   2> 	at org.apache.lucene.index.ConcurrentMergeScheduler.doMerge(ConcurrentMergeScheduler.java:405)
   [junit4]   2> 	at org.apache.lucene.index.ConcurrentMergeScheduler$MergeThread.run(ConcurrentMergeScheduler.java:482)
   [junit4]   2> 
   [junit4]   2> nov 11, 2014 11:41:21 PM com.carrotsearch.randomizedtesting.RandomizedRunner$QueueUncaughtExceptionsHandler uncaughtException
   [junit4]   2> WARNING: Uncaught exception in thread: Thread[Lucene Merge Thread #26,6,TGRP-TestCompressingTermVectorsFormat]
   [junit4]   2> org.apache.lucene.index.MergePolicy$MergeException: java.lang.NullPointerException
   [junit4]   2> 	at __randomizedtesting.SeedInfo.seed([3C4832D329799907]:0)
   [junit4]   2> 	at org.apache.lucene.index.ConcurrentMergeScheduler.handleMergeException(ConcurrentMergeScheduler.java:545)
   [junit4]   2> 	at org.apache.lucene.index.ConcurrentMergeScheduler$MergeThread.run(ConcurrentMergeScheduler.java:518)
   [junit4]   2> Caused by: java.lang.NullPointerException
   [junit4]   2> 	at org.apache.lucene.codecs.lucene49.Lucene49NormsConsumer$NormMap.getOrd(Lucene49NormsConsumer.java:249)
   [junit4]   2> 	at org.apache.lucene.codecs.lucene49.Lucene49NormsConsumer.addNumericField(Lucene49NormsConsumer.java:150)
   [junit4]   2> 	at org.apache.lucene.codecs.DocValuesConsumer.mergeNumericField(DocValuesConsumer.java:129)
   [junit4]   2> 	at org.apache.lucene.index.SegmentMerger.mergeNorms(SegmentMerger.java:255)
   [junit4]   2> 	at org.apache.lucene.index.SegmentMerger.merge(SegmentMerger.java:133)
   [junit4]   2> 	at org.apache.lucene.index.IndexWriter.mergeMiddle(IndexWriter.java:4173)
   [junit4]   2> 	at org.apache.lucene.index.IndexWriter.merge(IndexWriter.java:3768)
   [junit4]   2> 	at org.apache.lucene.index.ConcurrentMergeScheduler.doMerge(ConcurrentMergeScheduler.java:405)
   [junit4]   2> 	at org.apache.lucene.index.ConcurrentMergeScheduler$MergeThread.run(ConcurrentMergeScheduler.java:482)
   [junit4]   2> 
   [junit4]   2> nov 11, 2014 11:41:21 PM com.carrotsearch.randomizedtesting.RandomizedRunner$QueueUncaughtExceptionsHandler uncaughtException
   [junit4]   2> WARNING: Uncaught exception in thread: Thread[Lucene Merge Thread #27,6,TGRP-TestCompressingTermVectorsFormat]
   [junit4]   2> org.apache.lucene.index.MergePolicy$MergeException: java.lang.NullPointerException
   [junit4]   2> 	at __randomizedtesting.SeedInfo.seed([3C4832D329799907]:0)
   [junit4]   2> 	at org.apache.lucene.index.ConcurrentMergeScheduler.handleMergeException(ConcurrentMergeScheduler.java:545)
   [junit4]   2> 	at org.apache.lucene.index.ConcurrentMergeScheduler$MergeThread.run(ConcurrentMergeScheduler.java:518)
   [junit4]   2> Caused by: java.lang.NullPointerException
   [junit4]   2> 	at org.apache.lucene.codecs.lucene49.Lucene49NormsConsumer$NormMap.getOrd(Lucene49NormsConsumer.java:249)
   [junit4]   2> 	at org.apache.lucene.codecs.lucene49.Lucene49NormsConsumer.addNumericField(Lucene49NormsConsumer.java:150)
   [junit4]   2> 	at org.apache.lucene.codecs.DocValuesConsumer.mergeNumericField(DocValuesConsumer.java:129)
   [junit4]   2> 	at org.apache.lucene.index.SegmentMerger.mergeNorms(SegmentMerger.java:255)
   [junit4]   2> 	at org.apache.lucene.index.SegmentMerger.merge(SegmentMerger.java:133)
   [junit4]   2> 	at org.apache.lucene.index.IndexWriter.mergeMiddle(IndexWriter.java:4173)
   [junit4]   2> 	at org.apache.lucene.index.IndexWriter.merge(IndexWriter.java:3768)
   [junit4]   2> 	at org.apache.lucene.index.ConcurrentMergeScheduler.doMerge(ConcurrentMergeScheduler.java:405)
   [junit4]   2> 	at org.apache.lucene.index.ConcurrentMergeScheduler$MergeThread.run(ConcurrentMergeScheduler.java:482)
   [junit4]   2> 
   [junit4]   2> nov 11, 2014 11:41:22 PM com.carrotsearch.randomizedtesting.RandomizedRunner$QueueUncaughtExceptionsHandler uncaughtException
   [junit4]   2> WARNING: Uncaught exception in thread: Thread[Lucene Merge Thread #28,6,TGRP-TestCompressingTermVectorsFormat]
   [junit4]   2> org.apache.lucene.index.MergePolicy$MergeException: java.lang.NullPointerException
   [junit4]   2> 	at __randomizedtesting.SeedInfo.seed([3C4832D329799907]:0)
   [junit4]   2> 	at org.apache.lucene.index.ConcurrentMergeScheduler.handleMergeException(ConcurrentMergeScheduler.java:545)
   [junit4]   2> 	at org.apache.lucene.index.ConcurrentMergeScheduler$MergeThread.run(ConcurrentMergeScheduler.java:518)
   [junit4]   2> Caused by: java.lang.NullPointerException
   [junit4]   2> 	at org.apache.lucene.codecs.lucene49.Lucene49NormsConsumer$NormMap.getOrd(Lucene49NormsConsumer.java:249)
   [junit4]   2> 	at org.apache.lucene.codecs.lucene49.Lucene49NormsConsumer.addNumericField(Lucene49NormsConsumer.java:150)
   [junit4]   2> 	at org.apache.lucene.codecs.DocValuesConsumer.mergeNumericField(DocValuesConsumer.java:129)
   [junit4]   2> 	at org.apache.lucene.index.SegmentMerger.mergeNorms(SegmentMerger.java:255)
   [junit4]   2> 	at org.apache.lucene.index.SegmentMerger.merge(SegmentMerger.java:133)
   [junit4]   2> 	at org.apache.lucene.index.IndexWriter.mergeMiddle(IndexWriter.java:4173)
   [junit4]   2> 	at org.apache.lucene.index.IndexWriter.merge(IndexWriter.java:3768)
   [junit4]   2> 	at org.apache.lucene.index.ConcurrentMergeScheduler.doMerge(ConcurrentMergeScheduler.java:405)
   [junit4]   2> 	at org.apache.lucene.index.ConcurrentMergeScheduler$MergeThread.run(ConcurrentMergeScheduler.java:482)
   [junit4]   2> 
   [junit4]   2> nov 11, 2014 11:41:22 PM com.carrotsearch.randomizedtesting.RandomizedRunner$QueueUncaughtExceptionsHandler uncaughtException
   [junit4]   2> WARNING: Uncaught exception in thread: Thread[Lucene Merge Thread #29,6,TGRP-TestCompressingTermVectorsFormat]
   [junit4]   2> org.apache.lucene.index.MergePolicy$MergeException: java.lang.NullPointerException
   [junit4]   2> 	at __randomizedtesting.SeedInfo.seed([3C4832D329799907]:0)
   [junit4]   2> 	at org.apache.lucene.index.ConcurrentMergeScheduler.handleMergeException(ConcurrentMergeScheduler.java:545)
   [junit4]   2> 	at org.apache.lucene.index.ConcurrentMergeScheduler$MergeThread.run(ConcurrentMergeScheduler.java:518)
   [junit4]   2> Caused by: java.lang.NullPointerException
   [junit4]   2> 	at org.apache.lucene.codecs.lucene49.Lucene49NormsConsumer$NormMap.getOrd(Lucene49NormsConsumer.java:249)
   [junit4]   2> 	at org.apache.lucene.codecs.lucene49.Lucene49NormsConsumer.addNumericField(Lucene49NormsConsumer.java:150)
   [junit4]   2> 	at org.apache.lucene.codecs.DocValuesConsumer.mergeNumericField(DocValuesConsumer.java:129)
   [junit4]   2> 	at org.apache.lucene.index.SegmentMerger.mergeNorms(SegmentMerger.java:255)
   [junit4]   2> 	at org.apache.lucene.index.SegmentMerger.merge(SegmentMerger.java:133)
   [junit4]   2> 	at org.apache.lucene.index.IndexWriter.mergeMiddle(IndexWriter.java:4173)
   [junit4]   2> 	at org.apache.lucene.index.IndexWriter.merge(IndexWriter.java:3768)
   [junit4]   2> 	at org.apache.lucene.index.ConcurrentMergeScheduler.doMerge(ConcurrentMergeScheduler.java:405)
   [junit4]   2> 	at org.apache.lucene.index.ConcurrentMergeScheduler$MergeThread.run(ConcurrentMergeScheduler.java:482)
   [junit4]   2> 
   [junit4]   2> nov 11, 2014 11:41:22 PM com.carrotsearch.randomizedtesting.RandomizedRunner$QueueUncaughtExceptionsHandler uncaughtException
   [junit4]   2> WARNING: Uncaught exception in thread: Thread[Lucene Merge Thread #30,6,TGRP-TestCompressingTermVectorsFormat]
   [junit4]   2> org.apache.lucene.index.MergePolicy$MergeException: java.lang.NullPointerException
   [junit4]   2> 	at __randomizedtesting.SeedInfo.seed([3C4832D329799907]:0)
   [junit4]   2> 	at org.apache.lucene.index.ConcurrentMergeScheduler.handleMergeException(ConcurrentMergeScheduler.java:545)
   [junit4]   2> 	at org.apache.lucene.index.ConcurrentMergeScheduler$MergeThread.run(ConcurrentMergeScheduler.java:518)
   [junit4]   2> Caused by: java.lang.NullPointerException
   [junit4]   2> 	at org.apache.lucene.codecs.lucene49.Lucene49NormsConsumer$NormMap.getOrd(Lucene49NormsConsumer.java:249)
   [junit4]   2> 	at org.apache.lucene.codecs.lucene49.Lucene49NormsConsumer.addNumericField(Lucene49NormsConsumer.java:150)
   [junit4]   2> 	at org.apache.lucene.codecs.DocValuesConsumer.mergeNumericField(DocValuesConsumer.java:129)
   [junit4]   2> 	at org.apache.lucene.index.SegmentMerger.mergeNorms(SegmentMerger.java:255)
   [junit4]   2> 	at org.apache.lucene.index.SegmentMerger.merge(SegmentMerger.java:133)
   [junit4]   2> 	at org.apache.lucene.index.IndexWriter.mergeMiddle(IndexWriter.java:4173)
   [junit4]   2> 	at org.apache.lucene.index.IndexWriter.merge(IndexWriter.java:3768)
   [junit4]   2> 	at org.apache.lucene.index.ConcurrentMergeScheduler.doMerge(ConcurrentMergeScheduler.java:405)
   [junit4]   2> 	at org.apache.lucene.index.ConcurrentMergeScheduler$MergeThread.run(ConcurrentMergeScheduler.java:482)
   [junit4]   2> 
   [junit4]   2> nov 11, 2014 11:41:23 PM com.carrotsearch.randomizedtesting.RandomizedRunner$QueueUncaughtExceptionsHandler uncaughtException
   [junit4]   2> WARNING: Uncaught exception in thread: Thread[Lucene Merge Thread #31,6,TGRP-TestCompressingTermVectorsFormat]
   [junit4]   2> org.apache.lucene.index.MergePolicy$MergeException: java.lang.NullPointerException
   [junit4]   2> 	at __randomizedtesting.SeedInfo.seed([3C4832D329799907]:0)
   [junit4]   2> 	at org.apache.lucene.index.ConcurrentMergeScheduler.handleMergeException(ConcurrentMergeScheduler.java:545)
   [junit4]   2> 	at org.apache.lucene.index.ConcurrentMergeScheduler$MergeThread.run(ConcurrentMergeScheduler.java:518)
   [junit4]   2> Caused by: java.lang.NullPointerException
   [junit4]   2> 	at org.apache.lucene.codecs.lucene49.Lucene49NormsConsumer$NormMap.getOrd(Lucene49NormsConsumer.java:249)
   [junit4]   2> 	at org.apache.lucene.codecs.lucene49.Lucene49NormsConsumer.addNumericField(Lucene49NormsConsumer.java:150)
   [junit4]   2> 	at org.apache.lucene.codecs.DocValuesConsumer.mergeNumericField(DocValuesConsumer.java:129)
   [junit4]   2> 	at org.apache.lucene.index.SegmentMerger.mergeNorms(SegmentMerger.java:255)
   [junit4]   2> 	at org.apache.lucene.index.SegmentMerger.merge(SegmentMerger.java:133)
   [junit4]   2> 	at org.apache.lucene.index.IndexWriter.mergeMiddle(IndexWriter.java:4173)
   [junit4]   2> 	at org.apache.lucene.index.IndexWriter.merge(IndexWriter.java:3768)
   [junit4]   2> 	at org.apache.lucene.index.ConcurrentMergeScheduler.doMerge(ConcurrentMergeScheduler.java:405)
   [junit4]   2> 	at org.apache.lucene.index.ConcurrentMergeScheduler$MergeThread.run(ConcurrentMergeScheduler.java:482)
   [junit4]   2> 
   [junit4]   2> nov 11, 2014 11:41:23 PM com.carrotsearch.randomizedtesting.RandomizedRunner$QueueUncaughtExceptionsHandler uncaughtException
   [junit4]   2> WARNING: Uncaught exception in thread: Thread[Lucene Merge Thread #32,6,TGRP-TestCompressingTermVectorsFormat]
   [junit4]   2> org.apache.lucene.index.MergePolicy$MergeException: java.lang.NullPointerException
   [junit4]   2> 	at __randomizedtesting.SeedInfo.seed([3C4832D329799907]:0)
   [junit4]   2> 	at org.apache.lucene.index.ConcurrentMergeScheduler.handleMergeException(ConcurrentMergeScheduler.java:545)
   [junit4]   2> 	at org.apache.lucene.index.ConcurrentMergeScheduler$MergeThread.run(ConcurrentMergeScheduler.java:518)
   [junit4]   2> Caused by: java.lang.NullPointerException
   [junit4]   2> 	at org.apache.lucene.codecs.lucene49.Lucene49NormsConsumer$NormMap.getOrd(Lucene49NormsConsumer.java:249)
   [junit4]   2> 	at org.apache.lucene.codecs.lucene49.Lucene49NormsConsumer.addNumericField(Lucene49NormsConsumer.java:150)
   [junit4]   2> 	at org.apache.lucene.codecs.DocValuesConsumer.mergeNumericField(DocValuesConsumer.java:129)
   [junit4]   2> 	at org.apache.lucene.index.SegmentMerger.mergeNorms(SegmentMerger.java:255)
   [junit4]   2> 	at org.apache.lucene.index.SegmentMerger.merge(SegmentMerger.java:133)
   [junit4]   2> 	at org.apache.lucene.index.IndexWriter.mergeMiddle(IndexWriter.java:4173)
   [junit4]   2> 	at org.apache.lucene.index.IndexWriter.merge(IndexWriter.java:3768)
   [junit4]   2> 	at org.apache.lucene.index.ConcurrentMergeScheduler.doMerge(ConcurrentMergeScheduler.java:405)
   [junit4]   2> 	at org.apache.lucene.index.ConcurrentMergeScheduler$MergeThread.run(ConcurrentMergeScheduler.java:482)
   [junit4]   2> 
   [junit4]   2> nov 11, 2014 11:41:23 PM com.carrotsearch.randomizedtesting.RandomizedRunner$QueueUncaughtExceptionsHandler uncaughtException
   [junit4]   2> WARNING: Uncaught exception in thread: Thread[Lucene Merge Thread #33,6,TGRP-TestCompressingTermVectorsFormat]
   [junit4]   2> org.apache.lucene.index.MergePolicy$MergeException: java.lang.NullPointerException
   [junit4]   2> 	at __randomizedtesting.SeedInfo.seed([3C4832D329799907]:0)
   [junit4]   2> 	at org.apache.lucene.index.ConcurrentMergeScheduler.handleMergeException(ConcurrentMergeScheduler.java:545)
   [junit4]   2> 	at org.apache.lucene.index.ConcurrentMergeScheduler$MergeThread.run(ConcurrentMergeScheduler.java:518)
   [junit4]   2> Caused by: java.lang.NullPointerException
   [junit4]   2> 	at org.apache.lucene.codecs.lucene49.Lucene49NormsConsumer$NormMap.getOrd(Lucene49NormsConsumer.java:249)
   [junit4]   2> 	at org.apache.lucene.codecs.lucene49.Lucene49NormsConsumer.addNumericField(Lucene49NormsConsumer.java:150)
   [junit4]   2> 	at org.apache.lucene.codecs.DocValuesConsumer.mergeNumericField(DocValuesConsumer.java:129)
   [junit4]   2> 	at org.apache.lucene.index.SegmentMerger.mergeNorms(SegmentMerger.java:255)
   [junit4]   2> 	at org.apache.lucene.index.SegmentMerger.merge(SegmentMerger.java:133)
   [junit4]   2> 	at org.apache.lucene.index.IndexWriter.mergeMiddle(IndexWriter.java:4173)
   [junit4]   2> 	at org.apache.lucene.index.IndexWriter.merge(IndexWriter.java:3768)
   [junit4]   2> 	at org.apache.lucene.index.ConcurrentMergeScheduler.doMerge(ConcurrentMergeScheduler.java:405)
   [junit4]   2> 	at org.apache.lucene.index.ConcurrentMergeScheduler$MergeThread.run(ConcurrentMergeScheduler.java:482)
   [junit4]   2> 
   [junit4]   2> nov 11, 2014 11:41:24 PM com.carrotsearch.randomizedtesting.RandomizedRunner$QueueUncaughtExceptionsHandler uncaughtException
   [junit4]   2> WARNING: Uncaught exception in thread: Thread[Lucene Merge Thread #34,6,TGRP-TestCompressingTermVectorsFormat]
   [junit4]   2> org.apache.lucene.index.MergePolicy$MergeException: java.lang.NullPointerException
   [junit4]   2> 	at __randomizedtesting.SeedInfo.seed([3C4832D329799907]:0)
   [junit4]   2> 	at org.apache.lucene.index.ConcurrentMergeScheduler.handleMergeException(ConcurrentMergeScheduler.java:545)
   [junit4]   2> 	at org.apache.lucene.index.ConcurrentMergeScheduler$MergeThread.run(ConcurrentMergeScheduler.java:518)
   [junit4]   2> Caused by: java.lang.NullPointerException
   [junit4]   2> 	at org.apache.lucene.codecs.lucene49.Lucene49NormsConsumer$NormMap.getOrd(Lucene49NormsConsumer.java:249)
   [junit4]   2> 	at org.apache.lucene.codecs.lucene49.Lucene49NormsConsumer.addNumericField(Lucene49NormsConsumer.java:150)
   [junit4]   2> 	at org.apache.lucene.codecs.DocValuesConsumer.mergeNumericField(DocValuesConsumer.java:129)
   [junit4]   2> 	at org.apache.lucene.index.SegmentMerger.mergeNorms(SegmentMerger.java:255)
   [junit4]   2> 	at org.apache.lucene.index.SegmentMerger.merge(SegmentMerger.java:133)
   [junit4]   2> 	at org.apache.lucene.index.IndexWriter.mergeMiddle(IndexWriter.java:4173)
   [junit4]   2> 	at org.apache.lucene.index.IndexWriter.merge(IndexWriter.java:3768)
   [junit4]   2> 	at org.apache.lucene.index.ConcurrentMergeScheduler.doMerge(ConcurrentMergeScheduler.java:405)
   [junit4]   2> 	at org.apache.lucene.index.ConcurrentMergeScheduler$MergeThread.run(ConcurrentMergeScheduler.java:482)
   [junit4]   2> 
   [junit4]   2> nov 11, 2014 11:41:24 PM com.carrotsearch.randomizedtesting.RandomizedRunner$QueueUncaughtExceptionsHandler uncaughtException
   [junit4]   2> WARNING: Uncaught exception in thread: Thread[Lucene Merge Thread #19,6,TGRP-TestCompressingTermVectorsFormat]
   [junit4]   2> org.apache.lucene.index.MergePolicy$MergeException: java.lang.NullPointerException
   [junit4]   2> 	at __randomizedtesting.SeedInfo.seed([3C4832D329799907]:0)
   [junit4]   2> 	at org.apache.lucene.index.ConcurrentMergeScheduler.handleMergeException(ConcurrentMergeScheduler.java:545)
   [junit4]   2> 	at org.apache.lucene.index.ConcurrentMergeScheduler$MergeThread.run(ConcurrentMergeScheduler.java:518)
   [junit4]   2> Caused by: java.lang.NullPointerException
   [junit4]   2> 	at org.apache.lucene.codecs.lucene49.Lucene49NormsConsumer$NormMap.getOrd(Lucene49NormsConsumer.java:249)
   [junit4]   2> 	at org.apache.lucene.codecs.lucene49.Lucene49NormsConsumer.addNumericField(Lucene49NormsConsumer.java:150)
   [junit4]   2> 	at org.apache.lucene.codecs.DocValuesConsumer.mergeNumericField(DocValuesConsumer.java:129)
   [junit4]   2> 	at org.apache.lucene.index.SegmentMerger.mergeNorms(SegmentMerger.java:255)
   [junit4]   2> 	at org.apache.lucene.index.SegmentMerger.merge(SegmentMerger.java:133)
   [junit4]   2> 	at org.apache.lucene.index.IndexWriter.mergeMiddle(IndexWriter.java:4173)
   [junit4]   2> 	at org.apache.lucene.index.IndexWriter.merge(IndexWriter.java:3768)
   [junit4]   2> 	at org.apache.lucene.index.ConcurrentMergeScheduler.doMerge(ConcurrentMergeScheduler.java:405)
   [junit4]   2> 	at org.apache.lucene.index.ConcurrentMergeScheduler$MergeThread.run(ConcurrentMergeScheduler.java:482)
   [junit4]   2> 
   [junit4]   2> nov 11, 2014 11:41:24 PM com.carrotsearch.randomizedtesting.RandomizedRunner$QueueUncaughtExceptionsHandler uncaughtException
   [junit4]   2> WARNING: Uncaught exception in thread: Thread[Lucene Merge Thread #35,6,TGRP-TestCompressingTermVectorsFormat]
   [junit4]   2> org.apache.lucene.index.MergePolicy$MergeException: java.lang.NullPointerException
   [junit4]   2> 	at __randomizedtesting.SeedInfo.seed([3C4832D329799907]:0)
   [junit4]   2> 	at org.apache.lucene.index.ConcurrentMergeScheduler.handleMergeException(ConcurrentMergeScheduler.java:545)
   [junit4]   2> 	at org.apache.lucene.index.ConcurrentMergeScheduler$MergeThread.run(ConcurrentMergeScheduler.java:518)
   [junit4]   2> Caused by: java.lang.NullPointerException
   [junit4]   2> 	at org.apache.lucene.codecs.lucene49.Lucene49NormsConsumer$NormMap.getOrd(Lucene49NormsConsumer.java:249)
   [junit4]   2> 	at org.apache.lucene.codecs.lucene49.Lucene49NormsConsumer.addNumericField(Lucene49NormsConsumer.java:150)
   [junit4]   2> 	at org.apache.lucene.codecs.DocValuesConsumer.mergeNumericField(DocValuesConsumer.java:129)
   [junit4]   2> 	at org.apache.lucene.index.SegmentMerger.mergeNorms(SegmentMerger.java:255)
   [junit4]   2> 	at org.apache.lucene.index.SegmentMerger.merge(SegmentMerger.java:133)
   [junit4]   2> 	at org.apache.lucene.index.IndexWriter.mergeMiddle(IndexWriter.java:4173)
   [junit4]   2> 	at org.apache.lucene.index.IndexWriter.merge(IndexWriter.java:3768)
   [junit4]   2> 	at org.apache.lucene.index.ConcurrentMergeScheduler.doMerge(ConcurrentMergeScheduler.java:405)
   [junit4]   2> 	at org.apache.lucene.index.ConcurrentMergeScheduler$MergeThread.run(ConcurrentMergeScheduler.java:482)
   [junit4]   2> 
   [junit4]   2> nov 11, 2014 11:41:25 PM com.carrotsearch.randomizedtesting.RandomizedRunner$QueueUncaughtExceptionsHandler uncaughtException
   [junit4]   2> WARNING: Uncaught exception in thread: Thread[Lucene Merge Thread #36,6,TGRP-TestCompressingTermVectorsFormat]
   [junit4]   2> org.apache.lucene.index.MergePolicy$MergeException: java.lang.NullPointerException
   [junit4]   2> 	at __randomizedtesting.SeedInfo.seed([3C4832D329799907]:0)
   [junit4]   2> 	at org.apache.lucene.index.ConcurrentMergeScheduler.handleMergeException(ConcurrentMergeScheduler.java:545)
   [junit4]   2> 	at org.apache.lucene.index.ConcurrentMergeScheduler$MergeThread.run(ConcurrentMergeScheduler.java:518)
   [junit4]   2> Caused by: java.lang.NullPointerException
   [junit4]   2> 	at org.apache.lucene.codecs.lucene49.Lucene49NormsConsumer$NormMap.getOrd(Lucene49NormsConsumer.java:249)
   [junit4]   2> 	at org.apache.lucene.codecs.lucene49.Lucene49NormsConsumer.addNumericField(Lucene49NormsConsumer.java:150)
   [junit4]   2> 	at org.apache.lucene.codecs.DocValuesConsumer.mergeNumericField(DocValuesConsumer.java:129)
   [junit4]   2> 	at org.apache.lucene.index.SegmentMerger.mergeNorms(SegmentMerger.java:255)
   [junit4]   2> 	at org.apache.lucene.index.SegmentMerger.merge(SegmentMerger.java:133)
   [junit4]   2> 	at org.apache.lucene.index.IndexWriter.mergeMiddle(IndexWriter.java:4173)
   [junit4]   2> 	at org.apache.lucene.index.IndexWriter.merge(IndexWriter.java:3768)
   [junit4]   2> 	at org.apache.lucene.index.ConcurrentMergeScheduler.doMerge(ConcurrentMergeScheduler.java:405)
   [junit4]   2> 	at org.apache.lucene.index.ConcurrentMergeScheduler$MergeThread.run(ConcurrentMergeScheduler.java:482)
   [junit4]   2> 
   [junit4]   2> nov 11, 2014 11:41:25 PM com.carrotsearch.randomizedtesting.RandomizedRunner$QueueUncaughtExceptionsHandler uncaughtException
   [junit4]   2> WARNING: Uncaught exception in thread: Thread[Lucene Merge Thread #38,6,TGRP-TestCompressingTermVectorsFormat]
   [junit4]   2> org.apache.lucene.index.MergePolicy$MergeException: java.lang.NullPointerException
   [junit4]   2> 	at __randomizedtesting.SeedInfo.seed([3C4832D329799907]:0)
   [junit4]   2> 	at org.apache.lucene.index.ConcurrentMergeScheduler.handleMergeException(ConcurrentMergeScheduler.java:545)
   [junit4]   2> 	at org.apache.lucene.index.ConcurrentMergeScheduler$MergeThread.run(ConcurrentMergeScheduler.java:518)
   [junit4]   2> Caused by: java.lang.NullPointerException
   [junit4]   2> 	at org.apache.lucene.codecs.lucene49.Lucene49NormsConsumer$NormMap.getOrd(Lucene49NormsConsumer.java:249)
   [junit4]   2> 	at org.apache.lucene.codecs.lucene49.Lucene49NormsConsumer.addNumericField(Lucene49NormsConsumer.java:150)
   [junit4]   2> 	at org.apache.lucene.codecs.DocValuesConsumer.mergeNumericField(DocValuesConsumer.java:129)
   [junit4]   2> 	at org.apache.lucene.index.SegmentMerger.mergeNorms(SegmentMerger.java:255)
   [junit4]   2> 	at org.apache.lucene.index.SegmentMerger.merge(SegmentMerger.java:133)
   [junit4]   2> 	at org.apache.lucene.index.IndexWriter.mergeMiddle(IndexWriter.java:4173)
   [junit4]   2> 	at org.apache.lucene.index.IndexWriter.merge(IndexWriter.java:3768)
   [junit4]   2> 	at org.apache.lucene.index.ConcurrentMergeScheduler.doMerge(ConcurrentMergeScheduler.java:405)
   [junit4]   2> 	at org.apache.lucene.index.ConcurrentMergeScheduler$MergeThread.run(ConcurrentMergeScheduler.java:482)
   [junit4]   2> 
   [junit4]   2> nov 11, 2014 11:41:25 PM com.carrotsearch.randomizedtesting.RandomizedRunner$QueueUncaughtExceptionsHandler uncaughtException
   [junit4]   2> WARNING: Uncaught exception in thread: Thread[Lucene Merge Thread #39,6,TGRP-TestCompressingTermVectorsFormat]
   [junit4]   2> org.apache.lucene.index.MergePolicy$MergeException: java.lang.NullPointerException
   [junit4]   2> 	at __randomizedtesting.SeedInfo.seed([3C4832D329799907]:0)
   [junit4]   2> 	at org.apache.lucene.index.ConcurrentMergeScheduler.handleMergeException(ConcurrentMergeScheduler.java:545)
   [junit4]   2> 	at org.apache.lucene.index.ConcurrentMergeScheduler$MergeThread.run(ConcurrentMergeScheduler.java:518)
   [junit4]   2> Caused by: java.lang.NullPointerException
   [junit4]   2> 	at org.apache.lucene.codecs.lucene49.Lucene49NormsConsumer$NormMap.getOrd(Lucene49NormsConsumer.java:249)
   [junit4]   2> 	at org.apache.lucene.codecs.lucene49.Lucene49NormsConsumer.addNumericField(Lucene49NormsConsumer.java:150)
   [junit4]   2> 	at org.apache.lucene.codecs.DocValuesConsumer.mergeNumericField(DocValuesConsumer.java:129)
   [junit4]   2> 	at org.apache.lucene.index.SegmentMerger.mergeNorms(SegmentMerger.java:255)
   [junit4]   2> 	at org.apache.lucene.index.SegmentMerger.merge(SegmentMerger.java:133)
   [junit4]   2> 	at org.apache.lucene.index.IndexWriter.mergeMiddle(IndexWriter.java:4173)
   [junit4]   2> 	at org.apache.lucene.index.IndexWriter.merge(IndexWriter.java:3768)
   [junit4]   2> 	at org.apache.lucene.index.ConcurrentMergeScheduler.doMerge(ConcurrentMergeScheduler.java:405)
   [junit4]   2> 	at org.apache.lucene.index.ConcurrentMergeScheduler$MergeThread.run(ConcurrentMergeScheduler.java:482)
   [junit4]   2> 
   [junit4]   2> nov 11, 2014 11:41:26 PM com.carrotsearch.randomizedtesting.RandomizedRunner$QueueUncaughtExceptionsHandler uncaughtException
   [junit4]   2> WARNING: Uncaught exception in thread: Thread[Lucene Merge Thread #40,6,TGRP-TestCompressingTermVectorsFormat]
   [junit4]   2> org.apache.lucene.index.MergePolicy$MergeException: java.lang.NullPointerException
   [junit4]   2> 	at __randomizedtesting.SeedInfo.seed([3C4832D329799907]:0)
   [junit4]   2> 	at org.apache.lucene.index.ConcurrentMergeScheduler.handleMergeException(ConcurrentMergeScheduler.java:545)
   [junit4]   2> 	at org.apache.lucene.index.ConcurrentMergeScheduler$MergeThread.run(ConcurrentMergeScheduler.java:518)
   [junit4]   2> Caused by: java.lang.NullPointerException
   [junit4]   2> 	at org.apache.lucene.codecs.lucene49.Lucene49NormsConsumer$NormMap.getOrd(Lucene49NormsConsumer.java:249)
   [junit4]   2> 	at org.apache.lucene.codecs.lucene49.Lucene49NormsConsumer.addNumericField(Lucene49NormsConsumer.java:150)
   [junit4]   2> 	at org.apache.lucene.codecs.DocValuesConsumer.mergeNumericField(DocValuesConsumer.java:129)
   [junit4]   2> 	at org.apache.lucene.index.SegmentMerger.mergeNorms(SegmentMerger.java:255)
   [junit4]   2> 	at org.apache.lucene.index.SegmentMerger.merge(SegmentMerger.java:133)
   [junit4]   2> 	at org.apache.lucene.index.IndexWriter.mergeMiddle(IndexWriter.java:4173)
   [junit4]   2> 	at org.apache.lucene.index.IndexWriter.merge(IndexWriter.java:3768)
   [junit4]   2> 	at org.apache.lucene.index.ConcurrentMergeScheduler.doMerge(ConcurrentMergeScheduler.java:405)
   [junit4]   2> 	at org.apache.lucene.index.ConcurrentMergeScheduler$MergeThread.run(ConcurrentMergeScheduler.java:482)
   [junit4]   2> 
   [junit4]   2> nov 11, 2014 11:41:26 PM com.carrotsearch.randomizedtesting.RandomizedRunner$QueueUncaughtExceptionsHandler uncaughtException
   [junit4]   2> WARNING: Uncaught exception in thread: Thread[Lucene Merge Thread #41,6,TGRP-TestCompressingTermVectorsFormat]
   [junit4]   2> org.apache.lucene.index.MergePolicy$MergeException: java.lang.NullPointerException
   [junit4]   2> 	at __randomizedtesting.SeedInfo.seed([3C4832D329799907]:0)
   [junit4]   2> 	at org.apache.lucene.index.ConcurrentMergeScheduler.handleMergeException(ConcurrentMergeScheduler.java:545)
   [junit4]   2> 	at org.apache.lucene.index.ConcurrentMergeScheduler$MergeThread.run(ConcurrentMergeScheduler.java:518)
   [junit4]   2> Caused by: java.lang.NullPointerException
   [junit4]   2> 	at org.apache.lucene.codecs.lucene49.Lucene49NormsConsumer$NormMap.getOrd(Lucene49NormsConsumer.java:249)
   [junit4]   2> 	at org.apache.lucene.codecs.lucene49.Lucene49NormsConsumer.addNumericField(Lucene49NormsConsumer.java:150)
   [junit4]   2> 	at org.apache.lucene.codecs.DocValuesConsumer.mergeNumericField(DocValuesConsumer.java:129)
   [junit4]   2> 	at org.apache.lucene.index.SegmentMerger.mergeNorms(SegmentMerger.java:255)
   [junit4]   2> 	at org.apache.lucene.index.SegmentMerger.merge(SegmentMerger.java:133)
   [junit4]   2> 	at org.apache.lucene.index.IndexWriter.mergeMiddle(IndexWriter.java:4173)
   [junit4]   2> 	at org.apache.lucene.index.IndexWriter.merge(IndexWriter.java:3768)
   [junit4]   2> 	at org.apache.lucene.index.ConcurrentMergeScheduler.doMerge(ConcurrentMergeScheduler.java:405)
   [junit4]   2> 	at org.apache.lucene.index.ConcurrentMergeScheduler$MergeThread.run(ConcurrentMergeScheduler.java:482)
   [junit4]   2> 
   [junit4]   2> nov 11, 2014 11:41:26 PM com.carrotsearch.randomizedtesting.RandomizedRunner$QueueUncaughtExceptionsHandler uncaughtException
   [junit4]   2> WARNING: Uncaught exception in thread: Thread[Lucene Merge Thread #42,6,TGRP-TestCompressingTermVectorsFormat]
   [junit4]   2> org.apache.lucene.index.MergePolicy$MergeException: java.lang.NullPointerException
   [junit4]   2> 	at __randomizedtesting.SeedInfo.seed([3C4832D329799907]:0)
   [junit4]   2> 	at org.apache.lucene.index.ConcurrentMergeScheduler.handleMergeException(ConcurrentMergeScheduler.java:545)
   [junit4]   2> 	at org.apache.lucene.index.ConcurrentMergeScheduler$MergeThread.run(ConcurrentMergeScheduler.java:518)
   [junit4]   2> Caused by: java.lang.NullPointerException
   [junit4]   2> 	at org.apache.lucene.codecs.lucene49.Lucene49NormsConsumer$NormMap.getOrd(Lucene49NormsConsumer.java:249)
   [junit4]   2> 	at org.apache.lucene.codecs.lucene49.Lucene49NormsConsumer.addNumericField(Lucene49NormsConsumer.java:150)
   [junit4]   2> 	at org.apache.lucene.codecs.DocValuesConsumer.mergeNumericField(DocValuesConsumer.java:129)
   [junit4]   2> 	at org.apache.lucene.index.SegmentMerger.mergeNorms(SegmentMerger.java:255)
   [junit4]   2> 	at org.apache.lucene.index.SegmentMerger.merge(SegmentMerger.java:133)
   [junit4]   2> 	at org.apache.lucene.index.IndexWriter.mergeMiddle(IndexWriter.java:4173)
   [junit4]   2> 	at org.apache.lucene.index.IndexWriter.merge(IndexWriter.java:3768)
   [junit4]   2> 	at org.apache.lucene.index.ConcurrentMergeScheduler.doMerge(ConcurrentMergeScheduler.java:405)
   [junit4]   2> 	at org.apache.lucene.index.ConcurrentMergeScheduler$MergeThread.run(ConcurrentMergeScheduler.java:482)
   [junit4]   2> 
   [junit4]   2> nov 11, 2014 11:41:27 PM com.carrotsearch.randomizedtesting.RandomizedRunner$QueueUncaughtExceptionsHandler uncaughtException
   [junit4]   2> WARNING: Uncaught exception in thread: Thread[Lucene Merge Thread #43,6,TGRP-TestCompressingTermVectorsFormat]
   [junit4]   2> org.apache.lucene.index.MergePolicy$MergeException: java.lang.NullPointerException
   [junit4]   2> 	at __randomizedtesting.SeedInfo.seed([3C4832D329

[...truncated too long message...]

d(Lucene49NormsConsumer.java:249)
   [junit4]    > 	at org.apache.lucene.codecs.lucene49.Lucene49NormsConsumer.addNumericField(Lucene49NormsConsumer.java:150)
   [junit4]    > 	at org.apache.lucene.codecs.DocValuesConsumer.mergeNumericField(DocValuesConsumer.java:129)
   [junit4]    > 	at org.apache.lucene.index.SegmentMerger.mergeNorms(SegmentMerger.java:255)
   [junit4]    > 	at org.apache.lucene.index.SegmentMerger.merge(SegmentMerger.java:133)
   [junit4]    > 	at org.apache.lucene.index.IndexWriter.mergeMiddle(IndexWriter.java:4173)
   [junit4]    > 	at org.apache.lucene.index.IndexWriter.merge(IndexWriter.java:3768)
   [junit4]    > 	at org.apache.lucene.index.ConcurrentMergeScheduler.doMerge(ConcurrentMergeScheduler.java:405)
   [junit4]    > 	at org.apache.lucene.index.ConcurrentMergeScheduler$MergeThread.run(ConcurrentMergeScheduler.java:482)Throwable #382: com.carrotsearch.randomizedtesting.UncaughtExceptionError: Captured an uncaught exception in thread: Thread[id=520, name=Lucene Merge Thread #382, state=RUNNABLE, group=TGRP-TestCompressingTermVectorsFormat]
   [junit4]    > Caused by: org.apache.lucene.index.MergePolicy$MergeException: java.lang.NullPointerException
   [junit4]    > 	at __randomizedtesting.SeedInfo.seed([3C4832D329799907]:0)
   [junit4]    > 	at org.apache.lucene.index.ConcurrentMergeScheduler.handleMergeException(ConcurrentMergeScheduler.java:545)
   [junit4]    > 	at org.apache.lucene.index.ConcurrentMergeScheduler$MergeThread.run(ConcurrentMergeScheduler.java:518)
   [junit4]    > Caused by: java.lang.NullPointerException
   [junit4]    > 	at org.apache.lucene.codecs.lucene49.Lucene49NormsConsumer$NormMap.getOrd(Lucene49NormsConsumer.java:249)
   [junit4]    > 	at org.apache.lucene.codecs.lucene49.Lucene49NormsConsumer.addNumericField(Lucene49NormsConsumer.java:150)
   [junit4]    > 	at org.apache.lucene.codecs.DocValuesConsumer.mergeNumericField(DocValuesConsumer.java:129)
   [junit4]    > 	at org.apache.lucene.index.SegmentMerger.mergeNorms(SegmentMerger.java:255)
   [junit4]    > 	at org.apache.lucene.index.SegmentMerger.merge(SegmentMerger.java:133)
   [junit4]    > 	at org.apache.lucene.index.IndexWriter.mergeMiddle(IndexWriter.java:4173)
   [junit4]    > 	at org.apache.lucene.index.IndexWriter.merge(IndexWriter.java:3768)
   [junit4]    > 	at org.apache.lucene.index.ConcurrentMergeScheduler.doMerge(ConcurrentMergeScheduler.java:405)
   [junit4]    > 	at org.apache.lucene.index.ConcurrentMergeScheduler$MergeThread.run(ConcurrentMergeScheduler.java:482)Throwable #383: com.carrotsearch.randomizedtesting.UncaughtExceptionError: Captured an uncaught exception in thread: Thread[id=521, name=Lucene Merge Thread #383, state=RUNNABLE, group=TGRP-TestCompressingTermVectorsFormat]
   [junit4]    > Caused by: org.apache.lucene.index.MergePolicy$MergeException: java.lang.NullPointerException
   [junit4]    > 	at __randomizedtesting.SeedInfo.seed([3C4832D329799907]:0)
   [junit4]    > 	at org.apache.lucene.index.ConcurrentMergeScheduler.handleMergeException(ConcurrentMergeScheduler.java:545)
   [junit4]    > 	at org.apache.lucene.index.ConcurrentMergeScheduler$MergeThread.run(ConcurrentMergeScheduler.java:518)
   [junit4]    > Caused by: java.lang.NullPointerException
   [junit4]    > 	at org.apache.lucene.codecs.lucene49.Lucene49NormsConsumer$NormMap.getOrd(Lucene49NormsConsumer.java:249)
   [junit4]    > 	at org.apache.lucene.codecs.lucene49.Lucene49NormsConsumer.addNumericField(Lucene49NormsConsumer.java:150)
   [junit4]    > 	at org.apache.lucene.codecs.DocValuesConsumer.mergeNumericField(DocValuesConsumer.java:129)
   [junit4]    > 	at org.apache.lucene.index.SegmentMerger.mergeNorms(SegmentMerger.java:255)
   [junit4]    > 	at org.apache.lucene.index.SegmentMerger.merge(SegmentMerger.java:133)
   [junit4]    > 	at org.apache.lucene.index.IndexWriter.mergeMiddle(IndexWriter.java:4173)
   [junit4]    > 	at org.apache.lucene.index.IndexWriter.merge(IndexWriter.java:3768)
   [junit4]    > 	at org.apache.lucene.index.ConcurrentMergeScheduler.doMerge(ConcurrentMergeScheduler.java:405)
   [junit4]    > 	at org.apache.lucene.index.ConcurrentMergeScheduler$MergeThread.run(ConcurrentMergeScheduler.java:482)Throwable #384: com.carrotsearch.randomizedtesting.UncaughtExceptionError: Captured an uncaught exception in thread: Thread[id=504, name=Lucene Merge Thread #366, state=RUNNABLE, group=TGRP-TestCompressingTermVectorsFormat]
   [junit4]    > Caused by: org.apache.lucene.index.MergePolicy$MergeException: java.lang.NullPointerException
   [junit4]    > 	at __randomizedtesting.SeedInfo.seed([3C4832D329799907]:0)
   [junit4]    > 	at org.apache.lucene.index.ConcurrentMergeScheduler.handleMergeException(ConcurrentMergeScheduler.java:545)
   [junit4]    > 	at org.apache.lucene.index.ConcurrentMergeScheduler$MergeThread.run(ConcurrentMergeScheduler.java:518)
   [junit4]    > Caused by: java.lang.NullPointerException
   [junit4]    > 	at org.apache.lucene.codecs.lucene49.Lucene49NormsConsumer$NormMap.getOrd(Lucene49NormsConsumer.java:249)
   [junit4]    > 	at org.apache.lucene.codecs.lucene49.Lucene49NormsConsumer.addNumericField(Lucene49NormsConsumer.java:150)
   [junit4]    > 	at org.apache.lucene.codecs.DocValuesConsumer.mergeNumericField(DocValuesConsumer.java:129)
   [junit4]    > 	at org.apache.lucene.index.SegmentMerger.mergeNorms(SegmentMerger.java:255)
   [junit4]    > 	at org.apache.lucene.index.SegmentMerger.merge(SegmentMerger.java:133)
   [junit4]    > 	at org.apache.lucene.index.IndexWriter.mergeMiddle(IndexWriter.java:4173)
   [junit4]    > 	at org.apache.lucene.index.IndexWriter.merge(IndexWriter.java:3768)
   [junit4]    > 	at org.apache.lucene.index.ConcurrentMergeScheduler.doMerge(ConcurrentMergeScheduler.java:405)
   [junit4]    > 	at org.apache.lucene.index.ConcurrentMergeScheduler$MergeThread.run(ConcurrentMergeScheduler.java:482)Throwable #385: com.carrotsearch.randomizedtesting.UncaughtExceptionError: Captured an uncaught exception in thread: Thread[id=522, name=Lucene Merge Thread #384, state=RUNNABLE, group=TGRP-TestCompressingTermVectorsFormat]
   [junit4]    > Caused by: org.apache.lucene.index.MergePolicy$MergeException: java.lang.NullPointerException
   [junit4]    > 	at __randomizedtesting.SeedInfo.seed([3C4832D329799907]:0)
   [junit4]    > 	at org.apache.lucene.index.ConcurrentMergeScheduler.handleMergeException(ConcurrentMergeScheduler.java:545)
   [junit4]    > 	at org.apache.lucene.index.ConcurrentMergeScheduler$MergeThread.run(ConcurrentMergeScheduler.java:518)
   [junit4]    > Caused by: java.lang.NullPointerException
   [junit4]    > 	at org.apache.lucene.codecs.lucene49.Lucene49NormsConsumer$NormMap.getOrd(Lucene49NormsConsumer.java:249)
   [junit4]    > 	at org.apache.lucene.codecs.lucene49.Lucene49NormsConsumer.addNumericField(Lucene49NormsConsumer.java:150)
   [junit4]    > 	at org.apache.lucene.codecs.DocValuesConsumer.mergeNumericField(DocValuesConsumer.java:129)
   [junit4]    > 	at org.apache.lucene.index.SegmentMerger.mergeNorms(SegmentMerger.java:255)
   [junit4]    > 	at org.apache.lucene.index.SegmentMerger.merge(SegmentMerger.java:133)
   [junit4]    > 	at org.apache.lucene.index.IndexWriter.mergeMiddle(IndexWriter.java:4173)
   [junit4]    > 	at org.apache.lucene.index.IndexWriter.merge(IndexWriter.java:3768)
   [junit4]    > 	at org.apache.lucene.index.ConcurrentMergeScheduler.doMerge(ConcurrentMergeScheduler.java:405)
   [junit4]    > 	at org.apache.lucene.index.ConcurrentMergeScheduler$MergeThread.run(ConcurrentMergeScheduler.java:482)
   [junit4]   2> NOTE: leaving temporary files on disk at: /mnt/ssd/jenkins/workspace/Lucene-Solr-4.10-Linux/lucene/build/core/test/J0/./lucene.codecs.compressing.TestCompressingTermVectorsFormat-3C4832D329799907-001
   [junit4]   2> NOTE: test params are: codec=Lucene46, sim=DefaultSimilarity, locale=nl_NL_PREEURO, timezone=Antarctica/DumontDUrville
   [junit4]   2> NOTE: Linux 3.13.0-39-generic amd64/IBM Corporation 1.7.0 (64-bit)/cpus=8,threads=1,free=70388520,total=244121600
   [junit4]   2> NOTE: All tests run in this JVM: [TestPriorityQueue, TestCharTermAttributeImpl, TestSortRescorer, TestWorstCaseTestBehavior, TestFilterIterator, TestLucene40PostingsReader, TestPagedBytes, TestCompoundFile, TestSimpleExplanations, TestDoc, TestDocTermOrdsRewriteMethod, TestReuseDocsEnum, TestConcurrentMergeScheduler, TestSloppyPhraseQuery, TestIsCurrent, TestSearch, TestTermInfosReaderIndex, TestLookaheadTokenFilter, TestCrash, TestTryDelete, TestTopScoreDocCollector, TestDocIdSet, TestExplanations, TestCompressingTermVectorsFormat]
   [junit4] Completed on J0 in 268.96s, 50 tests, 2 errors <<< FAILURES!

[...truncated 1335 lines...]
BUILD FAILED
/mnt/ssd/jenkins/workspace/Lucene-Solr-4.10-Linux/build.xml:474: The following error occurred while executing this line:
/mnt/ssd/jenkins/workspace/Lucene-Solr-4.10-Linux/build.xml:467: The following error occurred while executing this line:
/mnt/ssd/jenkins/workspace/Lucene-Solr-4.10-Linux/build.xml:45: The following error occurred while executing this line:
/mnt/ssd/jenkins/workspace/Lucene-Solr-4.10-Linux/extra-targets.xml:37: The following error occurred while executing this line:
/mnt/ssd/jenkins/workspace/Lucene-Solr-4.10-Linux/lucene/build.xml:49: The following error occurred while executing this line:
/mnt/ssd/jenkins/workspace/Lucene-Solr-4.10-Linux/lucene/common-build.xml:1350: The following error occurred while executing this line:
/mnt/ssd/jenkins/workspace/Lucene-Solr-4.10-Linux/lucene/common-build.xml:970: There were test failures: 420 suites, 3739 tests, 3 errors, 161 ignored (150 assumptions)

Total time: 29 minutes 2 seconds
Build step 'Invoke Ant' marked build as failure
[description-setter] Description set: Java: 64bit/ibm-j9-jdk7 -Xjit:exclude={org/apache/lucene/util/fst/FST.pack(IIF)Lorg/apache/lucene/util/fst/FST;} (asserts: false)
Archiving artifacts
Recording test results
Email was triggered for: Failure - Any
Sending email for trigger: Failure - Any



Re: [JENKINS] Lucene-Solr-4.10-Linux (64bit/ibm-j9-jdk7) - Build # 75 - Failure!

Posted by Michael McCandless <lu...@mikemccandless.com>.
J9 bug.

Mike McCandless

http://blog.mikemccandless.com


On Tue, Nov 11, 2014 at 4:17 AM, Policeman Jenkins Server
<je...@thetaphi.de> wrote:
> Build: http://jenkins.thetaphi.de/job/Lucene-Solr-4.10-Linux/75/
> Java: 64bit/ibm-j9-jdk7 -Xjit:exclude={org/apache/lucene/util/fst/FST.pack(IIF)Lorg/apache/lucene/util/fst/FST;} (asserts: true)
>
> 1 tests failed.
> REGRESSION:  org.apache.lucene.analysis.ja.TestJapaneseKatakanaStemFilter.testRandomData
>
> Error Message:
>
>
> Stack Trace:
> java.lang.NullPointerException
>         at __randomizedtesting.SeedInfo.seed([3B0DD47F52B9DBDC:469D039F8353E6FD]:0)
>         at org.apache.lucene.codecs.lucene49.Lucene49NormsConsumer$NormMap.add(Lucene49NormsConsumer.java:226)
>         at org.apache.lucene.codecs.lucene49.Lucene49NormsConsumer.addNumericField(Lucene49NormsConsumer.java:95)
>         at org.apache.lucene.index.NumericDocValuesWriter.flush(NumericDocValuesWriter.java:92)
>         at org.apache.lucene.index.DefaultIndexingChain.writeNorms(DefaultIndexingChain.java:207)
>         at org.apache.lucene.index.DefaultIndexingChain.flush(DefaultIndexingChain.java:94)
>         at org.apache.lucene.index.DocumentsWriterPerThread.flush(DocumentsWriterPerThread.java:439)
>         at org.apache.lucene.index.DocumentsWriter.doFlush(DocumentsWriter.java:510)
>         at org.apache.lucene.index.DocumentsWriter.flushAllThreads(DocumentsWriter.java:621)
>         at org.apache.lucene.index.IndexWriter.doFlush(IndexWriter.java:3227)
>         at org.apache.lucene.index.IndexWriter.flush(IndexWriter.java:3203)
>         at org.apache.lucene.index.IndexWriter.shutdown(IndexWriter.java:907)
>         at org.apache.lucene.index.IndexWriter.close(IndexWriter.java:984)
>         at org.apache.lucene.index.IndexWriter.close(IndexWriter.java:954)
>         at org.apache.lucene.index.RandomIndexWriter.close(RandomIndexWriter.java:373)
>         at org.apache.lucene.util.IOUtils.close(IOUtils.java:77)
>         at org.apache.lucene.analysis.BaseTokenStreamTestCase.checkRandomData(BaseTokenStreamTestCase.java:541)
>         at org.apache.lucene.analysis.BaseTokenStreamTestCase.checkRandomData(BaseTokenStreamTestCase.java:432)
>         at org.apache.lucene.analysis.ja.TestJapaneseKatakanaStemFilter.testRandomData(TestJapaneseKatakanaStemFilter.java:86)
>         at sun.reflect.NativeMethodAccessorImpl.invoke0(Native Method)
>         at sun.reflect.NativeMethodAccessorImpl.invoke(NativeMethodAccessorImpl.java:94)
>         at sun.reflect.DelegatingMethodAccessorImpl.invoke(DelegatingMethodAccessorImpl.java:55)
>         at java.lang.reflect.Method.invoke(Method.java:619)
>         at com.carrotsearch.randomizedtesting.RandomizedRunner.invoke(RandomizedRunner.java:1618)
>         at com.carrotsearch.randomizedtesting.RandomizedRunner$6.evaluate(RandomizedRunner.java:827)
>         at com.carrotsearch.randomizedtesting.RandomizedRunner$7.evaluate(RandomizedRunner.java:863)
>         at com.carrotsearch.randomizedtesting.RandomizedRunner$8.evaluate(RandomizedRunner.java:877)
>         at org.apache.lucene.util.TestRuleSetupTeardownChained$1.evaluate(TestRuleSetupTeardownChained.java:50)
>         at org.apache.lucene.util.TestRuleFieldCacheSanity$1.evaluate(TestRuleFieldCacheSanity.java:51)
>         at org.apache.lucene.util.AbstractBeforeAfterRule$1.evaluate(AbstractBeforeAfterRule.java:46)
>         at com.carrotsearch.randomizedtesting.rules.SystemPropertiesInvariantRule$1.evaluate(SystemPropertiesInvariantRule.java:55)
>         at org.apache.lucene.util.TestRuleThreadAndTestName$1.evaluate(TestRuleThreadAndTestName.java:49)
>         at org.apache.lucene.util.TestRuleIgnoreAfterMaxFailures$1.evaluate(TestRuleIgnoreAfterMaxFailures.java:65)
>         at org.apache.lucene.util.TestRuleMarkFailure$1.evaluate(TestRuleMarkFailure.java:48)
>         at com.carrotsearch.randomizedtesting.rules.StatementAdapter.evaluate(StatementAdapter.java:36)
>         at com.carrotsearch.randomizedtesting.ThreadLeakControl$StatementRunner.run(ThreadLeakControl.java:365)
>         at com.carrotsearch.randomizedtesting.ThreadLeakControl.forkTimeoutingTask(ThreadLeakControl.java:798)
>         at com.carrotsearch.randomizedtesting.ThreadLeakControl$3.evaluate(ThreadLeakControl.java:458)
>         at com.carrotsearch.randomizedtesting.RandomizedRunner.runSingleTest(RandomizedRunner.java:836)
>         at com.carrotsearch.randomizedtesting.RandomizedRunner$3.evaluate(RandomizedRunner.java:738)
>         at com.carrotsearch.randomizedtesting.RandomizedRunner$4.evaluate(RandomizedRunner.java:772)
>         at com.carrotsearch.randomizedtesting.RandomizedRunner$5.evaluate(RandomizedRunner.java:783)
>         at org.apache.lucene.util.AbstractBeforeAfterRule$1.evaluate(AbstractBeforeAfterRule.java:46)
>         at org.apache.lucene.util.TestRuleStoreClassName$1.evaluate(TestRuleStoreClassName.java:42)
>         at com.carrotsearch.randomizedtesting.rules.SystemPropertiesInvariantRule$1.evaluate(SystemPropertiesInvariantRule.java:55)
>         at com.carrotsearch.randomizedtesting.rules.NoShadowingOrOverridesOnMethodsRule$1.evaluate(NoShadowingOrOverridesOnMethodsRule.java:39)
>         at com.carrotsearch.randomizedtesting.rules.NoShadowingOrOverridesOnMethodsRule$1.evaluate(NoShadowingOrOverridesOnMethodsRule.java:39)
>         at com.carrotsearch.randomizedtesting.rules.StatementAdapter.evaluate(StatementAdapter.java:36)
>         at com.carrotsearch.randomizedtesting.rules.StatementAdapter.evaluate(StatementAdapter.java:36)
>         at com.carrotsearch.randomizedtesting.rules.StatementAdapter.evaluate(StatementAdapter.java:36)
>         at org.apache.lucene.util.TestRuleAssertionsRequired$1.evaluate(TestRuleAssertionsRequired.java:54)
>         at org.apache.lucene.util.TestRuleMarkFailure$1.evaluate(TestRuleMarkFailure.java:48)
>         at org.apache.lucene.util.TestRuleIgnoreAfterMaxFailures$1.evaluate(TestRuleIgnoreAfterMaxFailures.java:65)
>         at org.apache.lucene.util.TestRuleIgnoreTestSuites$1.evaluate(TestRuleIgnoreTestSuites.java:55)
>         at com.carrotsearch.randomizedtesting.rules.StatementAdapter.evaluate(StatementAdapter.java:36)
>         at com.carrotsearch.randomizedtesting.ThreadLeakControl$StatementRunner.run(ThreadLeakControl.java:365)
>         at java.lang.Thread.run(Thread.java:853)
>
>
>
>
> Build Log:
> [...truncated 6746 lines...]
>    [junit4] Suite: org.apache.lucene.analysis.ja.TestJapaneseKatakanaStemFilter
>    [junit4]   2> NOTE: reproduce with: ant test  -Dtestcase=TestJapaneseKatakanaStemFilter -Dtests.method=testRandomData -Dtests.seed=3B0DD47F52B9DBDC -Dtests.multiplier=3 -Dtests.slow=true -Dtests.locale=ru -Dtests.timezone=America/St_Thomas -Dtests.asserts=true -Dtests.file.encoding=ISO-8859-1
>    [junit4] ERROR   2.50s J1 | TestJapaneseKatakanaStemFilter.testRandomData <<<
>    [junit4]    > Throwable #1: java.lang.NullPointerException
>    [junit4]    >        at __randomizedtesting.SeedInfo.seed([3B0DD47F52B9DBDC:469D039F8353E6FD]:0)
>    [junit4]    >        at org.apache.lucene.codecs.lucene49.Lucene49NormsConsumer$NormMap.add(Lucene49NormsConsumer.java:226)
>    [junit4]    >        at org.apache.lucene.codecs.lucene49.Lucene49NormsConsumer.addNumericField(Lucene49NormsConsumer.java:95)
>    [junit4]    >        at org.apache.lucene.index.NumericDocValuesWriter.flush(NumericDocValuesWriter.java:92)
>    [junit4]    >        at org.apache.lucene.index.DefaultIndexingChain.writeNorms(DefaultIndexingChain.java:207)
>    [junit4]    >        at org.apache.lucene.index.DefaultIndexingChain.flush(DefaultIndexingChain.java:94)
>    [junit4]    >        at org.apache.lucene.index.DocumentsWriterPerThread.flush(DocumentsWriterPerThread.java:439)
>    [junit4]    >        at org.apache.lucene.index.DocumentsWriter.doFlush(DocumentsWriter.java:510)
>    [junit4]    >        at org.apache.lucene.index.DocumentsWriter.flushAllThreads(DocumentsWriter.java:621)
>    [junit4]    >        at org.apache.lucene.index.IndexWriter.doFlush(IndexWriter.java:3227)
>    [junit4]    >        at org.apache.lucene.index.IndexWriter.flush(IndexWriter.java:3203)
>    [junit4]    >        at org.apache.lucene.index.IndexWriter.shutdown(IndexWriter.java:907)
>    [junit4]    >        at org.apache.lucene.index.IndexWriter.close(IndexWriter.java:984)
>    [junit4]    >        at org.apache.lucene.index.IndexWriter.close(IndexWriter.java:954)
>    [junit4]    >        at org.apache.lucene.index.RandomIndexWriter.close(RandomIndexWriter.java:373)
>    [junit4]    >        at org.apache.lucene.util.IOUtils.close(IOUtils.java:77)
>    [junit4]    >        at org.apache.lucene.analysis.BaseTokenStreamTestCase.checkRandomData(BaseTokenStreamTestCase.java:541)
>    [junit4]    >        at org.apache.lucene.analysis.BaseTokenStreamTestCase.checkRandomData(BaseTokenStreamTestCase.java:432)
>    [junit4]    >        at org.apache.lucene.analysis.ja.TestJapaneseKatakanaStemFilter.testRandomData(TestJapaneseKatakanaStemFilter.java:86)
>    [junit4]    >        at java.lang.Thread.run(Thread.java:853)
>    [junit4]   2> NOTE: leaving temporary files on disk at: /mnt/ssd/jenkins/workspace/Lucene-Solr-4.10-Linux/lucene/build/analysis/kuromoji/test/J1/./lucene.analysis.ja.TestJapaneseKatakanaStemFilter-3B0DD47F52B9DBDC-001
>    [junit4]   2> NOTE: test params are: codec=Lucene410: {dummy=Lucene41(blocksize=128)}, docValues:{}, sim=RandomSimilarityProvider(queryNorm=true,coord=no): {dummy=DFR I(F)B2}, locale=ru, timezone=America/St_Thomas
>    [junit4]   2> NOTE: Linux 3.13.0-39-generic amd64/IBM Corporation 1.7.0 (64-bit)/cpus=8,threads=1,free=5921424,total=30212096
>    [junit4]   2> NOTE: All tests run in this JVM: [TestJapanesePartOfSpeechStopFilterFactory, TestJapaneseKatakanaStemFilter]
>    [junit4] Completed on J1 in 2.66s, 5 tests, 1 error <<< FAILURES!
>
> [...truncated 57 lines...]
> BUILD FAILED
> /mnt/ssd/jenkins/workspace/Lucene-Solr-4.10-Linux/build.xml:474: The following error occurred while executing this line:
> /mnt/ssd/jenkins/workspace/Lucene-Solr-4.10-Linux/build.xml:467: The following error occurred while executing this line:
> /mnt/ssd/jenkins/workspace/Lucene-Solr-4.10-Linux/build.xml:45: The following error occurred while executing this line:
> /mnt/ssd/jenkins/workspace/Lucene-Solr-4.10-Linux/extra-targets.xml:37: The following error occurred while executing this line:
> /mnt/ssd/jenkins/workspace/Lucene-Solr-4.10-Linux/lucene/build.xml:540: The following error occurred while executing this line:
> /mnt/ssd/jenkins/workspace/Lucene-Solr-4.10-Linux/lucene/common-build.xml:2107: The following error occurred while executing this line:
> /mnt/ssd/jenkins/workspace/Lucene-Solr-4.10-Linux/lucene/analysis/build.xml:106: The following error occurred while executing this line:
> /mnt/ssd/jenkins/workspace/Lucene-Solr-4.10-Linux/lucene/analysis/build.xml:38: The following error occurred while executing this line:
> /mnt/ssd/jenkins/workspace/Lucene-Solr-4.10-Linux/lucene/module-build.xml:60: The following error occurred while executing this line:
> /mnt/ssd/jenkins/workspace/Lucene-Solr-4.10-Linux/lucene/common-build.xml:1350: The following error occurred while executing this line:
> /mnt/ssd/jenkins/workspace/Lucene-Solr-4.10-Linux/lucene/common-build.xml:970: There were test failures: 17 suites, 108 tests, 1 error, 1 ignored (1 assumption)
>
> Total time: 38 minutes 36 seconds
> Build step 'Invoke Ant' marked build as failure
> [description-setter] Description set: Java: 64bit/ibm-j9-jdk7 -Xjit:exclude={org/apache/lucene/util/fst/FST.pack(IIF)Lorg/apache/lucene/util/fst/FST;} (asserts: true)
> Archiving artifacts
> Recording test results
> Email was triggered for: Failure - Any
> Sending email for trigger: Failure - Any
>
>
>
>
> ---------------------------------------------------------------------
> To unsubscribe, e-mail: dev-unsubscribe@lucene.apache.org
> For additional commands, e-mail: dev-help@lucene.apache.org

---------------------------------------------------------------------
To unsubscribe, e-mail: dev-unsubscribe@lucene.apache.org
For additional commands, e-mail: dev-help@lucene.apache.org