You are viewing a plain text version of this content. The canonical link for it is here.
Posted to dev@opennlp.apache.org by Apache Hudson Server <hu...@hudson.apache.org> on 2011/02/09 19:49:23 UTC

Build failed in Hudson: OpenNLP #10

See <https://hudson.apache.org/hudson/job/OpenNLP/10/changes>

Changes:

[joern] OPENNLP-129 Enabled all compiler warnings

------------------------------------------
[...truncated 4485 lines...]
[WARNING] <https://hudson.apache.org/hudson/job/OpenNLP/ws/trunk/opennlp-tools/src/main/java/opennlp/tools/util/model/ArtifactSerializer.java>:42: warning - @return tag has no arguments.
[WARNING] <https://hudson.apache.org/hudson/job/OpenNLP/ws/trunk/opennlp-tools/src/main/java/opennlp/tools/util/model/BaseModel.java>:257: warning - @return tag has no arguments.
[WARNING] <https://hudson.apache.org/hudson/job/OpenNLP/ws/trunk/opennlp-tools/src/main/java/opennlp/tools/util/model/BaseModel.java>:292: warning - @return tag has no arguments.
[WARNING] <https://hudson.apache.org/hudson/job/OpenNLP/ws/trunk/opennlp-tools/src/main/java/opennlp/tools/util/featuregen/AggregatedFeatureGenerator.java>:100: warning - @return tag has no arguments.
[WARNING] <https://hudson.apache.org/hudson/job/OpenNLP/ws/trunk/opennlp-tools/src/main/java/opennlp/tools/tokenize/TokenizerME.java>:77: warning - Tag @link: can't find train(String, Iterator, boolean) in opennlp.tools.tokenize.TokenizerME
[WARNING] <https://hudson.apache.org/hudson/job/OpenNLP/ws/trunk/opennlp-tools/src/main/java/opennlp/tools/postag/POSDictionary.java>:271: warning - @return tag has no arguments.
[WARNING] <https://hudson.apache.org/hudson/job/OpenNLP/ws/trunk/opennlp-tools/src/main/java/opennlp/tools/postag/POSEvaluator.java>:29: warning - Tag @link: reference not found: POSSamplee
[WARNING] <https://hudson.apache.org/hudson/job/OpenNLP/ws/trunk/opennlp-tools/src/main/java/opennlp/tools/postag/POSEvaluator.java>:85: warning - @return tag has no arguments.
[WARNING] <https://hudson.apache.org/hudson/job/OpenNLP/ws/trunk/opennlp-tools/src/main/java/opennlp/tools/postag/POSTaggerCrossValidator.java>:80: warning - @return tag has no arguments.
[WARNING] <https://hudson.apache.org/hudson/job/OpenNLP/ws/trunk/opennlp-tools/src/main/java/opennlp/tools/postag/POSTaggerCrossValidator.java>:91: warning - @return tag has no arguments.
[WARNING] <https://hudson.apache.org/hudson/job/OpenNLP/ws/trunk/opennlp-tools/src/main/java/opennlp/tools/postag/POSTaggerTrainer.java>:70: warning - @return tag has no arguments.
[WARNING] <https://hudson.apache.org/hudson/job/OpenNLP/ws/trunk/opennlp-tools/src/main/java/opennlp/tools/postag/POSTaggerTrainer.java>:70: warning - @param argument "beamSize" is not a parameter name.
[WARNING] <https://hudson.apache.org/hudson/job/OpenNLP/ws/trunk/opennlp-tools/src/main/java/opennlp/tools/postag/POSEvaluator.java>:29: warning - Tag @link: reference not found: POSSamplee
[WARNING] <https://hudson.apache.org/hudson/job/OpenNLP/ws/trunk/opennlp-tools/src/main/java/opennlp/tools/dictionary/Index.java>:61: warning - Tag @link: reference not found: Token
[WARNING] <https://hudson.apache.org/hudson/job/OpenNLP/ws/trunk/opennlp-tools/src/main/java/opennlp/tools/dictionary/serializer/Entry.java>:53: warning - Tag @link: reference not found: Token
[WARNING] <https://hudson.apache.org/hudson/job/OpenNLP/ws/trunk/opennlp-tools/src/main/java/opennlp/tools/util/StringList.java>:93: warning - Tag @link: reference not found: Token
[WARNING] <https://hudson.apache.org/hudson/job/OpenNLP/ws/trunk/opennlp-tools/src/main/java/opennlp/tools/postag/POSEvaluator.java>:29: warning - Tag @link: reference not found: POSSamplee
[INFO] Building jar: <https://hudson.apache.org/hudson/job/OpenNLP/ws/trunk/opennlp-tools/target/opennlp-tools-1.5.1-incubating-SNAPSHOT-javadoc.jar>
mojo forkStarted org.apache.maven.plugins:maven-source-plugin:2.1.1(create-source-jar)
mojo forkSucceeded org.apache.maven.plugins:maven-source-plugin:2.1.1(create-source-jar)
ignoring exception during new ExecutedMojo null
[INFO] 
[INFO] --- maven-source-plugin:2.1.1:jar (create-source-jar) @ opennlp-tools ---
[INFO] Building jar: <https://hudson.apache.org/hudson/job/OpenNLP/ws/trunk/opennlp-tools/target/opennlp-tools-1.5.1-incubating-SNAPSHOT-sources.jar>
[INFO] 
[INFO] --- apache-rat-plugin:0.6:check (default-cli) @ opennlp-tools ---
[INFO] Exclude: src/test/resources/opennlp/tools/chunker/*.txt
[INFO] Exclude: src/test/resources/opennlp/tools/formats/*.sample
[INFO] Exclude: src/test/resources/opennlp/tools/namefind/*.txt
[INFO] Exclude: src/test/resources/opennlp/tools/namefind/*.train
[INFO] Exclude: src/test/resources/opennlp/tools/parser/en_head_rules
[INFO] Exclude: src/test/resources/opennlp/tools/parser/en_head_rules
[INFO] Exclude: src/test/resources/opennlp/tools/parser/parser.train
[INFO] Exclude: src/test/resources/opennlp/tools/parser/test.parse
[INFO] Exclude: src/test/resources/opennlp/tools/postag/AnnotatedSentences.txt
[INFO] Exclude: src/test/resources/opennlp/tools/sentdetect/Sentences.txt
[INFO] Exclude: src/test/resources/opennlp/tools/tokenize/token.train
[INFO] 
[INFO] --- maven-install-plugin:2.3:install (default-install) @ opennlp-tools ---
[INFO] Installing <https://hudson.apache.org/hudson/job/OpenNLP/ws/trunk/opennlp-tools/target/opennlp-tools-1.5.1-incubating-SNAPSHOT.jar> to /export/home/hudson/.m2/repository/org/apache/opennlp/opennlp-tools/1.5.1-incubating-SNAPSHOT/opennlp-tools-1.5.1-incubating-SNAPSHOT.jar
[INFO] Installing <https://hudson.apache.org/hudson/job/OpenNLP/ws/trunk/opennlp-tools/pom.xml> to /export/home/hudson/.m2/repository/org/apache/opennlp/opennlp-tools/1.5.1-incubating-SNAPSHOT/opennlp-tools-1.5.1-incubating-SNAPSHOT.pom
[INFO] Installing <https://hudson.apache.org/hudson/job/OpenNLP/ws/trunk/opennlp-tools/target/opennlp-tools-1.5.1-incubating-SNAPSHOT-javadoc.jar> to /export/home/hudson/.m2/repository/org/apache/opennlp/opennlp-tools/1.5.1-incubating-SNAPSHOT/opennlp-tools-1.5.1-incubating-SNAPSHOT-javadoc.jar
[INFO] Installing <https://hudson.apache.org/hudson/job/OpenNLP/ws/trunk/opennlp-tools/target/opennlp-tools-1.5.1-incubating-SNAPSHOT-sources.jar> to /export/home/hudson/.m2/repository/org/apache/opennlp/opennlp-tools/1.5.1-incubating-SNAPSHOT/opennlp-tools-1.5.1-incubating-SNAPSHOT-sources.jar
projectSucceeded org.apache.opennlp:opennlp-tools:1.5.1-incubating-SNAPSHOT
[HUDSON] Archiving <https://hudson.apache.org/hudson/job/OpenNLP/ws/trunk/opennlp-tools/pom.xml> to /home/hudson/hudson/jobs/OpenNLP/modules/org.apache.opennlp$opennlp-tools/builds/2011-02-09_18-44-45/archive/org.apache.opennlp/opennlp-tools/1.5.1-incubating-SNAPSHOT/pom.xml
[HUDSON] Archiving <https://hudson.apache.org/hudson/job/OpenNLP/ws/trunk/opennlp-tools/target/opennlp-tools-1.5.1-incubating-SNAPSHOT.jar> to /home/hudson/hudson/jobs/OpenNLP/modules/org.apache.opennlp$opennlp-tools/builds/2011-02-09_18-44-45/archive/org.apache.opennlp/opennlp-tools/1.5.1-incubating-SNAPSHOT/opennlp-tools-1.5.1-incubating-SNAPSHOT.jar
[HUDSON] Archiving <https://hudson.apache.org/hudson/job/OpenNLP/ws/trunk/opennlp-tools/target/opennlp-tools-1.5.1-incubating-SNAPSHOT-javadoc.jar> to /home/hudson/hudson/jobs/OpenNLP/modules/org.apache.opennlp$opennlp-tools/builds/2011-02-09_18-44-45/archive/org.apache.opennlp/opennlp-tools/1.5.1-incubating-SNAPSHOT/opennlp-tools-1.5.1-incubating-SNAPSHOT-javadoc.jar
[HUDSON] Archiving <https://hudson.apache.org/hudson/job/OpenNLP/ws/trunk/opennlp-tools/target/opennlp-tools-1.5.1-incubating-SNAPSHOT-sources.jar> to /home/hudson/hudson/jobs/OpenNLP/modules/org.apache.opennlp$opennlp-tools/builds/2011-02-09_18-44-45/archive/org.apache.opennlp/opennlp-tools/1.5.1-incubating-SNAPSHOT/opennlp-tools-1.5.1-incubating-SNAPSHOT-sources.jar
[INFO]                                                                         
[INFO] ------------------------------------------------------------------------
[INFO] Building OpenNLP UIMA Annotators 1.5.1-incubating-SNAPSHOT
[INFO] ------------------------------------------------------------------------
[INFO] 
[INFO] --- maven-clean-plugin:2.4.1:clean (default-clean) @ opennlp-uima ---
[INFO] 
[INFO] --- maven-remote-resources-plugin:1.1:process (default) @ opennlp-uima ---
[INFO] Using 'UTF-8' encoding to copy filtered resources.
[INFO] 
[INFO] --- maven-resources-plugin:2.4:resources (default-resources) @ opennlp-uima ---
[INFO] Copying 1 resource
[INFO] Copying 3 resources
[INFO] 
[INFO] --- maven-compiler-plugin:2.0.2:compile (default-compile) @ opennlp-uima ---
[INFO] Compiling 49 source files to <https://hudson.apache.org/hudson/job/OpenNLP/ws/trunk/opennlp-uima/target/classes>
[WARNING] <https://hudson.apache.org/hudson/job/OpenNLP/ws/trunk/opennlp-uima/src/main/java/opennlp/uima/namefind/NameFinderTrainer.java>:[333,54] [unchecked] unchecked generic array creation of type opennlp.tools.util.ObjectStream<opennlp.tools.namefind.NameSample>[] for varargs parameter

[WARNING] <https://hudson.apache.org/hudson/job/OpenNLP/ws/trunk/opennlp-uima/src/main/java/opennlp/uima/namefind/NameFinderTrainer.java>:[339,30] [unchecked] unchecked conversion
found   : java.util.Map
required: java.util.Map<java.lang.String,java.lang.Object>

[WARNING] <https://hudson.apache.org/hudson/job/OpenNLP/ws/trunk/opennlp-uima/src/main/java/opennlp/uima/postag/POSTagger.java>:[175,35] [deprecation] tag(java.util.List<java.lang.String>) in opennlp.tools.postag.POSTaggerME has been deprecated

[WARNING] <https://hudson.apache.org/hudson/job/OpenNLP/ws/trunk/opennlp-uima/src/main/java/opennlp/uima/postag/POSTaggerTrainer.java>:[122,24] [deprecation] POSDictionary(java.io.BufferedReader,boolean) in opennlp.tools.postag.POSDictionary has been deprecated

[INFO] [INFO] Using 'UTF-8' encoding to copy filtered resources.
[INFO] skip non existing resourceDirectory <https://hudson.apache.org/hudson/job/OpenNLP/ws/trunk/opennlp-uima/src/test/resources>
[INFO] Copying 3 resources

[INFO] --- maven-resources-plugin:2.4:testResources (default-testResources) @ opennlp-uima ---
[INFO] 
[INFO] --- maven-compiler-plugin:2.0.2:testCompile (default-testCompile) @ opennlp-uima ---[INFO] No sources to compile

[INFO] 
[INFO] Surefire report directory: <https://hudson.apache.org/hudson/job/OpenNLP/ws/trunk/opennlp-uima/target/surefire-reports>
[INFO] --- maven-surefire-plugin:2.4.3:test (default-test) @ opennlp-uima ---

-------------------------------------------------------
 T E S T S
-------------------------------------------------------
There are no tests to run.

Results :

Tests run: 0, Failures: 0, Errors: 0, Skipped: 0

[HUDSON] Recording test results
[INFO] 
[INFO] --- maven-jar-plugin:2.3:jar (default-jar) @ opennlp-uima ---
[INFO] Building jar: <https://hudson.apache.org/hudson/job/OpenNLP/ws/trunk/opennlp-uima/target/opennlp-uima-1.5.1-incubating-SNAPSHOT.jar>
[INFO] 
[INFO] --- maven-javadoc-plugin:2.5:jar (create-javadoc-jar) @ opennlp-uima ---
9 warnings
[WARNING] Javadoc Warnings
[WARNING] <https://hudson.apache.org/hudson/job/OpenNLP/ws/trunk/opennlp-uima/src/main/java/opennlp/uima/util/AnnotationComparator.java>:29: warning - @param argument "<T>" is not a type parameter name.
[WARNING] <https://hudson.apache.org/hudson/job/OpenNLP/ws/trunk/opennlp-uima/src/main/java/opennlp/uima/util/OpennlpUtil.java>:45: warning - @param argument "out" is not a parameter name.
[WARNING] <https://hudson.apache.org/hudson/job/OpenNLP/ws/trunk/opennlp-uima/src/main/java/opennlp/uima/util/UimaUtil.java>:85: warning - @param argument "containerAnnotationType" is not a parameter name.
[WARNING] <https://hudson.apache.org/hudson/job/OpenNLP/ws/trunk/opennlp-uima/src/main/java/opennlp/uima/tokenize/Tokenizer.java>:54: warning - Tag @see:illegal character: "123" in "{@link TokenizerME}"
[WARNING] <https://hudson.apache.org/hudson/job/OpenNLP/ws/trunk/opennlp-uima/src/main/java/opennlp/uima/tokenize/Tokenizer.java>:54: warning - Tag @see:illegal character: "64" in "{@link TokenizerME}"
[WARNING] <https://hudson.apache.org/hudson/job/OpenNLP/ws/trunk/opennlp-uima/src/main/java/opennlp/uima/tokenize/Tokenizer.java>:54: warning - Tag @see: reference not found: {@link TokenizerME}
[WARNING] <https://hudson.apache.org/hudson/job/OpenNLP/ws/trunk/opennlp-uima/src/main/java/opennlp/uima/tokenize/TokenizerModelResource.java>:35: warning - @return tag has no arguments.
[WARNING] <https://hudson.apache.org/hudson/job/OpenNLP/ws/trunk/opennlp-uima/src/main/java/opennlp/uima/normalizer/NumberUtil.java>:36: warning - @return tag has no arguments.
[WARNING] <https://hudson.apache.org/hudson/job/OpenNLP/ws/trunk/opennlp-uima/src/main/java/opennlp/uima/normalizer/NumberUtil.java>:81: warning - @return tag has no arguments.
[INFO] Building jar: <https://hudson.apache.org/hudson/job/OpenNLP/ws/trunk/opennlp-uima/target/opennlp-uima-1.5.1-incubating-SNAPSHOT-javadoc.jar>
mojo forkStarted org.apache.maven.plugins:maven-source-plugin:2.1.1(create-source-jar)
mojo forkSucceeded org.apache.maven.plugins:maven-source-plugin:2.1.1(create-source-jar)
ignoring exception during new ExecutedMojo null
[INFO] 
[INFO] --- maven-source-plugin:2.1.1:jar (create-source-jar) @ opennlp-uima ---
[INFO] Building jar: <https://hudson.apache.org/hudson/job/OpenNLP/ws/trunk/opennlp-uima/target/opennlp-uima-1.5.1-incubating-SNAPSHOT-sources.jar>
[INFO] 
[INFO] --- maven-dependency-plugin:2.1:copy-dependencies (copy-dependencies) @ opennlp-uima ---
[INFO] Copying jwnl-1.3.3.jar to <https://hudson.apache.org/hudson/job/OpenNLP/ws/trunk/opennlp-uima/target/dependency/jwnl.jar>
[INFO] Copying opennlp-maxent-3.0.1-incubating-SNAPSHOT.jar to <https://hudson.apache.org/hudson/job/OpenNLP/ws/trunk/opennlp-uima/target/dependency/opennlp-maxent.jar>
[INFO] Copying opennlp-tools-1.5.1-incubating-SNAPSHOT.jar to <https://hudson.apache.org/hudson/job/OpenNLP/ws/trunk/opennlp-uima/target/dependency/opennlp-tools.jar>
[INFO] 
[INFO] --- apache-rat-plugin:0.6:check (default-cli) @ opennlp-uima ---
[INFO] Exclude: release.properties
[INFO] [INFO] Installing <https://hudson.apache.org/hudson/job/OpenNLP/ws/trunk/opennlp-uima/target/opennlp-uima-1.5.1-incubating-SNAPSHOT.jar> to /export/home/hudson/.m2/repository/org/apache/opennlp/opennlp-uima/1.5.1-incubating-SNAPSHOT/opennlp-uima-1.5.1-incubating-SNAPSHOT.jar

[INFO] --- maven-install-plugin:2.3:install (default-install) @ opennlp-uima ---
[INFO] Installing <https://hudson.apache.org/hudson/job/OpenNLP/ws/trunk/opennlp-uima/pom.xml> to /export/home/hudson/.m2/repository/org/apache/opennlp/opennlp-uima/1.5.1-incubating-SNAPSHOT/opennlp-uima-1.5.1-incubating-SNAPSHOT.pom
[INFO] Installing <https://hudson.apache.org/hudson/job/OpenNLP/ws/trunk/opennlp-uima/target/opennlp-uima-1.5.1-incubating-SNAPSHOT-javadoc.jar> to /export/home/hudson/.m2/repository/org/apache/opennlp/opennlp-uima/1.5.1-incubating-SNAPSHOT/opennlp-uima-1.5.1-incubating-SNAPSHOT-javadoc.jar
[INFO] Installing <https://hudson.apache.org/hudson/job/OpenNLP/ws/trunk/opennlp-uima/target/opennlp-uima-1.5.1-incubating-SNAPSHOT-sources.jar> to /export/home/hudson/.m2/repository/org/apache/opennlp/opennlp-uima/1.5.1-incubating-SNAPSHOT/opennlp-uima-1.5.1-incubating-SNAPSHOT-sources.jar
projectSucceeded org.apache.opennlp:opennlp-uima:1.5.1-incubating-SNAPSHOT
[HUDSON] Archiving <https://hudson.apache.org/hudson/job/OpenNLP/ws/trunk/opennlp-uima/pom.xml> to /home/hudson/hudson/jobs/OpenNLP/modules/org.apache.opennlp$opennlp-uima/builds/2011-02-09_18-44-45/archive/org.apache.opennlp/opennlp-uima/1.5.1-incubating-SNAPSHOT/pom.xml
[HUDSON] Archiving <https://hudson.apache.org/hudson/job/OpenNLP/ws/trunk/opennlp-uima/target/opennlp-uima-1.5.1-incubating-SNAPSHOT.jar> to /home/hudson/hudson/jobs/OpenNLP/modules/org.apache.opennlp$opennlp-uima/builds/2011-02-09_18-44-45/archive/org.apache.opennlp/opennlp-uima/1.5.1-incubating-SNAPSHOT/opennlp-uima-1.5.1-incubating-SNAPSHOT.jar
[HUDSON] Archiving <https://hudson.apache.org/hudson/job/OpenNLP/ws/trunk/opennlp-uima/target/opennlp-uima-1.5.1-incubating-SNAPSHOT-javadoc.jar> to /home/hudson/hudson/jobs/OpenNLP/modules/org.apache.opennlp$opennlp-uima/builds/2011-02-09_18-44-45/archive/org.apache.opennlp/opennlp-uima/1.5.1-incubating-SNAPSHOT/opennlp-uima-1.5.1-incubating-SNAPSHOT-javadoc.jar
[HUDSON] Archiving <https://hudson.apache.org/hudson/job/OpenNLP/ws/trunk/opennlp-uima/target/opennlp-uima-1.5.1-incubating-SNAPSHOT-sources.jar> to /home/hudson/hudson/jobs/OpenNLP/modules/org.apache.opennlp$opennlp-uima/builds/2011-02-09_18-44-45/archive/org.apache.opennlp/opennlp-uima/1.5.1-incubating-SNAPSHOT/opennlp-uima-1.5.1-incubating-SNAPSHOT-sources.jar
[INFO]                                                                         
[INFO] ------------------------------------------------------------------------
[INFO] Building OpenNLP Documentation 1.5.1-incubating-SNAPSHOT
[INFO] ------------------------------------------------------------------------
[INFO] 
[INFO] --- maven-clean-plugin:2.4.1:clean (default-clean) @ opennlp-docs ---
[INFO] 
[INFO] --- maven-remote-resources-plugin:1.1:process (default) @ opennlp-docs ---
[INFO] 
[INFO] --- maven-javadoc-plugin:2.5:jar (create-javadoc-jar) @ opennlp-docs ---
[INFO] Not executing Javadoc as the project is not a Java classpath-capable package
mojo forkStarted org.apache.maven.plugins:maven-source-plugin:2.1.1(create-source-jar)
mojo forkSucceeded org.apache.maven.plugins:maven-source-plugin:2.1.1(create-source-jar)
ignoring exception during new ExecutedMojo null
[INFO] 
[INFO] --- maven-source-plugin:2.1.1:jar (create-source-jar) @ opennlp-docs ---
[INFO] 
[INFO] --- docbkx-maven-plugin:2.0.11:generate-html (default) @ opennlp-docs ---
[INFO] Processing input file: opennlp.xml
Error 
  Failure reading <https://hudson.apache.org/hudson/job/OpenNLP/ws/trunk/opennlp-docs/src/docbkx/opennlp.xml>: Server returned HTTP response code: 403 for URL: http://www.oasis-open.org/docbook/xml/4.4/ent/isoamsb.ent
mojoFailed com.agilejava.docbkx:docbkx-maven-plugin:2.0.11(default)
projectFailed org.apache.opennlp:opennlp-docs:1.5.1-incubating-SNAPSHOT
[HUDSON] Archiving <https://hudson.apache.org/hudson/job/OpenNLP/ws/trunk/opennlp-docs/pom.xml> to /home/hudson/hudson/jobs/OpenNLP/modules/org.apache.opennlp$opennlp-docs/builds/2011-02-09_18-44-45/archive/org.apache.opennlp/opennlp-docs/1.5.1-incubating-SNAPSHOT/pom.xml
sessionEnded
[INFO] ------------------------------------------------------------------------
[INFO] Reactor Summary:
[INFO] 
[INFO] OpenNLP Reactor ................................... SUCCESS [5.245s]
[INFO] OpenNLP Maxent .................................... SUCCESS [15.851s]
[INFO] OpenNLP Tools ..................................... SUCCESS [2:43.868s]
[INFO] OpenNLP UIMA Annotators ........................... SUCCESS [10.375s]
[INFO] OpenNLP Documentation ............................. FAILURE [1:08.147s]
[INFO] OpenNLP Distribution .............................. SKIPPED
[INFO] ------------------------------------------------------------------------
[INFO] BUILD FAILURE
[INFO] ------------------------------------------------------------------------
[INFO] Total time: 4:31.524s
[INFO] Finished at: Wed Feb 09 13:49:21 EST 2011
[INFO] Final Memory: 23M/185M
[INFO] ------------------------------------------------------------------------
mavenExecutionResult exceptions not empty
org.apache.maven.lifecycle.LifecycleExecutionException: Failed to execute goal com.agilejava.docbkx:docbkx-maven-plugin:2.0.11:generate-html (default) on project opennlp-docs: Failed to transform opennlp.xml.
	at org.apache.maven.lifecycle.internal.MojoExecutor.execute(MojoExecutor.java:217)
	at org.apache.maven.lifecycle.internal.MojoExecutor.execute(MojoExecutor.java:153)
	at org.apache.maven.lifecycle.internal.MojoExecutor.execute(MojoExecutor.java:145)
	at org.apache.maven.lifecycle.internal.LifecycleModuleBuilder.buildProject(LifecycleModuleBuilder.java:84)
	at org.apache.maven.lifecycle.internal.LifecycleModuleBuilder.buildProject(LifecycleModuleBuilder.java:59)
	at org.apache.maven.lifecycle.internal.LifecycleStarter.singleThreadedBuild(LifecycleStarter.java:183)
	at org.apache.maven.lifecycle.internal.LifecycleStarter.execute(LifecycleStarter.java:161)
	at org.apache.maven.DefaultMaven.doExecute(DefaultMaven.java:319)
	at org.apache.maven.DefaultMaven.execute(DefaultMaven.java:156)
	at org.jvnet.hudson.maven3.launcher.Maven3Launcher.main(Maven3Launcher.java:79)
	at sun.reflect.NativeMethodAccessorImpl.invoke0(Native Method)
	at sun.reflect.NativeMethodAccessorImpl.invoke(NativeMethodAccessorImpl.java:39)
	at sun.reflect.DelegatingMethodAccessorImpl.invoke(DelegatingMethodAccessorImpl.java:25)
	at java.lang.reflect.Method.invoke(Method.java:592)
	at org.codehaus.plexus.classworlds.launcher.Launcher.launchStandard(Launcher.java:329)
	at org.codehaus.plexus.classworlds.launcher.Launcher.launch(Launcher.java:239)
	at org.jvnet.hudson.maven3.agent.Maven3Main.launch(Maven3Main.java:145)
	at hudson.maven.Maven3Builder.call(Maven3Builder.java:124)
	at hudson.maven.Maven3Builder.call(Maven3Builder.java:71)
	at hudson.remoting.UserRequest.perform(UserRequest.java:114)
	at hudson.remoting.UserRequest.perform(UserRequest.java:48)
	at hudson.remoting.Request$2.run(Request.java:270)
	at java.util.concurrent.Executors$RunnableAdapter.call(Executors.java:417)
	at java.util.concurrent.FutureTask$Sync.innerRun(FutureTask.java:269)
	at java.util.concurrent.FutureTask.run(FutureTask.java:123)
	at java.util.concurrent.ThreadPoolExecutor$Worker.runTask(ThreadPoolExecutor.java:651)
	at java.util.concurrent.ThreadPoolExecutor$Worker.run(ThreadPoolExecutor.java:676)
	at java.lang.Thread.run(Thread.java:595)
Caused by: org.apache.maven.plugin.MojoExecutionException: Failed to transform opennlp.xml.
	at com.agilejava.docbkx.maven.AbstractTransformerMojo.execute(AbstractTransformerMojo.java:174)
	at org.apache.maven.plugin.DefaultBuildPluginManager.executeMojo(DefaultBuildPluginManager.java:107)
	at org.apache.maven.lifecycle.internal.MojoExecutor.execute(MojoExecutor.java:209)
	... 27 more
Caused by: javax.xml.transform.TransformerException: Failure reading <https://hudson.apache.org/hudson/job/OpenNLP/ws/trunk/opennlp-docs/src/docbkx/opennlp.xml>
	at com.icl.saxon.om.Builder.build(Builder.java:267)
	at com.icl.saxon.Controller.transform(Controller.java:936)
	at com.agilejava.docbkx.maven.AbstractTransformerMojo.execute(AbstractTransformerMojo.java:155)
	... 29 more
Caused by: java.io.IOException: Server returned HTTP response code: 403 for URL: http://www.oasis-open.org/docbook/xml/4.4/ent/isoamsb.ent
	at sun.net.www.protocol.http.HttpURLConnection.getInputStream(HttpURLConnection.java:1196)
	at org.apache.xerces.impl.XMLEntityManager.setupCurrentEntity(Unknown Source)
	at org.apache.xerces.impl.XMLEntityManager.startEntity(Unknown Source)
	at org.apache.xerces.impl.XMLEntityManager.startEntity(Unknown Source)
	at org.apache.xerces.impl.XMLDTDScannerImpl.startPE(Unknown Source)
	at org.apache.xerces.impl.XMLDTDScannerImpl.skipSeparator(Unknown Source)
	at org.apache.xerces.impl.XMLDTDScannerImpl.scanDecls(Unknown Source)
	at org.apache.xerces.impl.XMLDTDScannerImpl.scanDTDExternalSubset(Unknown Source)
	at org.apache.xerces.impl.XMLDocumentScannerImpl$DTDDispatcher.dispatch(Unknown Source)
	at org.apache.xerces.impl.XMLDocumentFragmentScannerImpl.scanDocument(Unknown Source)
	at org.apache.xerces.parsers.XML11Configuration.parse(Unknown Source)
	at org.apache.xerces.parsers.XML11Configuration.parse(Unknown Source)
	at org.apache.xerces.xinclude.XIncludeHandler.handleIncludeElement(Unknown Source)
	at org.apache.xerces.xinclude.XIncludeHandler.emptyElement(Unknown Source)
	at org.apache.xerces.impl.dtd.XMLDTDValidator.emptyElement(Unknown Source)
	at org.apache.xerces.impl.XMLNSDocumentScannerImpl.scanStartElement(Unknown Source)
	at org.apache.xerces.impl.XMLDocumentFragmentScannerImpl$FragmentContentDispatcher.dispatch(Unknown Source)
	at org.apache.xerces.impl.XMLDocumentFragmentScannerImpl.scanDocument(Unknown Source)
	at org.apache.xerces.parsers.XML11Configuration.parse(Unknown Source)
	at org.apache.xerces.parsers.XML11Configuration.parse(Unknown Source)
	at org.apache.xerces.parsers.XMLParser.parse(Unknown Source)
	at org.apache.xerces.parsers.AbstractSAXParser.parse(Unknown Source)
	at org.apache.xerces.jaxp.SAXParserImpl$JAXPSAXParser.parse(Unknown Source)
	at org.xml.sax.helpers.XMLFilterImpl.parse(XMLFilterImpl.java:333)
	at com.icl.saxon.om.Builder.build(Builder.java:265)
	... 31 more
Sending e-mails to: opennlp-dev@incubator.apache.org
channel stopped
[WARNINGS] Skipping publisher since build result is FAILURE


Hudson build is back to normal : OpenNLP #11

Posted by Apache Hudson Server <hu...@hudson.apache.org>.
See <https://hudson.apache.org/hudson/job/OpenNLP/11/>