You are viewing a plain text version of this content. The canonical link for it is here.
Posted to builds@beam.apache.org by Apache Jenkins Server <je...@builds.apache.org> on 2019/05/17 06:48:24 UTC

Build failed in Jenkins: beam_PerformanceTests_WordCountIT_Py35 #3

See <https://builds.apache.org/job/beam_PerformanceTests_WordCountIT_Py35/3/display/redirect>

------------------------------------------
Started by timer
[EnvInject] - Loading node environment variables.
Building remotely on apache-beam-jenkins-5 (beam) in workspace <https://builds.apache.org/job/beam_PerformanceTests_WordCountIT_Py35/ws/>
No credentials specified
 > git rev-parse --is-inside-work-tree # timeout=10
Fetching changes from the remote Git repository
 > git config remote.origin.url https://github.com/apache/beam.git # timeout=10
Fetching upstream changes from https://github.com/apache/beam.git
 > git --version # timeout=10
 > git fetch --tags --progress https://github.com/apache/beam.git +refs/heads/*:refs/remotes/origin/* +refs/pull/${ghprbPullId}/*:refs/remotes/origin/pr/${ghprbPullId}/*
 > git rev-parse origin/master^{commit} # timeout=10
Checking out Revision d77474d16734cf63095765cbced97ecd4b016b54 (origin/master)
 > git config core.sparsecheckout # timeout=10
 > git checkout -f d77474d16734cf63095765cbced97ecd4b016b54
Commit message: "[BEAM-6908] Refactor Python performance test groovy file for easy configuration (#8518)"
 > git rev-list --no-walk d77474d16734cf63095765cbced97ecd4b016b54 # timeout=10
Cleaning workspace
 > git rev-parse --verify HEAD # timeout=10
Resetting working tree
 > git reset --hard # timeout=10
 > git clean -fdx # timeout=10
[EnvInject] - Executing scripts and injecting environment variables after the SCM step.
[EnvInject] - Injecting as environment variables the properties content 
SPARK_LOCAL_IP=127.0.0.1

[EnvInject] - Variables injected successfully.
[beam_PerformanceTests_WordCountIT_Py35] $ /bin/bash -xe /tmp/jenkins7242625337022815338.sh
+ rm -rf <https://builds.apache.org/job/beam_PerformanceTests_WordCountIT_Py35/ws/PerfKitBenchmarker>
[beam_PerformanceTests_WordCountIT_Py35] $ /bin/bash -xe /tmp/jenkins3745069613698612603.sh
+ rm -rf <https://builds.apache.org/job/beam_PerformanceTests_WordCountIT_Py35/ws/env/.perfkit_env>
[beam_PerformanceTests_WordCountIT_Py35] $ /bin/bash -xe /tmp/jenkins6069179624964996602.sh
+ virtualenv <https://builds.apache.org/job/beam_PerformanceTests_WordCountIT_Py35/ws/env/.perfkit_env> --python=python2.7
New python executable in <https://builds.apache.org/job/beam_PerformanceTests_WordCountIT_Py35/ws/env/.perfkit_env/bin/python2.7>
Also creating executable in <https://builds.apache.org/job/beam_PerformanceTests_WordCountIT_Py35/ws/env/.perfkit_env/bin/python>
Installing setuptools, pip, wheel...
done.
Running virtualenv with interpreter /usr/bin/python2.7
[beam_PerformanceTests_WordCountIT_Py35] $ /bin/bash -xe /tmp/jenkins9115572581674914542.sh
+ <https://builds.apache.org/job/beam_PerformanceTests_WordCountIT_Py35/ws/env/.perfkit_env/bin/pip> install --upgrade setuptools pip
DEPRECATION: Python 2.7 will reach the end of its life on January 1st, 2020. Please upgrade your Python as Python 2.7 won't be maintained after that date. A future version of pip will drop support for Python 2.7.
Requirement already up-to-date: setuptools in ./env/.perfkit_env/lib/python2.7/site-packages (41.0.1)
Requirement already up-to-date: pip in ./env/.perfkit_env/lib/python2.7/site-packages (19.1.1)
[beam_PerformanceTests_WordCountIT_Py35] $ /bin/bash -xe /tmp/jenkins2708166431847788697.sh
+ git clone https://github.com/GoogleCloudPlatform/PerfKitBenchmarker.git <https://builds.apache.org/job/beam_PerformanceTests_WordCountIT_Py35/ws/PerfKitBenchmarker>
Cloning into '<https://builds.apache.org/job/beam_PerformanceTests_WordCountIT_Py35/ws/PerfKitBenchmarker'...>
[beam_PerformanceTests_WordCountIT_Py35] $ /bin/bash -xe /tmp/jenkins6649724610155567766.sh
+ <https://builds.apache.org/job/beam_PerformanceTests_WordCountIT_Py35/ws/env/.perfkit_env/bin/pip> install -r <https://builds.apache.org/job/beam_PerformanceTests_WordCountIT_Py35/ws/PerfKitBenchmarker/requirements.txt>
DEPRECATION: Python 2.7 will reach the end of its life on January 1st, 2020. Please upgrade your Python as Python 2.7 won't be maintained after that date. A future version of pip will drop support for Python 2.7.
Collecting absl-py (from -r <https://builds.apache.org/job/beam_PerformanceTests_WordCountIT_Py35/ws/PerfKitBenchmarker/requirements.txt> (line 14))
Collecting jinja2>=2.7 (from -r <https://builds.apache.org/job/beam_PerformanceTests_WordCountIT_Py35/ws/PerfKitBenchmarker/requirements.txt> (line 15))
  Using cached https://files.pythonhosted.org/packages/1d/e7/fd8b501e7a6dfe492a433deb7b9d833d39ca74916fa8bc63dd1a4947a671/Jinja2-2.10.1-py2.py3-none-any.whl
Requirement already satisfied: setuptools in ./env/.perfkit_env/lib/python2.7/site-packages (from -r <https://builds.apache.org/job/beam_PerformanceTests_WordCountIT_Py35/ws/PerfKitBenchmarker/requirements.txt> (line 16)) (41.0.1)
Collecting colorlog[windows]==2.6.0 (from -r <https://builds.apache.org/job/beam_PerformanceTests_WordCountIT_Py35/ws/PerfKitBenchmarker/requirements.txt> (line 17))
  Using cached https://files.pythonhosted.org/packages/59/1a/46a1bf2044ad8b30b52fed0f389338c85747e093fe7f51a567f4cb525892/colorlog-2.6.0-py2.py3-none-any.whl
Collecting blinker>=1.3 (from -r <https://builds.apache.org/job/beam_PerformanceTests_WordCountIT_Py35/ws/PerfKitBenchmarker/requirements.txt> (line 18))
Collecting futures>=3.0.3 (from -r <https://builds.apache.org/job/beam_PerformanceTests_WordCountIT_Py35/ws/PerfKitBenchmarker/requirements.txt> (line 19))
  Using cached https://files.pythonhosted.org/packages/2d/99/b2c4e9d5a30f6471e410a146232b4118e697fa3ffc06d6a65efde84debd0/futures-3.2.0-py2-none-any.whl
Collecting PyYAML==3.12 (from -r <https://builds.apache.org/job/beam_PerformanceTests_WordCountIT_Py35/ws/PerfKitBenchmarker/requirements.txt> (line 20))
Collecting pint>=0.7 (from -r <https://builds.apache.org/job/beam_PerformanceTests_WordCountIT_Py35/ws/PerfKitBenchmarker/requirements.txt> (line 21))
  Using cached https://files.pythonhosted.org/packages/15/9d/bf177ebbc57d25e9e296addc14a1303d1e34d7964af5df428a8332349c42/Pint-0.9-py2.py3-none-any.whl
Collecting numpy==1.13.3 (from -r <https://builds.apache.org/job/beam_PerformanceTests_WordCountIT_Py35/ws/PerfKitBenchmarker/requirements.txt> (line 22))
  Using cached https://files.pythonhosted.org/packages/eb/be/737f3df5806192ac4096e549e48c8c76cfaa2fb880a1c62a7bb085adaa9b/numpy-1.13.3-cp27-cp27mu-manylinux1_x86_64.whl
Collecting functools32 (from -r <https://builds.apache.org/job/beam_PerformanceTests_WordCountIT_Py35/ws/PerfKitBenchmarker/requirements.txt> (line 23))
Collecting contextlib2>=0.5.1 (from -r <https://builds.apache.org/job/beam_PerformanceTests_WordCountIT_Py35/ws/PerfKitBenchmarker/requirements.txt> (line 24))
  Using cached https://files.pythonhosted.org/packages/a2/71/8273a7eeed0aff6a854237ab5453bc9aa67deb49df4832801c21f0ff3782/contextlib2-0.5.5-py2.py3-none-any.whl
Collecting pywinrm (from -r <https://builds.apache.org/job/beam_PerformanceTests_WordCountIT_Py35/ws/PerfKitBenchmarker/requirements.txt> (line 25))
  Using cached https://files.pythonhosted.org/packages/0d/12/13a3117bbd2230043aa32dcfa2198c33269665eaa1a8fa26174ce49b338f/pywinrm-0.3.0-py2.py3-none-any.whl
Collecting timeout-decorator (from -r <https://builds.apache.org/job/beam_PerformanceTests_WordCountIT_Py35/ws/PerfKitBenchmarker/requirements.txt> (line 26))
Collecting enum34; python_version < "3.4" (from absl-py->-r <https://builds.apache.org/job/beam_PerformanceTests_WordCountIT_Py35/ws/PerfKitBenchmarker/requirements.txt> (line 14))
  Using cached https://files.pythonhosted.org/packages/c5/db/e56e6b4bbac7c4a06de1c50de6fe1ef3810018ae11732a50f15f62c7d050/enum34-1.1.6-py2-none-any.whl
Collecting six (from absl-py->-r <https://builds.apache.org/job/beam_PerformanceTests_WordCountIT_Py35/ws/PerfKitBenchmarker/requirements.txt> (line 14))
  Using cached https://files.pythonhosted.org/packages/73/fb/00a976f728d0d1fecfe898238ce23f502a721c0ac0ecfedb80e0d88c64e9/six-1.12.0-py2.py3-none-any.whl
Collecting MarkupSafe>=0.23 (from jinja2>=2.7->-r <https://builds.apache.org/job/beam_PerformanceTests_WordCountIT_Py35/ws/PerfKitBenchmarker/requirements.txt> (line 15))
  Using cached https://files.pythonhosted.org/packages/fb/40/f3adb7cf24a8012813c5edb20329eb22d5d8e2a0ecf73d21d6b85865da11/MarkupSafe-1.1.1-cp27-cp27mu-manylinux1_x86_64.whl
Collecting colorama; extra == "windows" (from colorlog[windows]==2.6.0->-r <https://builds.apache.org/job/beam_PerformanceTests_WordCountIT_Py35/ws/PerfKitBenchmarker/requirements.txt> (line 17))
  Using cached https://files.pythonhosted.org/packages/4f/a6/728666f39bfff1719fc94c481890b2106837da9318031f71a8424b662e12/colorama-0.4.1-py2.py3-none-any.whl
Collecting funcsigs; python_version == "2.7" (from pint>=0.7->-r <https://builds.apache.org/job/beam_PerformanceTests_WordCountIT_Py35/ws/PerfKitBenchmarker/requirements.txt> (line 21))
  Using cached https://files.pythonhosted.org/packages/69/cb/f5be453359271714c01b9bd06126eaf2e368f1fddfff30818754b5ac2328/funcsigs-1.0.2-py2.py3-none-any.whl
Collecting requests-ntlm>=0.3.0 (from pywinrm->-r <https://builds.apache.org/job/beam_PerformanceTests_WordCountIT_Py35/ws/PerfKitBenchmarker/requirements.txt> (line 25))
  Using cached https://files.pythonhosted.org/packages/03/4b/8b9a1afde8072c4d5710d9fa91433d504325821b038e00237dc8d6d833dc/requests_ntlm-1.1.0-py2.py3-none-any.whl
Collecting requests>=2.9.1 (from pywinrm->-r <https://builds.apache.org/job/beam_PerformanceTests_WordCountIT_Py35/ws/PerfKitBenchmarker/requirements.txt> (line 25))
  Using cached https://files.pythonhosted.org/packages/51/bd/23c926cd341ea6b7dd0b2a00aba99ae0f828be89d72b2190f27c11d4b7fb/requests-2.22.0-py2.py3-none-any.whl
Collecting xmltodict (from pywinrm->-r <https://builds.apache.org/job/beam_PerformanceTests_WordCountIT_Py35/ws/PerfKitBenchmarker/requirements.txt> (line 25))
  Using cached https://files.pythonhosted.org/packages/28/fd/30d5c1d3ac29ce229f6bdc40bbc20b28f716e8b363140c26eff19122d8a5/xmltodict-0.12.0-py2.py3-none-any.whl
Collecting cryptography>=1.3 (from requests-ntlm>=0.3.0->pywinrm->-r <https://builds.apache.org/job/beam_PerformanceTests_WordCountIT_Py35/ws/PerfKitBenchmarker/requirements.txt> (line 25))
  Using cached https://files.pythonhosted.org/packages/c3/c1/cf8665c955c9393e9ff0872ba6cd3dc6f46ef915e94afcf6e0410508ca69/cryptography-2.6.1-cp27-cp27mu-manylinux1_x86_64.whl
Collecting ntlm-auth>=1.0.2 (from requests-ntlm>=0.3.0->pywinrm->-r <https://builds.apache.org/job/beam_PerformanceTests_WordCountIT_Py35/ws/PerfKitBenchmarker/requirements.txt> (line 25))
  Using cached https://files.pythonhosted.org/packages/d5/3d/1c54e92f62bbc747a638da94adb439f99dc2d2f3041fe41a06b0da4f2808/ntlm_auth-1.3.0-py2.py3-none-any.whl
Collecting urllib3!=1.25.0,!=1.25.1,<1.26,>=1.21.1 (from requests>=2.9.1->pywinrm->-r <https://builds.apache.org/job/beam_PerformanceTests_WordCountIT_Py35/ws/PerfKitBenchmarker/requirements.txt> (line 25))
  Using cached https://files.pythonhosted.org/packages/39/ec/d93dfc69617a028915df914339ef66936ea976ef24fa62940fd86ba0326e/urllib3-1.25.2-py2.py3-none-any.whl
Collecting certifi>=2017.4.17 (from requests>=2.9.1->pywinrm->-r <https://builds.apache.org/job/beam_PerformanceTests_WordCountIT_Py35/ws/PerfKitBenchmarker/requirements.txt> (line 25))
  Using cached https://files.pythonhosted.org/packages/60/75/f692a584e85b7eaba0e03827b3d51f45f571c2e793dd731e598828d380aa/certifi-2019.3.9-py2.py3-none-any.whl
Collecting chardet<3.1.0,>=3.0.2 (from requests>=2.9.1->pywinrm->-r <https://builds.apache.org/job/beam_PerformanceTests_WordCountIT_Py35/ws/PerfKitBenchmarker/requirements.txt> (line 25))
  Using cached https://files.pythonhosted.org/packages/bc/a9/01ffebfb562e4274b6487b4bb1ddec7ca55ec7510b22e4c51f14098443b8/chardet-3.0.4-py2.py3-none-any.whl
Collecting idna<2.9,>=2.5 (from requests>=2.9.1->pywinrm->-r <https://builds.apache.org/job/beam_PerformanceTests_WordCountIT_Py35/ws/PerfKitBenchmarker/requirements.txt> (line 25))
  Using cached https://files.pythonhosted.org/packages/14/2c/cd551d81dbe15200be1cf41cd03869a46fe7226e7450af7a6545bfc474c9/idna-2.8-py2.py3-none-any.whl
Collecting cffi!=1.11.3,>=1.8 (from cryptography>=1.3->requests-ntlm>=0.3.0->pywinrm->-r <https://builds.apache.org/job/beam_PerformanceTests_WordCountIT_Py35/ws/PerfKitBenchmarker/requirements.txt> (line 25))
  Using cached https://files.pythonhosted.org/packages/8d/e9/0c8afd1579e5cf7bc0f06fbcd7cdb954cbc0baadd505973949a99337da1c/cffi-1.12.3-cp27-cp27mu-manylinux1_x86_64.whl
Collecting asn1crypto>=0.21.0 (from cryptography>=1.3->requests-ntlm>=0.3.0->pywinrm->-r <https://builds.apache.org/job/beam_PerformanceTests_WordCountIT_Py35/ws/PerfKitBenchmarker/requirements.txt> (line 25))
  Using cached https://files.pythonhosted.org/packages/ea/cd/35485615f45f30a510576f1a56d1e0a7ad7bd8ab5ed7cdc600ef7cd06222/asn1crypto-0.24.0-py2.py3-none-any.whl
Collecting ipaddress; python_version < "3" (from cryptography>=1.3->requests-ntlm>=0.3.0->pywinrm->-r <https://builds.apache.org/job/beam_PerformanceTests_WordCountIT_Py35/ws/PerfKitBenchmarker/requirements.txt> (line 25))
  Using cached https://files.pythonhosted.org/packages/fc/d0/7fc3a811e011d4b388be48a0e381db8d990042df54aa4ef4599a31d39853/ipaddress-1.0.22-py2.py3-none-any.whl
Collecting pycparser (from cffi!=1.11.3,>=1.8->cryptography>=1.3->requests-ntlm>=0.3.0->pywinrm->-r <https://builds.apache.org/job/beam_PerformanceTests_WordCountIT_Py35/ws/PerfKitBenchmarker/requirements.txt> (line 25))
Installing collected packages: enum34, six, absl-py, MarkupSafe, jinja2, colorama, colorlog, blinker, futures, PyYAML, funcsigs, pint, numpy, functools32, contextlib2, urllib3, certifi, chardet, idna, requests, pycparser, cffi, asn1crypto, ipaddress, cryptography, ntlm-auth, requests-ntlm, xmltodict, pywinrm, timeout-decorator
Successfully installed MarkupSafe-1.1.1 PyYAML-3.12 absl-py-0.7.1 asn1crypto-0.24.0 blinker-1.4 certifi-2019.3.9 cffi-1.12.3 chardet-3.0.4 colorama-0.4.1 colorlog-2.6.0 contextlib2-0.5.5 cryptography-2.6.1 enum34-1.1.6 funcsigs-1.0.2 functools32-3.2.3.post2 futures-3.2.0 idna-2.8 ipaddress-1.0.22 jinja2-2.10.1 ntlm-auth-1.3.0 numpy-1.13.3 pint-0.9 pycparser-2.19 pywinrm-0.3.0 requests-2.22.0 requests-ntlm-1.1.0 six-1.12.0 timeout-decorator-0.4.1 urllib3-1.25.2 xmltodict-0.12.0
[beam_PerformanceTests_WordCountIT_Py35] $ /bin/bash -xe /tmp/jenkins9159211478286147480.sh
+ <https://builds.apache.org/job/beam_PerformanceTests_WordCountIT_Py35/ws/env/.perfkit_env/bin/python> <https://builds.apache.org/job/beam_PerformanceTests_WordCountIT_Py35/ws/PerfKitBenchmarker/pkb.py> --project=apache-beam-testing --dpb_log_level=INFO --bigquery_table=beam_performance.wordcount_py35_pkb_results --k8s_get_retry_count=36 --k8s_get_wait_interval=10 --temp_dir=<https://builds.apache.org/job/beam_PerformanceTests_WordCountIT_Py35/ws/> --beam_location=<https://builds.apache.org/job/beam_PerformanceTests_WordCountIT_Py35/ws/src> --official=true --beam_sdk=python --benchmarks=beam_integration_benchmark --beam_it_class=apache_beam.examples.wordcount_it_test:WordCountIT.test_wordcount_it --beam_it_module=sdks/python/test-suites/dataflow/py35 --beam_prebuilt=true --beam_python_sdk_location=test-suites/dataflow/py35/build/apache-beam.tar.gz --beam_runner=TestDataflowRunner --beam_it_timeout=1200 --beam_it_args=--project=apache-beam-testing,--staging_location=gs://temp-storage-for-end-to-end-tests/staging-it,--temp_location=gs://temp-storage-for-end-to-end-tests/temp-it,--output=gs://temp-storage-for-end-to-end-tests/py-it-cloud/output
2019-05-17 06:48:23,659 fbe0bec2 MainThread INFO     Verbose logging to: <https://builds.apache.org/job/beam_PerformanceTests_WordCountIT_Py35/ws/runs/fbe0bec2/pkb.log>
2019-05-17 06:48:23,659 fbe0bec2 MainThread INFO     PerfKitBenchmarker version: v1.12.0-1183-g0bd23a1
2019-05-17 06:48:23,661 fbe0bec2 MainThread INFO     Flag values:
--beam_it_class=apache_beam.examples.wordcount_it_test:WordCountIT.test_wordcount_it
--beam_it_timeout=1200
--beam_it_module=sdks/python/test-suites/dataflow/py35
--beam_sdk=python
--k8s_get_wait_interval=10
--bigquery_table=beam_performance.wordcount_py35_pkb_results
--temp_dir=<https://builds.apache.org/job/beam_PerformanceTests_WordCountIT_Py35/ws/>
--beam_it_args=--project=apache-beam-testing,--staging_location=gs://temp-storage-for-end-to-end-tests/staging-it,--temp_location=gs://temp-storage-for-end-to-end-tests/temp-it,--output=gs://temp-storage-for-end-to-end-tests/py-it-cloud/output
--beam_prebuilt
--project=apache-beam-testing
--official
--dpb_log_level=INFO
--beam_location=<https://builds.apache.org/job/beam_PerformanceTests_WordCountIT_Py35/ws/src>
--beam_runner=TestDataflowRunner
--k8s_get_retry_count=36
--benchmarks=beam_integration_benchmark
--beam_python_sdk_location=test-suites/dataflow/py35/build/apache-beam.tar.gz
2019-05-17 06:48:23,985 fbe0bec2 MainThread INFO     Setting --max_concurrent_threads=200.
2019-05-17 06:48:24,006 fbe0bec2 MainThread WARNING  The key "flags" was not in the default config, but was in user overrides. This may indicate a typo.
2019-05-17 06:48:24,030 fbe0bec2 MainThread beam_integration_benchmark(1/1) INFO     Provisioning resources for benchmark beam_integration_benchmark
2019-05-17 06:48:24,030 fbe0bec2 MainThread beam_integration_benchmark(1/1) ERROR    Error during benchmark beam_integration_benchmark
Traceback (most recent call last):
  File "<https://builds.apache.org/job/beam_PerformanceTests_WordCountIT_Py35/ws/PerfKitBenchmarker/perfkitbenchmarker/pkb.py",> line 752, in RunBenchmark
    DoProvisionPhase(spec, detailed_timer)
  File "<https://builds.apache.org/job/beam_PerformanceTests_WordCountIT_Py35/ws/PerfKitBenchmarker/perfkitbenchmarker/pkb.py",> line 538, in DoProvisionPhase
    spec.ConstructDpbService()
  File "<https://builds.apache.org/job/beam_PerformanceTests_WordCountIT_Py35/ws/PerfKitBenchmarker/perfkitbenchmarker/benchmark_spec.py",> line 209, in ConstructDpbService
    self.dpb_service = dpb_service_class(self.config.dpb_service)
  File "<https://builds.apache.org/job/beam_PerformanceTests_WordCountIT_Py35/ws/PerfKitBenchmarker/perfkitbenchmarker/providers/gcp/gcp_dpb_dataflow.py",> line 53, in __init__
    super(GcpDpbDataflow, self).__init__(dpb_service_spec)
  File "<https://builds.apache.org/job/beam_PerformanceTests_WordCountIT_Py35/ws/PerfKitBenchmarker/perfkitbenchmarker/dpb_service.py",> line 127, in __init__
    'The flag dpb_service_zone must be provided, for provisioning.')
InvalidFlagConfigurationError: The flag dpb_service_zone must be provided, for provisioning.
2019-05-17 06:48:24,032 fbe0bec2 MainThread beam_integration_benchmark(1/1) ERROR    Exception running benchmark
Traceback (most recent call last):
  File "<https://builds.apache.org/job/beam_PerformanceTests_WordCountIT_Py35/ws/PerfKitBenchmarker/perfkitbenchmarker/pkb.py",> line 903, in RunBenchmarkTask
    RunBenchmark(spec, collector)
  File "<https://builds.apache.org/job/beam_PerformanceTests_WordCountIT_Py35/ws/PerfKitBenchmarker/perfkitbenchmarker/pkb.py",> line 752, in RunBenchmark
    DoProvisionPhase(spec, detailed_timer)
  File "<https://builds.apache.org/job/beam_PerformanceTests_WordCountIT_Py35/ws/PerfKitBenchmarker/perfkitbenchmarker/pkb.py",> line 538, in DoProvisionPhase
    spec.ConstructDpbService()
  File "<https://builds.apache.org/job/beam_PerformanceTests_WordCountIT_Py35/ws/PerfKitBenchmarker/perfkitbenchmarker/benchmark_spec.py",> line 209, in ConstructDpbService
    self.dpb_service = dpb_service_class(self.config.dpb_service)
  File "<https://builds.apache.org/job/beam_PerformanceTests_WordCountIT_Py35/ws/PerfKitBenchmarker/perfkitbenchmarker/providers/gcp/gcp_dpb_dataflow.py",> line 53, in __init__
    super(GcpDpbDataflow, self).__init__(dpb_service_spec)
  File "<https://builds.apache.org/job/beam_PerformanceTests_WordCountIT_Py35/ws/PerfKitBenchmarker/perfkitbenchmarker/dpb_service.py",> line 127, in __init__
    'The flag dpb_service_zone must be provided, for provisioning.')
InvalidFlagConfigurationError: The flag dpb_service_zone must be provided, for provisioning.
2019-05-17 06:48:24,032 fbe0bec2 MainThread beam_integration_benchmark(1/1) ERROR    Benchmark 1/1 beam_integration_benchmark (UID: beam_integration_benchmark0) failed. Execution will continue.
2019-05-17 06:48:24,033 fbe0bec2 MainThread beam_integration_benchmark(1/1) INFO     Benchmark run statuses:
---------------------------------------------------------------------------------
Name                        UID                          Status  Failed Substatus
---------------------------------------------------------------------------------
beam_integration_benchmark  beam_integration_benchmark0  FAILED                  
---------------------------------------------------------------------------------
Success rate: 0.00% (0/1)
2019-05-17 06:48:24,033 fbe0bec2 MainThread beam_integration_benchmark(1/1) INFO     Complete logs can be found at: <https://builds.apache.org/job/beam_PerformanceTests_WordCountIT_Py35/ws/runs/fbe0bec2/pkb.log>
2019-05-17 06:48:24,033 fbe0bec2 MainThread beam_integration_benchmark(1/1) INFO     Completion statuses can be found at: <https://builds.apache.org/job/beam_PerformanceTests_WordCountIT_Py35/ws/runs/fbe0bec2/completion_statuses.json>
Build step 'Execute shell' marked build as failure

---------------------------------------------------------------------
To unsubscribe, e-mail: builds-unsubscribe@beam.apache.org
For additional commands, e-mail: builds-help@beam.apache.org


Jenkins build is back to normal : beam_PerformanceTests_WordCountIT_Py35 #8

Posted by Apache Jenkins Server <je...@builds.apache.org>.
See <https://builds.apache.org/job/beam_PerformanceTests_WordCountIT_Py35/8/display/redirect?page=changes>


---------------------------------------------------------------------
To unsubscribe, e-mail: builds-unsubscribe@beam.apache.org
For additional commands, e-mail: builds-help@beam.apache.org


Build failed in Jenkins: beam_PerformanceTests_WordCountIT_Py35 #7

Posted by Apache Jenkins Server <je...@builds.apache.org>.
See <https://builds.apache.org/job/beam_PerformanceTests_WordCountIT_Py35/7/display/redirect>

------------------------------------------
[...truncated 262.96 KB...]
gs://temp-storage-for-end-to-end-tests/py-it-cloud/output/1558125906194/results-00024-of-00030
gs://temp-storage-for-end-to-end-tests/py-it-cloud/output/1558125906194/results-00028-of-00030
gs://temp-storage-for-end-to-end-tests/py-it-cloud/output/1558125906194/results-00013-of-00030
gs://temp-storage-for-end-to-end-tests/py-it-cloud/output/1558125906194/results-00022-of-00030
gs://temp-storage-for-end-to-end-tests/py-it-cloud/output/1558125906194/results-00010-of-00030
gs://temp-storage-for-end-to-end-tests/py-it-cloud/output/1558125906194/results-00023-of-00030
gs://temp-storage-for-end-to-end-tests/py-it-cloud/output/1558125906194/results-00005-of-00030
gs://temp-storage-for-end-to-end-tests/py-it-cloud/output/1558125906194/results-00002-of-00030
gs://temp-storage-for-end-to-end-tests/py-it-cloud/output/1558125906194/results-00009-of-00030
gs://temp-storage-for-end-to-end-tests/py-it-cloud/output/1558125906194/results-00011-of-00030
gs://temp-storage-for-end-to-end-tests/py-it-cloud/output/1558125906194/results-00003-of-00030
gs://temp-storage-for-end-to-end-tests/py-it-cloud/output/1558125906194/results-00026-of-00030
gs://temp-storage-for-end-to-end-tests/py-it-cloud/output/1558125906194/results-00025-of-00030
gs://temp-storage-for-end-to-end-tests/py-it-cloud/output/1558125906194/results-00019-of-00030
gs://temp-storage-for-end-to-end-tests/py-it-cloud/output/1558125906194/results-00001-of-00030
gs://temp-storage-for-end-to-end-tests/py-it-cloud/output/1558125906194/results-00016-of-00030
gs://temp-storage-for-end-to-end-tests/py-it-cloud/output/1558125906194/results-00007-of-00030
gs://temp-storage-for-end-to-end-tests/py-it-cloud/output/1558125906194/results-00000-of-00030
gs://temp-storage-for-end-to-end-tests/py-it-cloud/output/1558125906194/results-00004-of-00030
gs://temp-storage-for-end-to-end-tests/py-it-cloud/output/1558125906194/results-00012-of-00030
gs://temp-storage-for-end-to-end-tests/py-it-cloud/output/1558125906194/results-00029-of-00030
gs://temp-storage-for-end-to-end-tests/py-it-cloud/output/1558125906194/results-00015-of-00030
gs://temp-storage-for-end-to-end-tests/py-it-cloud/output/1558125906194/results-00008-of-00030
gs://temp-storage-for-end-to-end-tests/py-it-cloud/output/1558125906194/results-00018-of-00030
root: DEBUG: Connecting using Google Application Default Credentials.
oauth2client.transport: INFO: Attempting refresh to obtain initial access_token
root: DEBUG: Connecting using Google Application Default Credentials.
oauth2client.transport: INFO: Attempting refresh to obtain initial access_token
root: DEBUG: Connecting using Google Application Default Credentials.
oauth2client.transport: INFO: Attempting refresh to obtain initial access_token
root: DEBUG: Connecting using Google Application Default Credentials.
oauth2client.transport: INFO: Attempting refresh to obtain initial access_token
root: DEBUG: Connecting using Google Application Default Credentials.
oauth2client.transport: INFO: Attempting refresh to obtain initial access_token
root: DEBUG: Connecting using Google Application Default Credentials.
oauth2client.transport: INFO: Attempting refresh to obtain initial access_token
root: DEBUG: Connecting using Google Application Default Credentials.
oauth2client.transport: INFO: Attempting refresh to obtain initial access_token
root: DEBUG: Connecting using Google Application Default Credentials.
oauth2client.transport: INFO: Attempting refresh to obtain initial access_token
root: DEBUG: Connecting using Google Application Default Credentials.
oauth2client.transport: INFO: Attempting refresh to obtain initial access_token
root: DEBUG: Connecting using Google Application Default Credentials.
oauth2client.transport: INFO: Attempting refresh to obtain initial access_token
root: DEBUG: Connecting using Google Application Default Credentials.
oauth2client.transport: INFO: Attempting refresh to obtain initial access_token
root: DEBUG: Connecting using Google Application Default Credentials.
oauth2client.transport: INFO: Attempting refresh to obtain initial access_token
root: DEBUG: Connecting using Google Application Default Credentials.
oauth2client.transport: INFO: Attempting refresh to obtain initial access_token
root: DEBUG: Connecting using Google Application Default Credentials.
oauth2client.transport: INFO: Attempting refresh to obtain initial access_token
root: DEBUG: Connecting using Google Application Default Credentials.
oauth2client.transport: INFO: Attempting refresh to obtain initial access_token
root: DEBUG: Connecting using Google Application Default Credentials.
oauth2client.transport: INFO: Attempting refresh to obtain initial access_token
root: DEBUG: Connecting using Google Application Default Credentials.
oauth2client.transport: INFO: Attempting refresh to obtain initial access_token
root: DEBUG: Connecting using Google Application Default Credentials.
oauth2client.transport: INFO: Attempting refresh to obtain initial access_token
root: DEBUG: Connecting using Google Application Default Credentials.
oauth2client.transport: INFO: Attempting refresh to obtain initial access_token
root: DEBUG: Connecting using Google Application Default Credentials.
oauth2client.transport: INFO: Attempting refresh to obtain initial access_token
root: DEBUG: Connecting using Google Application Default Credentials.
oauth2client.transport: INFO: Attempting refresh to obtain initial access_token
root: DEBUG: Connecting using Google Application Default Credentials.
oauth2client.transport: INFO: Attempting refresh to obtain initial access_token
root: DEBUG: Connecting using Google Application Default Credentials.
oauth2client.transport: INFO: Attempting refresh to obtain initial access_token
root: DEBUG: Connecting using Google Application Default Credentials.
oauth2client.transport: INFO: Attempting refresh to obtain initial access_token
root: DEBUG: Connecting using Google Application Default Credentials.
oauth2client.transport: INFO: Attempting refresh to obtain initial access_token
root: DEBUG: Connecting using Google Application Default Credentials.
oauth2client.transport: INFO: Attempting refresh to obtain initial access_token
root: DEBUG: Connecting using Google Application Default Credentials.
oauth2client.transport: INFO: Attempting refresh to obtain initial access_token
root: DEBUG: Connecting using Google Application Default Credentials.
oauth2client.transport: INFO: Attempting refresh to obtain initial access_token
root: DEBUG: Connecting using Google Application Default Credentials.
oauth2client.transport: INFO: Attempting refresh to obtain initial access_token
root: DEBUG: Connecting using Google Application Default Credentials.
oauth2client.transport: INFO: Attempting refresh to obtain initial access_token
root: INFO: Read from given path gs://temp-storage-for-end-to-end-tests/py-it-cloud/output/1558125906194/results*-of-*, 26186927 lines, checksum: ea0ca2e5ee4ea5f218790f28d0b9fe7d09d8d710.
apache_beam.io.filesystem: DEBUG: Listing files in 'gs://temp-storage-for-end-to-end-tests/py-it-cloud/output/1558125906194/results'
apache_beam.io.filesystem: DEBUG: translate_pattern: 'gs://temp-storage-for-end-to-end-tests/py-it-cloud/output/1558125906194/results*-of-*' -> 'gs\\:\\/\\/temp\\-storage\\-for\\-end\\-to\\-end\\-tests\\/py\\-it\\-cloud\\/output\\/1558125906194\\/results[^/\\\\]*\\-of\\-[^/\\\\]*'
root: DEBUG: Connecting using Google Application Default Credentials.
root: INFO: Starting the size estimation of the input
oauth2client.transport: INFO: Attempting refresh to obtain initial access_token
root: INFO: Finished listing 30 files in 0.1171572208404541 seconds.
root: INFO: Find 30 files in gs://temp-storage-for-end-to-end-tests/py-it-cloud/output/1558125906194/results*-of-*: 
gs://temp-storage-for-end-to-end-tests/py-it-cloud/output/1558125906194/results-00006-of-00030
gs://temp-storage-for-end-to-end-tests/py-it-cloud/output/1558125906194/results-00021-of-00030
gs://temp-storage-for-end-to-end-tests/py-it-cloud/output/1558125906194/results-00014-of-00030
gs://temp-storage-for-end-to-end-tests/py-it-cloud/output/1558125906194/results-00017-of-00030
gs://temp-storage-for-end-to-end-tests/py-it-cloud/output/1558125906194/results-00020-of-00030
gs://temp-storage-for-end-to-end-tests/py-it-cloud/output/1558125906194/results-00027-of-00030
gs://temp-storage-for-end-to-end-tests/py-it-cloud/output/1558125906194/results-00024-of-00030
gs://temp-storage-for-end-to-end-tests/py-it-cloud/output/1558125906194/results-00028-of-00030
gs://temp-storage-for-end-to-end-tests/py-it-cloud/output/1558125906194/results-00013-of-00030
gs://temp-storage-for-end-to-end-tests/py-it-cloud/output/1558125906194/results-00022-of-00030
gs://temp-storage-for-end-to-end-tests/py-it-cloud/output/1558125906194/results-00010-of-00030
gs://temp-storage-for-end-to-end-tests/py-it-cloud/output/1558125906194/results-00023-of-00030
gs://temp-storage-for-end-to-end-tests/py-it-cloud/output/1558125906194/results-00005-of-00030
gs://temp-storage-for-end-to-end-tests/py-it-cloud/output/1558125906194/results-00002-of-00030
gs://temp-storage-for-end-to-end-tests/py-it-cloud/output/1558125906194/results-00009-of-00030
gs://temp-storage-for-end-to-end-tests/py-it-cloud/output/1558125906194/results-00011-of-00030
gs://temp-storage-for-end-to-end-tests/py-it-cloud/output/1558125906194/results-00003-of-00030
gs://temp-storage-for-end-to-end-tests/py-it-cloud/output/1558125906194/results-00026-of-00030
gs://temp-storage-for-end-to-end-tests/py-it-cloud/output/1558125906194/results-00025-of-00030
gs://temp-storage-for-end-to-end-tests/py-it-cloud/output/1558125906194/results-00019-of-00030
gs://temp-storage-for-end-to-end-tests/py-it-cloud/output/1558125906194/results-00001-of-00030
gs://temp-storage-for-end-to-end-tests/py-it-cloud/output/1558125906194/results-00016-of-00030
gs://temp-storage-for-end-to-end-tests/py-it-cloud/output/1558125906194/results-00007-of-00030
gs://temp-storage-for-end-to-end-tests/py-it-cloud/output/1558125906194/results-00000-of-00030
gs://temp-storage-for-end-to-end-tests/py-it-cloud/output/1558125906194/results-00004-of-00030
gs://temp-storage-for-end-to-end-tests/py-it-cloud/output/1558125906194/results-00012-of-00030
gs://temp-storage-for-end-to-end-tests/py-it-cloud/output/1558125906194/results-00029-of-00030
gs://temp-storage-for-end-to-end-tests/py-it-cloud/output/1558125906194/results-00015-of-00030
gs://temp-storage-for-end-to-end-tests/py-it-cloud/output/1558125906194/results-00008-of-00030
gs://temp-storage-for-end-to-end-tests/py-it-cloud/output/1558125906194/results-00018-of-00030
root: DEBUG: Connecting using Google Application Default Credentials.
oauth2client.transport: INFO: Attempting refresh to obtain initial access_token
root: DEBUG: Connecting using Google Application Default Credentials.
oauth2client.transport: INFO: Attempting refresh to obtain initial access_token
root: DEBUG: Connecting using Google Application Default Credentials.
oauth2client.transport: INFO: Attempting refresh to obtain initial access_token
root: DEBUG: Connecting using Google Application Default Credentials.
oauth2client.transport: INFO: Attempting refresh to obtain initial access_token
root: DEBUG: Connecting using Google Application Default Credentials.
oauth2client.transport: INFO: Attempting refresh to obtain initial access_token
root: DEBUG: Connecting using Google Application Default Credentials.
oauth2client.transport: INFO: Attempting refresh to obtain initial access_token
root: DEBUG: Connecting using Google Application Default Credentials.
oauth2client.transport: INFO: Attempting refresh to obtain initial access_token
root: DEBUG: Connecting using Google Application Default Credentials.
oauth2client.transport: INFO: Attempting refresh to obtain initial access_token
root: DEBUG: Connecting using Google Application Default Credentials.
oauth2client.transport: INFO: Attempting refresh to obtain initial access_token
root: DEBUG: Connecting using Google Application Default Credentials.
oauth2client.transport: INFO: Attempting refresh to obtain initial access_token
root: DEBUG: Connecting using Google Application Default Credentials.
oauth2client.transport: INFO: Attempting refresh to obtain initial access_token
root: DEBUG: Connecting using Google Application Default Credentials.
oauth2client.transport: INFO: Attempting refresh to obtain initial access_token
root: DEBUG: Connecting using Google Application Default Credentials.
oauth2client.transport: INFO: Attempting refresh to obtain initial access_token
root: DEBUG: Connecting using Google Application Default Credentials.
oauth2client.transport: INFO: Attempting refresh to obtain initial access_token
root: DEBUG: Connecting using Google Application Default Credentials.
oauth2client.transport: INFO: Attempting refresh to obtain initial access_token
root: DEBUG: Connecting using Google Application Default Credentials.
oauth2client.transport: INFO: Attempting refresh to obtain initial access_token
root: DEBUG: Connecting using Google Application Default Credentials.
oauth2client.transport: INFO: Attempting refresh to obtain initial access_token
root: DEBUG: Connecting using Google Application Default Credentials.
oauth2client.transport: INFO: Attempting refresh to obtain initial access_token
root: DEBUG: Connecting using Google Application Default Credentials.
oauth2client.transport: INFO: Attempting refresh to obtain initial access_token
root: DEBUG: Connecting using Google Application Default Credentials.
oauth2client.transport: INFO: Attempting refresh to obtain initial access_token
root: DEBUG: Connecting using Google Application Default Credentials.
oauth2client.transport: INFO: Attempting refresh to obtain initial access_token
root: DEBUG: Connecting using Google Application Default Credentials.
oauth2client.transport: INFO: Attempting refresh to obtain initial access_token
root: DEBUG: Connecting using Google Application Default Credentials.
oauth2client.transport: INFO: Attempting refresh to obtain initial access_token
root: DEBUG: Connecting using Google Application Default Credentials.
oauth2client.transport: INFO: Attempting refresh to obtain initial access_token
root: DEBUG: Connecting using Google Application Default Credentials.
oauth2client.transport: INFO: Attempting refresh to obtain initial access_token
root: DEBUG: Connecting using Google Application Default Credentials.
oauth2client.transport: INFO: Attempting refresh to obtain initial access_token
root: DEBUG: Connecting using Google Application Default Credentials.
oauth2client.transport: INFO: Attempting refresh to obtain initial access_token
root: DEBUG: Connecting using Google Application Default Credentials.
oauth2client.transport: INFO: Attempting refresh to obtain initial access_token
root: DEBUG: Connecting using Google Application Default Credentials.
oauth2client.transport: INFO: Attempting refresh to obtain initial access_token
root: DEBUG: Connecting using Google Application Default Credentials.
oauth2client.transport: INFO: Attempting refresh to obtain initial access_token
root: INFO: Read from given path gs://temp-storage-for-end-to-end-tests/py-it-cloud/output/1558125906194/results*-of-*, 26186927 lines, checksum: ea0ca2e5ee4ea5f218790f28d0b9fe7d09d8d710.
apache_beam.io.filesystem: DEBUG: Listing files in 'gs://temp-storage-for-end-to-end-tests/py-it-cloud/output/1558125906194/results'
apache_beam.io.filesystem: DEBUG: translate_pattern: 'gs://temp-storage-for-end-to-end-tests/py-it-cloud/output/1558125906194/results*' -> 'gs\\:\\/\\/temp\\-storage\\-for\\-end\\-to\\-end\\-tests\\/py\\-it\\-cloud\\/output\\/1558125906194\\/results[^/\\\\]*'
root: DEBUG: Connecting using Google Application Default Credentials.
root: INFO: Starting the size estimation of the input
oauth2client.transport: INFO: Attempting refresh to obtain initial access_token
root: INFO: Finished listing 30 files in 0.0853724479675293 seconds.
root: DEBUG: Connecting using Google Application Default Credentials.
oauth2client.transport: INFO: Attempting refresh to obtain initial access_token
--------------------- >> end captured logging << ---------------------

----------------------------------------------------------------------
XML: <https://builds.apache.org/job/beam_PerformanceTests_WordCountIT_Py35/ws/src/sdks/python/nosetests.xml>
----------------------------------------------------------------------
Ran 1 test in 997.545s

FAILED (failures=1)

FAILURE: Build failed with an exception.

* What went wrong:
Execution failed for task ':sdks:python:test-suites:dataflow:py35:integrationTest'.
> Process 'command 'sh'' finished with non-zero exit value 1

* Try:
Run with --stacktrace option to get the stack trace. Run with --debug option to get more log output. Run with --scan to get full insights.

* Get more help at https://help.gradle.org

BUILD FAILED in 17m 27s

2019-05-17 21:01:45,394 5994d3e8 MainThread beam_integration_benchmark(1/1) ERROR    Error during benchmark beam_integration_benchmark
Traceback (most recent call last):
  File "<https://builds.apache.org/job/beam_PerformanceTests_WordCountIT_Py35/ws/PerfKitBenchmarker/perfkitbenchmarker/pkb.py",> line 760, in RunBenchmark
    DoRunPhase(spec, collector, detailed_timer)
  File "<https://builds.apache.org/job/beam_PerformanceTests_WordCountIT_Py35/ws/PerfKitBenchmarker/perfkitbenchmarker/pkb.py",> line 609, in DoRunPhase
    samples = spec.BenchmarkRun(spec)
  File "<https://builds.apache.org/job/beam_PerformanceTests_WordCountIT_Py35/ws/PerfKitBenchmarker/perfkitbenchmarker/linux_benchmarks/beam_integration_benchmark.py",> line 160, in Run
    job_type=job_type)
  File "<https://builds.apache.org/job/beam_PerformanceTests_WordCountIT_Py35/ws/PerfKitBenchmarker/perfkitbenchmarker/providers/gcp/gcp_dpb_dataflow.py",> line 90, in SubmitJob
    assert retcode == 0, "Integration Test Failed."
AssertionError: Integration Test Failed.
2019-05-17 21:01:45,396 5994d3e8 MainThread beam_integration_benchmark(1/1) INFO     Cleaning up benchmark beam_integration_benchmark
2019-05-17 21:01:45,398 5994d3e8 MainThread beam_integration_benchmark(1/1) ERROR    Exception running benchmark
Traceback (most recent call last):
  File "<https://builds.apache.org/job/beam_PerformanceTests_WordCountIT_Py35/ws/PerfKitBenchmarker/perfkitbenchmarker/pkb.py",> line 903, in RunBenchmarkTask
    RunBenchmark(spec, collector)
  File "<https://builds.apache.org/job/beam_PerformanceTests_WordCountIT_Py35/ws/PerfKitBenchmarker/perfkitbenchmarker/pkb.py",> line 760, in RunBenchmark
    DoRunPhase(spec, collector, detailed_timer)
  File "<https://builds.apache.org/job/beam_PerformanceTests_WordCountIT_Py35/ws/PerfKitBenchmarker/perfkitbenchmarker/pkb.py",> line 609, in DoRunPhase
    samples = spec.BenchmarkRun(spec)
  File "<https://builds.apache.org/job/beam_PerformanceTests_WordCountIT_Py35/ws/PerfKitBenchmarker/perfkitbenchmarker/linux_benchmarks/beam_integration_benchmark.py",> line 160, in Run
    job_type=job_type)
  File "<https://builds.apache.org/job/beam_PerformanceTests_WordCountIT_Py35/ws/PerfKitBenchmarker/perfkitbenchmarker/providers/gcp/gcp_dpb_dataflow.py",> line 90, in SubmitJob
    assert retcode == 0, "Integration Test Failed."
AssertionError: Integration Test Failed.
2019-05-17 21:01:45,399 5994d3e8 MainThread beam_integration_benchmark(1/1) ERROR    Benchmark 1/1 beam_integration_benchmark (UID: beam_integration_benchmark0) failed. Execution will continue.
2019-05-17 21:01:45,399 5994d3e8 MainThread beam_integration_benchmark(1/1) INFO     Benchmark run statuses:
---------------------------------------------------------------------------------
Name                        UID                          Status  Failed Substatus
---------------------------------------------------------------------------------
beam_integration_benchmark  beam_integration_benchmark0  FAILED                  
---------------------------------------------------------------------------------
Success rate: 0.00% (0/1)
2019-05-17 21:01:45,399 5994d3e8 MainThread beam_integration_benchmark(1/1) INFO     Complete logs can be found at: <https://builds.apache.org/job/beam_PerformanceTests_WordCountIT_Py35/ws/runs/5994d3e8/pkb.log>
2019-05-17 21:01:45,399 5994d3e8 MainThread beam_integration_benchmark(1/1) INFO     Completion statuses can be found at: <https://builds.apache.org/job/beam_PerformanceTests_WordCountIT_Py35/ws/runs/5994d3e8/completion_statuses.json>
Build step 'Execute shell' marked build as failure

---------------------------------------------------------------------
To unsubscribe, e-mail: builds-unsubscribe@beam.apache.org
For additional commands, e-mail: builds-help@beam.apache.org


Build failed in Jenkins: beam_PerformanceTests_WordCountIT_Py35 #6

Posted by Apache Jenkins Server <je...@builds.apache.org>.
See <https://builds.apache.org/job/beam_PerformanceTests_WordCountIT_Py35/6/display/redirect>

------------------------------------------
[...truncated 152.27 KB...]
writing apache_beam.egg-info/PKG-INFO
writing top-level names to apache_beam.egg-info/top_level.txt
writing dependency_links to apache_beam.egg-info/dependency_links.txt
writing requirements to apache_beam.egg-info/requires.txt
writing entry points to apache_beam.egg-info/entry_points.txt
reading manifest file 'apache_beam.egg-info/SOURCES.txt'
reading manifest template 'MANIFEST.in'
writing manifest file 'apache_beam.egg-info/SOURCES.txt'

STDERR: beam_fn_api.proto: warning: Import google/protobuf/descriptor.proto but not used.
beam_fn_api.proto: warning: Import google/protobuf/wrappers.proto but not used.
root: Generating grammar tables from /usr/lib/python3.5/lib2to3/PatternGrammar.txt
RefactoringTool: Adding transformation: apply
root: Generating grammar tables from /usr/lib/python3.5/lib2to3/PatternGrammar.txt
root: Generating grammar tables from /usr/lib/python3.5/lib2to3/PatternGrammar.txt
root: Generating grammar tables from /usr/lib/python3.5/lib2to3/PatternGrammar.txt
RefactoringTool: Adding transformation: dict
root: Generating grammar tables from /usr/lib/python3.5/lib2to3/PatternGrammar.txt
RefactoringTool: Adding transformation: except
root: Generating grammar tables from /usr/lib/python3.5/lib2to3/PatternGrammar.txt
RefactoringTool: Adding transformation: exec
root: Generating grammar tables from /usr/lib/python3.5/lib2to3/PatternGrammar.txt
RefactoringTool: Adding transformation: exitfunc
root: Generating grammar tables from /usr/lib/python3.5/lib2to3/PatternGrammar.txt
RefactoringTool: Adding transformation: filter
root: Generating grammar tables from /usr/lib/python3.5/lib2to3/PatternGrammar.txt
RefactoringTool: Adding transformation: funcattrs
root: Generating grammar tables from /usr/lib/python3.5/lib2to3/PatternGrammar.txt
RefactoringTool: Adding transformation: getcwdu
root: Generating grammar tables from /usr/lib/python3.5/lib2to3/PatternGrammar.txt
RefactoringTool: Adding transformation: has_key
root: Generating grammar tables from /usr/lib/python3.5/lib2to3/PatternGrammar.txt
RefactoringTool: Skipping optional fixer: idioms
root: Generating grammar tables from /usr/lib/python3.5/lib2to3/PatternGrammar.txt
root: Generating grammar tables from /usr/lib/python3.5/lib2to3/PatternGrammar.txt
RefactoringTool: Adding transformation: input
root: Generating grammar tables from /usr/lib/python3.5/lib2to3/PatternGrammar.txt
RefactoringTool: Adding transformation: intern
root: Generating grammar tables from /usr/lib/python3.5/lib2to3/PatternGrammar.txt
RefactoringTool: Adding transformation: isinstance
root: Generating grammar tables from /usr/lib/python3.5/lib2to3/PatternGrammar.txt
RefactoringTool: Adding transformation: itertools
root: Generating grammar tables from /usr/lib/python3.5/lib2to3/PatternGrammar.txt
RefactoringTool: Adding transformation: itertools_imports
root: Generating grammar tables from /usr/lib/python3.5/lib2to3/PatternGrammar.txt
RefactoringTool: Adding transformation: long
root: Generating grammar tables from /usr/lib/python3.5/lib2to3/PatternGrammar.txt
RefactoringTool: Adding transformation: map
root: Generating grammar tables from /usr/lib/python3.5/lib2to3/PatternGrammar.txt
RefactoringTool: Adding transformation: methodattrs
RefactoringTool: Adding transformation: ne
root: Generating grammar tables from /usr/lib/python3.5/lib2to3/PatternGrammar.txt
RefactoringTool: Adding transformation: next
root: Generating grammar tables from /usr/lib/python3.5/lib2to3/PatternGrammar.txt
RefactoringTool: Adding transformation: nonzero
RefactoringTool: Adding transformation: numliterals
root: Generating grammar tables from /usr/lib/python3.5/lib2to3/PatternGrammar.txt
RefactoringTool: Adding transformation: operator
root: Generating grammar tables from /usr/lib/python3.5/lib2to3/PatternGrammar.txt
RefactoringTool: Adding transformation: paren
root: Generating grammar tables from /usr/lib/python3.5/lib2to3/PatternGrammar.txt
RefactoringTool: Adding transformation: raw_input
root: Generating grammar tables from /usr/lib/python3.5/lib2to3/PatternGrammar.txt
RefactoringTool: Adding transformation: reduce
root: Generating grammar tables from /usr/lib/python3.5/lib2to3/PatternGrammar.txt
RefactoringTool: Adding transformation: renames
root: Generating grammar tables from /usr/lib/python3.5/lib2to3/PatternGrammar.txt
RefactoringTool: Adding transformation: repr
root: Generating grammar tables from /usr/lib/python3.5/lib2to3/PatternGrammar.txt
RefactoringTool: Adding transformation: standarderror
root: Generating grammar tables from /usr/lib/python3.5/lib2to3/PatternGrammar.txt
RefactoringTool: Adding transformation: sys_exc
root: Generating grammar tables from /usr/lib/python3.5/lib2to3/PatternGrammar.txt
RefactoringTool: Adding transformation: throw
root: Generating grammar tables from /usr/lib/python3.5/lib2to3/PatternGrammar.txt
RefactoringTool: Adding transformation: tuple_params
root: Generating grammar tables from /usr/lib/python3.5/lib2to3/PatternGrammar.txt
RefactoringTool: Adding transformation: types
root: Generating grammar tables from /usr/lib/python3.5/lib2to3/PatternGrammar.txt
RefactoringTool: Skipping optional fixer: ws_comma
root: Generating grammar tables from /usr/lib/python3.5/lib2to3/PatternGrammar.txt
RefactoringTool: Adding transformation: xreadlines
root: Generating grammar tables from /usr/lib/python3.5/lib2to3/PatternGrammar.txt
RefactoringTool: Adding transformation: zip
root: Generating grammar tables from /usr/lib/python3.5/lib2to3/PatternGrammar.txt
RefactoringTool: Adding transformation: absolute_import
root: Generating grammar tables from /usr/lib/python3.5/lib2to3/PatternGrammar.txt
RefactoringTool: Adding transformation: basestring
root: Generating grammar tables from /usr/lib/python3.5/lib2to3/PatternGrammar.txt
RefactoringTool: Adding transformation: cmp
root: Generating grammar tables from /usr/lib/python3.5/lib2to3/PatternGrammar.txt
RefactoringTool: Adding transformation: division_safe
root: Generating grammar tables from /usr/lib/python3.5/lib2to3/PatternGrammar.txt
RefactoringTool: Adding transformation: execfile
root: Generating grammar tables from /usr/lib/python3.5/lib2to3/PatternGrammar.txt
RefactoringTool: Adding transformation: future_builtins
root: Generating grammar tables from /usr/lib/python3.5/lib2to3/PatternGrammar.txt
RefactoringTool: Adding transformation: future_standard_library
root: Generating grammar tables from /usr/lib/python3.5/lib2to3/PatternGrammar.txt
RefactoringTool: Adding transformation: future_standard_library_urllib
root: Generating grammar tables from /usr/lib/python3.5/lib2to3/PatternGrammar.txt
RefactoringTool: Adding transformation: metaclass
root: Generating grammar tables from /usr/lib/python3.5/lib2to3/PatternGrammar.txt
RefactoringTool: Adding transformation: next_call
root: Generating grammar tables from /usr/lib/python3.5/lib2to3/PatternGrammar.txt
RefactoringTool: Adding transformation: object
root: Generating grammar tables from /usr/lib/python3.5/lib2to3/PatternGrammar.txt
root: Generating grammar tables from /usr/lib/python3.5/lib2to3/PatternGrammar.txt
RefactoringTool: Adding transformation: print_with_import
root: Generating grammar tables from /usr/lib/python3.5/lib2to3/PatternGrammar.txt
RefactoringTool: Adding transformation: raise
root: Generating grammar tables from /usr/lib/python3.5/lib2to3/PatternGrammar.txt
RefactoringTool: Adding transformation: unicode_keep_u
root: Generating grammar tables from /usr/lib/python3.5/lib2to3/PatternGrammar.txt
root: Generating grammar tables from /usr/lib/python3.5/lib2to3/PatternGrammar.txt
root: Generating grammar tables from /usr/lib/python3.5/lib2to3/PatternGrammar.txt
RefactoringTool: Adding transformation: xrange_with_import
root: Generating grammar tables from /usr/lib/python3.5/lib2to3/PatternGrammar.txt
RefactoringTool: Adding transformation: newstyle
RefactoringTool: Descending into <https://builds.apache.org/job/beam_PerformanceTests_WordCountIT_Py35/ws/src/sdks/python/test-suites/dataflow/py35/build/srcs/sdks/python/apache_beam/portability/api>
RefactoringTool: Refactoring <https://builds.apache.org/job/beam_PerformanceTests_WordCountIT_Py35/ws/src/sdks/python/test-suites/dataflow/py35/build/srcs/sdks/python/apache_beam/portability/api/__init__.py>
RefactoringTool: No changes in <https://builds.apache.org/job/beam_PerformanceTests_WordCountIT_Py35/ws/src/sdks/python/test-suites/dataflow/py35/build/srcs/sdks/python/apache_beam/portability/api/__init__.py>
RefactoringTool: Refactoring <https://builds.apache.org/job/beam_PerformanceTests_WordCountIT_Py35/ws/src/sdks/python/test-suites/dataflow/py35/build/srcs/sdks/python/apache_beam/portability/api/beam_artifact_api_pb2.py>
RefactoringTool: No changes to <https://builds.apache.org/job/beam_PerformanceTests_WordCountIT_Py35/ws/src/sdks/python/test-suites/dataflow/py35/build/srcs/sdks/python/apache_beam/portability/api/beam_artifact_api_pb2.py>
RefactoringTool: No changes to <https://builds.apache.org/job/beam_PerformanceTests_WordCountIT_Py35/ws/src/sdks/python/test-suites/dataflow/py35/build/srcs/sdks/python/apache_beam/portability/api/beam_artifact_api_pb2.py>
RefactoringTool: Refactoring <https://builds.apache.org/job/beam_PerformanceTests_WordCountIT_Py35/ws/src/sdks/python/test-suites/dataflow/py35/build/srcs/sdks/python/apache_beam/portability/api/beam_artifact_api_pb2_grpc.py>
RefactoringTool: Refactored <https://builds.apache.org/job/beam_PerformanceTests_WordCountIT_Py35/ws/src/sdks/python/test-suites/dataflow/py35/build/srcs/sdks/python/apache_beam/portability/api/beam_artifact_api_pb2_grpc.py>
RefactoringTool: Wrote changes to <https://builds.apache.org/job/beam_PerformanceTests_WordCountIT_Py35/ws/src/sdks/python/test-suites/dataflow/py35/build/srcs/sdks/python/apache_beam/portability/api/beam_artifact_api_pb2_grpc.py>
RefactoringTool: Refactoring <https://builds.apache.org/job/beam_PerformanceTests_WordCountIT_Py35/ws/src/sdks/python/test-suites/dataflow/py35/build/srcs/sdks/python/apache_beam/portability/api/beam_expansion_api_pb2.py>
RefactoringTool: Refactored <https://builds.apache.org/job/beam_PerformanceTests_WordCountIT_Py35/ws/src/sdks/python/test-suites/dataflow/py35/build/srcs/sdks/python/apache_beam/portability/api/beam_expansion_api_pb2.py>
RefactoringTool: Wrote changes to <https://builds.apache.org/job/beam_PerformanceTests_WordCountIT_Py35/ws/src/sdks/python/test-suites/dataflow/py35/build/srcs/sdks/python/apache_beam/portability/api/beam_expansion_api_pb2.py>
RefactoringTool: Refactoring <https://builds.apache.org/job/beam_PerformanceTests_WordCountIT_Py35/ws/src/sdks/python/test-suites/dataflow/py35/build/srcs/sdks/python/apache_beam/portability/api/beam_expansion_api_pb2_grpc.py>
RefactoringTool: Refactored <https://builds.apache.org/job/beam_PerformanceTests_WordCountIT_Py35/ws/src/sdks/python/test-suites/dataflow/py35/build/srcs/sdks/python/apache_beam/portability/api/beam_expansion_api_pb2_grpc.py>
RefactoringTool: Wrote changes to <https://builds.apache.org/job/beam_PerformanceTests_WordCountIT_Py35/ws/src/sdks/python/test-suites/dataflow/py35/build/srcs/sdks/python/apache_beam/portability/api/beam_expansion_api_pb2_grpc.py>
RefactoringTool: Refactoring <https://builds.apache.org/job/beam_PerformanceTests_WordCountIT_Py35/ws/src/sdks/python/test-suites/dataflow/py35/build/srcs/sdks/python/apache_beam/portability/api/beam_fn_api_pb2.py>
RefactoringTool: Refactored <https://builds.apache.org/job/beam_PerformanceTests_WordCountIT_Py35/ws/src/sdks/python/test-suites/dataflow/py35/build/srcs/sdks/python/apache_beam/portability/api/beam_fn_api_pb2.py>
RefactoringTool: Wrote changes to <https://builds.apache.org/job/beam_PerformanceTests_WordCountIT_Py35/ws/src/sdks/python/test-suites/dataflow/py35/build/srcs/sdks/python/apache_beam/portability/api/beam_fn_api_pb2.py>
RefactoringTool: Refactoring <https://builds.apache.org/job/beam_PerformanceTests_WordCountIT_Py35/ws/src/sdks/python/test-suites/dataflow/py35/build/srcs/sdks/python/apache_beam/portability/api/beam_fn_api_pb2_grpc.py>
RefactoringTool: Refactored <https://builds.apache.org/job/beam_PerformanceTests_WordCountIT_Py35/ws/src/sdks/python/test-suites/dataflow/py35/build/srcs/sdks/python/apache_beam/portability/api/beam_fn_api_pb2_grpc.py>
RefactoringTool: Wrote changes to <https://builds.apache.org/job/beam_PerformanceTests_WordCountIT_Py35/ws/src/sdks/python/test-suites/dataflow/py35/build/srcs/sdks/python/apache_beam/portability/api/beam_fn_api_pb2_grpc.py>
RefactoringTool: Refactoring <https://builds.apache.org/job/beam_PerformanceTests_WordCountIT_Py35/ws/src/sdks/python/test-suites/dataflow/py35/build/srcs/sdks/python/apache_beam/portability/api/beam_job_api_pb2.py>
RefactoringTool: Refactored <https://builds.apache.org/job/beam_PerformanceTests_WordCountIT_Py35/ws/src/sdks/python/test-suites/dataflow/py35/build/srcs/sdks/python/apache_beam/portability/api/beam_job_api_pb2.py>
RefactoringTool: Wrote changes to <https://builds.apache.org/job/beam_PerformanceTests_WordCountIT_Py35/ws/src/sdks/python/test-suites/dataflow/py35/build/srcs/sdks/python/apache_beam/portability/api/beam_job_api_pb2.py>
RefactoringTool: Refactoring <https://builds.apache.org/job/beam_PerformanceTests_WordCountIT_Py35/ws/src/sdks/python/test-suites/dataflow/py35/build/srcs/sdks/python/apache_beam/portability/api/beam_job_api_pb2_grpc.py>
RefactoringTool: Refactored <https://builds.apache.org/job/beam_PerformanceTests_WordCountIT_Py35/ws/src/sdks/python/test-suites/dataflow/py35/build/srcs/sdks/python/apache_beam/portability/api/beam_job_api_pb2_grpc.py>
RefactoringTool: Wrote changes to <https://builds.apache.org/job/beam_PerformanceTests_WordCountIT_Py35/ws/src/sdks/python/test-suites/dataflow/py35/build/srcs/sdks/python/apache_beam/portability/api/beam_job_api_pb2_grpc.py>
RefactoringTool: Refactoring <https://builds.apache.org/job/beam_PerformanceTests_WordCountIT_Py35/ws/src/sdks/python/test-suites/dataflow/py35/build/srcs/sdks/python/apache_beam/portability/api/beam_provision_api_pb2.py>
RefactoringTool: No changes to <https://builds.apache.org/job/beam_PerformanceTests_WordCountIT_Py35/ws/src/sdks/python/test-suites/dataflow/py35/build/srcs/sdks/python/apache_beam/portability/api/beam_provision_api_pb2.py>
RefactoringTool: No changes to <https://builds.apache.org/job/beam_PerformanceTests_WordCountIT_Py35/ws/src/sdks/python/test-suites/dataflow/py35/build/srcs/sdks/python/apache_beam/portability/api/beam_provision_api_pb2.py>
RefactoringTool: Refactoring <https://builds.apache.org/job/beam_PerformanceTests_WordCountIT_Py35/ws/src/sdks/python/test-suites/dataflow/py35/build/srcs/sdks/python/apache_beam/portability/api/beam_provision_api_pb2_grpc.py>
RefactoringTool: Refactored <https://builds.apache.org/job/beam_PerformanceTests_WordCountIT_Py35/ws/src/sdks/python/test-suites/dataflow/py35/build/srcs/sdks/python/apache_beam/portability/api/beam_provision_api_pb2_grpc.py>
RefactoringTool: Wrote changes to <https://builds.apache.org/job/beam_PerformanceTests_WordCountIT_Py35/ws/src/sdks/python/test-suites/dataflow/py35/build/srcs/sdks/python/apache_beam/portability/api/beam_provision_api_pb2_grpc.py>
RefactoringTool: Refactoring <https://builds.apache.org/job/beam_PerformanceTests_WordCountIT_Py35/ws/src/sdks/python/test-suites/dataflow/py35/build/srcs/sdks/python/apache_beam/portability/api/beam_runner_api_pb2.py>
RefactoringTool: Refactored <https://builds.apache.org/job/beam_PerformanceTests_WordCountIT_Py35/ws/src/sdks/python/test-suites/dataflow/py35/build/srcs/sdks/python/apache_beam/portability/api/beam_runner_api_pb2.py>
RefactoringTool: Wrote changes to <https://builds.apache.org/job/beam_PerformanceTests_WordCountIT_Py35/ws/src/sdks/python/test-suites/dataflow/py35/build/srcs/sdks/python/apache_beam/portability/api/beam_runner_api_pb2.py>
RefactoringTool: Refactoring <https://builds.apache.org/job/beam_PerformanceTests_WordCountIT_Py35/ws/src/sdks/python/test-suites/dataflow/py35/build/srcs/sdks/python/apache_beam/portability/api/beam_runner_api_pb2_grpc.py>
RefactoringTool: No changes in <https://builds.apache.org/job/beam_PerformanceTests_WordCountIT_Py35/ws/src/sdks/python/test-suites/dataflow/py35/build/srcs/sdks/python/apache_beam/portability/api/beam_runner_api_pb2_grpc.py>
RefactoringTool: Refactoring <https://builds.apache.org/job/beam_PerformanceTests_WordCountIT_Py35/ws/src/sdks/python/test-suites/dataflow/py35/build/srcs/sdks/python/apache_beam/portability/api/endpoints_pb2.py>
RefactoringTool: No changes to <https://builds.apache.org/job/beam_PerformanceTests_WordCountIT_Py35/ws/src/sdks/python/test-suites/dataflow/py35/build/srcs/sdks/python/apache_beam/portability/api/endpoints_pb2.py>
RefactoringTool: No changes to <https://builds.apache.org/job/beam_PerformanceTests_WordCountIT_Py35/ws/src/sdks/python/test-suites/dataflow/py35/build/srcs/sdks/python/apache_beam/portability/api/endpoints_pb2.py>
RefactoringTool: Refactoring <https://builds.apache.org/job/beam_PerformanceTests_WordCountIT_Py35/ws/src/sdks/python/test-suites/dataflow/py35/build/srcs/sdks/python/apache_beam/portability/api/endpoints_pb2_grpc.py>
RefactoringTool: No changes in <https://builds.apache.org/job/beam_PerformanceTests_WordCountIT_Py35/ws/src/sdks/python/test-suites/dataflow/py35/build/srcs/sdks/python/apache_beam/portability/api/endpoints_pb2_grpc.py>
RefactoringTool: Refactoring <https://builds.apache.org/job/beam_PerformanceTests_WordCountIT_Py35/ws/src/sdks/python/test-suites/dataflow/py35/build/srcs/sdks/python/apache_beam/portability/api/external_transforms_pb2.py>
RefactoringTool: Refactored <https://builds.apache.org/job/beam_PerformanceTests_WordCountIT_Py35/ws/src/sdks/python/test-suites/dataflow/py35/build/srcs/sdks/python/apache_beam/portability/api/external_transforms_pb2.py>
RefactoringTool: Wrote changes to <https://builds.apache.org/job/beam_PerformanceTests_WordCountIT_Py35/ws/src/sdks/python/test-suites/dataflow/py35/build/srcs/sdks/python/apache_beam/portability/api/external_transforms_pb2.py>
RefactoringTool: Refactoring <https://builds.apache.org/job/beam_PerformanceTests_WordCountIT_Py35/ws/src/sdks/python/test-suites/dataflow/py35/build/srcs/sdks/python/apache_beam/portability/api/external_transforms_pb2_grpc.py>
RefactoringTool: No changes in <https://builds.apache.org/job/beam_PerformanceTests_WordCountIT_Py35/ws/src/sdks/python/test-suites/dataflow/py35/build/srcs/sdks/python/apache_beam/portability/api/external_transforms_pb2_grpc.py>
RefactoringTool: Refactoring <https://builds.apache.org/job/beam_PerformanceTests_WordCountIT_Py35/ws/src/sdks/python/test-suites/dataflow/py35/build/srcs/sdks/python/apache_beam/portability/api/metrics_pb2.py>
RefactoringTool: Refactored <https://builds.apache.org/job/beam_PerformanceTests_WordCountIT_Py35/ws/src/sdks/python/test-suites/dataflow/py35/build/srcs/sdks/python/apache_beam/portability/api/metrics_pb2.py>
RefactoringTool: Wrote changes to <https://builds.apache.org/job/beam_PerformanceTests_WordCountIT_Py35/ws/src/sdks/python/test-suites/dataflow/py35/build/srcs/sdks/python/apache_beam/portability/api/metrics_pb2.py>
RefactoringTool: Refactoring <https://builds.apache.org/job/beam_PerformanceTests_WordCountIT_Py35/ws/src/sdks/python/test-suites/dataflow/py35/build/srcs/sdks/python/apache_beam/portability/api/metrics_pb2_grpc.py>
RefactoringTool: No changes in <https://builds.apache.org/job/beam_PerformanceTests_WordCountIT_Py35/ws/src/sdks/python/test-suites/dataflow/py35/build/srcs/sdks/python/apache_beam/portability/api/metrics_pb2_grpc.py>
RefactoringTool: Refactoring <https://builds.apache.org/job/beam_PerformanceTests_WordCountIT_Py35/ws/src/sdks/python/test-suites/dataflow/py35/build/srcs/sdks/python/apache_beam/portability/api/standard_window_fns_pb2.py>
RefactoringTool: Refactored <https://builds.apache.org/job/beam_PerformanceTests_WordCountIT_Py35/ws/src/sdks/python/test-suites/dataflow/py35/build/srcs/sdks/python/apache_beam/portability/api/standard_window_fns_pb2.py>
RefactoringTool: Wrote changes to <https://builds.apache.org/job/beam_PerformanceTests_WordCountIT_Py35/ws/src/sdks/python/test-suites/dataflow/py35/build/srcs/sdks/python/apache_beam/portability/api/standard_window_fns_pb2.py>
RefactoringTool: Refactoring <https://builds.apache.org/job/beam_PerformanceTests_WordCountIT_Py35/ws/src/sdks/python/test-suites/dataflow/py35/build/srcs/sdks/python/apache_beam/portability/api/standard_window_fns_pb2_grpc.py>
RefactoringTool: No changes in <https://builds.apache.org/job/beam_PerformanceTests_WordCountIT_Py35/ws/src/sdks/python/test-suites/dataflow/py35/build/srcs/sdks/python/apache_beam/portability/api/standard_window_fns_pb2_grpc.py>
RefactoringTool: Files that were modified:
RefactoringTool: <https://builds.apache.org/job/beam_PerformanceTests_WordCountIT_Py35/ws/src/sdks/python/test-suites/dataflow/py35/build/srcs/sdks/python/apache_beam/portability/api/beam_artifact_api_pb2.py>
RefactoringTool: <https://builds.apache.org/job/beam_PerformanceTests_WordCountIT_Py35/ws/src/sdks/python/test-suites/dataflow/py35/build/srcs/sdks/python/apache_beam/portability/api/beam_artifact_api_pb2_grpc.py>
RefactoringTool: <https://builds.apache.org/job/beam_PerformanceTests_WordCountIT_Py35/ws/src/sdks/python/test-suites/dataflow/py35/build/srcs/sdks/python/apache_beam/portability/api/beam_expansion_api_pb2.py>
RefactoringTool: <https://builds.apache.org/job/beam_PerformanceTests_WordCountIT_Py35/ws/src/sdks/python/test-suites/dataflow/py35/build/srcs/sdks/python/apache_beam/portability/api/beam_expansion_api_pb2_grpc.py>
RefactoringTool: <https://builds.apache.org/job/beam_PerformanceTests_WordCountIT_Py35/ws/src/sdks/python/test-suites/dataflow/py35/build/srcs/sdks/python/apache_beam/portability/api/beam_fn_api_pb2.py>
RefactoringTool: <https://builds.apache.org/job/beam_PerformanceTests_WordCountIT_Py35/ws/src/sdks/python/test-suites/dataflow/py35/build/srcs/sdks/python/apache_beam/portability/api/beam_fn_api_pb2_grpc.py>
RefactoringTool: <https://builds.apache.org/job/beam_PerformanceTests_WordCountIT_Py35/ws/src/sdks/python/test-suites/dataflow/py35/build/srcs/sdks/python/apache_beam/portability/api/beam_job_api_pb2.py>
RefactoringTool: <https://builds.apache.org/job/beam_PerformanceTests_WordCountIT_Py35/ws/src/sdks/python/test-suites/dataflow/py35/build/srcs/sdks/python/apache_beam/portability/api/beam_job_api_pb2_grpc.py>
RefactoringTool: <https://builds.apache.org/job/beam_PerformanceTests_WordCountIT_Py35/ws/src/sdks/python/test-suites/dataflow/py35/build/srcs/sdks/python/apache_beam/portability/api/beam_provision_api_pb2.py>
RefactoringTool: <https://builds.apache.org/job/beam_PerformanceTests_WordCountIT_Py35/ws/src/sdks/python/test-suites/dataflow/py35/build/srcs/sdks/python/apache_beam/portability/api/beam_provision_api_pb2_grpc.py>
RefactoringTool: <https://builds.apache.org/job/beam_PerformanceTests_WordCountIT_Py35/ws/src/sdks/python/test-suites/dataflow/py35/build/srcs/sdks/python/apache_beam/portability/api/beam_runner_api_pb2.py>
RefactoringTool: <https://builds.apache.org/job/beam_PerformanceTests_WordCountIT_Py35/ws/src/sdks/python/test-suites/dataflow/py35/build/srcs/sdks/python/apache_beam/portability/api/endpoints_pb2.py>
RefactoringTool: <https://builds.apache.org/job/beam_PerformanceTests_WordCountIT_Py35/ws/src/sdks/python/test-suites/dataflow/py35/build/srcs/sdks/python/apache_beam/portability/api/external_transforms_pb2.py>
RefactoringTool: <https://builds.apache.org/job/beam_PerformanceTests_WordCountIT_Py35/ws/src/sdks/python/test-suites/dataflow/py35/build/srcs/sdks/python/apache_beam/portability/api/metrics_pb2.py>
RefactoringTool: <https://builds.apache.org/job/beam_PerformanceTests_WordCountIT_Py35/ws/src/sdks/python/test-suites/dataflow/py35/build/srcs/sdks/python/apache_beam/portability/api/standard_window_fns_pb2.py>
setup.py:176: UserWarning: Python 3 support for the Apache Beam SDK is not yet fully supported. You may encounter buggy behavior or missing features.
  'Python 3 support for the Apache Beam SDK is not yet fully supported. '
<https://builds.apache.org/job/beam_PerformanceTests_WordCountIT_Py35/ws/src/build/gradleenv/-1734967054/lib/python3.5/site-packages/setuptools/dist.py>:472: UserWarning: Normalizing '2.14.0.dev' to '2.14.0.dev0'
  normalized_version,
warning: no files found matching 'README.md'
warning: no files found matching 'NOTICE'
warning: no files found matching 'LICENSE'
warning: cmd: standard file not found: should have one of README, README.rst, README.txt, README.md

ERROR: google-cloud-datastore 1.8.0 has requirement google-cloud-core<2.0dev,>=1.0.0, but you'll have google-cloud-core 0.29.1 which is incompatible.
setup.py:176: UserWarning: Python 3 support for the Apache Beam SDK is not yet fully supported. You may encounter buggy behavior or missing features.
  'Python 3 support for the Apache Beam SDK is not yet fully supported. '
<https://builds.apache.org/job/beam_PerformanceTests_WordCountIT_Py35/ws/src/build/gradleenv/-1734967054/lib/python3.5/site-packages/setuptools/dist.py>:472: UserWarning: Normalizing '2.14.0.dev' to '2.14.0.dev0'
  normalized_version,
warning: no files found matching 'README.md'
warning: no files found matching 'NOTICE'
warning: no files found matching 'LICENSE'
<https://builds.apache.org/job/beam_PerformanceTests_WordCountIT_Py35/ws/src/sdks/python/apache_beam/__init__.py>:84: UserWarning: Running the Apache Beam SDK on Python 3 is not yet fully supported. You may encounter buggy behavior or missing features.
  'Running the Apache Beam SDK on Python 3 is not yet fully supported. '
test_wordcount_it (apache_beam.examples.wordcount_it_test.WordCountIT) ... 
2019-05-17 20:34:38,610 3047c617 MainThread beam_integration_benchmark(1/1) ERROR    Error during benchmark beam_integration_benchmark
Traceback (most recent call last):
  File "<https://builds.apache.org/job/beam_PerformanceTests_WordCountIT_Py35/ws/PerfKitBenchmarker/perfkitbenchmarker/pkb.py",> line 760, in RunBenchmark
    DoRunPhase(spec, collector, detailed_timer)
  File "<https://builds.apache.org/job/beam_PerformanceTests_WordCountIT_Py35/ws/PerfKitBenchmarker/perfkitbenchmarker/pkb.py",> line 609, in DoRunPhase
    samples = spec.BenchmarkRun(spec)
  File "<https://builds.apache.org/job/beam_PerformanceTests_WordCountIT_Py35/ws/PerfKitBenchmarker/perfkitbenchmarker/linux_benchmarks/beam_integration_benchmark.py",> line 160, in Run
    job_type=job_type)
  File "<https://builds.apache.org/job/beam_PerformanceTests_WordCountIT_Py35/ws/PerfKitBenchmarker/perfkitbenchmarker/providers/gcp/gcp_dpb_dataflow.py",> line 90, in SubmitJob
    assert retcode == 0, "Integration Test Failed."
AssertionError: Integration Test Failed.
2019-05-17 20:34:38,612 3047c617 MainThread beam_integration_benchmark(1/1) INFO     Cleaning up benchmark beam_integration_benchmark
2019-05-17 20:34:38,614 3047c617 MainThread beam_integration_benchmark(1/1) ERROR    Exception running benchmark
Traceback (most recent call last):
  File "<https://builds.apache.org/job/beam_PerformanceTests_WordCountIT_Py35/ws/PerfKitBenchmarker/perfkitbenchmarker/pkb.py",> line 903, in RunBenchmarkTask
    RunBenchmark(spec, collector)
  File "<https://builds.apache.org/job/beam_PerformanceTests_WordCountIT_Py35/ws/PerfKitBenchmarker/perfkitbenchmarker/pkb.py",> line 760, in RunBenchmark
    DoRunPhase(spec, collector, detailed_timer)
  File "<https://builds.apache.org/job/beam_PerformanceTests_WordCountIT_Py35/ws/PerfKitBenchmarker/perfkitbenchmarker/pkb.py",> line 609, in DoRunPhase
    samples = spec.BenchmarkRun(spec)
  File "<https://builds.apache.org/job/beam_PerformanceTests_WordCountIT_Py35/ws/PerfKitBenchmarker/perfkitbenchmarker/linux_benchmarks/beam_integration_benchmark.py",> line 160, in Run
    job_type=job_type)
  File "<https://builds.apache.org/job/beam_PerformanceTests_WordCountIT_Py35/ws/PerfKitBenchmarker/perfkitbenchmarker/providers/gcp/gcp_dpb_dataflow.py",> line 90, in SubmitJob
    assert retcode == 0, "Integration Test Failed."
AssertionError: Integration Test Failed.
2019-05-17 20:34:38,614 3047c617 MainThread beam_integration_benchmark(1/1) ERROR    Benchmark 1/1 beam_integration_benchmark (UID: beam_integration_benchmark0) failed. Execution will continue.
2019-05-17 20:34:38,615 3047c617 MainThread beam_integration_benchmark(1/1) INFO     Benchmark run statuses:
---------------------------------------------------------------------------------
Name                        UID                          Status  Failed Substatus
---------------------------------------------------------------------------------
beam_integration_benchmark  beam_integration_benchmark0  FAILED                  
---------------------------------------------------------------------------------
Success rate: 0.00% (0/1)
2019-05-17 20:34:38,615 3047c617 MainThread beam_integration_benchmark(1/1) INFO     Complete logs can be found at: <https://builds.apache.org/job/beam_PerformanceTests_WordCountIT_Py35/ws/runs/3047c617/pkb.log>
2019-05-17 20:34:38,615 3047c617 MainThread beam_integration_benchmark(1/1) INFO     Completion statuses can be found at: <https://builds.apache.org/job/beam_PerformanceTests_WordCountIT_Py35/ws/runs/3047c617/completion_statuses.json>
Build step 'Execute shell' marked build as failure

---------------------------------------------------------------------
To unsubscribe, e-mail: builds-unsubscribe@beam.apache.org
For additional commands, e-mail: builds-help@beam.apache.org


Build failed in Jenkins: beam_PerformanceTests_WordCountIT_Py35 #5

Posted by Apache Jenkins Server <je...@builds.apache.org>.
See <https://builds.apache.org/job/beam_PerformanceTests_WordCountIT_Py35/5/display/redirect?page=changes>

Changes:

[25622840+adude3141] [BEAM-7302] ensure artifactId set on pom also with unconfigured project

[github] Fix a typo in setting.gradle

------------------------------------------
Started by timer
[EnvInject] - Loading node environment variables.
Building remotely on apache-beam-jenkins-5 (beam) in workspace <https://builds.apache.org/job/beam_PerformanceTests_WordCountIT_Py35/ws/>
No credentials specified
 > git rev-parse --is-inside-work-tree # timeout=10
Fetching changes from the remote Git repository
 > git config remote.origin.url https://github.com/apache/beam.git # timeout=10
Fetching upstream changes from https://github.com/apache/beam.git
 > git --version # timeout=10
 > git fetch --tags --progress https://github.com/apache/beam.git +refs/heads/*:refs/remotes/origin/* +refs/pull/${ghprbPullId}/*:refs/remotes/origin/pr/${ghprbPullId}/*
 > git rev-parse origin/master^{commit} # timeout=10
Checking out Revision 2ec133fad7c8c063ae06d3c3aec99bbc99390a2e (origin/master)
 > git config core.sparsecheckout # timeout=10
 > git checkout -f 2ec133fad7c8c063ae06d3c3aec99bbc99390a2e
Commit message: "Merge pull request #8601 from tvalentyn/patch-50"
 > git rev-list --no-walk d77474d16734cf63095765cbced97ecd4b016b54 # timeout=10
Cleaning workspace
 > git rev-parse --verify HEAD # timeout=10
Resetting working tree
 > git reset --hard # timeout=10
 > git clean -fdx # timeout=10
[EnvInject] - Executing scripts and injecting environment variables after the SCM step.
[EnvInject] - Injecting as environment variables the properties content 
SPARK_LOCAL_IP=127.0.0.1

[EnvInject] - Variables injected successfully.
[beam_PerformanceTests_WordCountIT_Py35] $ /bin/bash -xe /tmp/jenkins6147634505481511834.sh
+ rm -rf <https://builds.apache.org/job/beam_PerformanceTests_WordCountIT_Py35/ws/PerfKitBenchmarker>
[beam_PerformanceTests_WordCountIT_Py35] $ /bin/bash -xe /tmp/jenkins2819924379973429836.sh
+ rm -rf <https://builds.apache.org/job/beam_PerformanceTests_WordCountIT_Py35/ws/env/.perfkit_env>
[beam_PerformanceTests_WordCountIT_Py35] $ /bin/bash -xe /tmp/jenkins1023696595008974547.sh
+ virtualenv <https://builds.apache.org/job/beam_PerformanceTests_WordCountIT_Py35/ws/env/.perfkit_env> --python=python2.7
New python executable in <https://builds.apache.org/job/beam_PerformanceTests_WordCountIT_Py35/ws/env/.perfkit_env/bin/python2.7>
Also creating executable in <https://builds.apache.org/job/beam_PerformanceTests_WordCountIT_Py35/ws/env/.perfkit_env/bin/python>
Installing setuptools, pip, wheel...
done.
Running virtualenv with interpreter /usr/bin/python2.7
[beam_PerformanceTests_WordCountIT_Py35] $ /bin/bash -xe /tmp/jenkins1716475848212982926.sh
+ <https://builds.apache.org/job/beam_PerformanceTests_WordCountIT_Py35/ws/env/.perfkit_env/bin/pip> install --upgrade setuptools pip
DEPRECATION: Python 2.7 will reach the end of its life on January 1st, 2020. Please upgrade your Python as Python 2.7 won't be maintained after that date. A future version of pip will drop support for Python 2.7.
Requirement already up-to-date: setuptools in ./env/.perfkit_env/lib/python2.7/site-packages (41.0.1)
Requirement already up-to-date: pip in ./env/.perfkit_env/lib/python2.7/site-packages (19.1.1)
[beam_PerformanceTests_WordCountIT_Py35] $ /bin/bash -xe /tmp/jenkins8553438569795461397.sh
+ git clone https://github.com/GoogleCloudPlatform/PerfKitBenchmarker.git <https://builds.apache.org/job/beam_PerformanceTests_WordCountIT_Py35/ws/PerfKitBenchmarker>
Cloning into '<https://builds.apache.org/job/beam_PerformanceTests_WordCountIT_Py35/ws/PerfKitBenchmarker'...>
[beam_PerformanceTests_WordCountIT_Py35] $ /bin/bash -xe /tmp/jenkins5026051703605993692.sh
+ <https://builds.apache.org/job/beam_PerformanceTests_WordCountIT_Py35/ws/env/.perfkit_env/bin/pip> install -r <https://builds.apache.org/job/beam_PerformanceTests_WordCountIT_Py35/ws/PerfKitBenchmarker/requirements.txt>
DEPRECATION: Python 2.7 will reach the end of its life on January 1st, 2020. Please upgrade your Python as Python 2.7 won't be maintained after that date. A future version of pip will drop support for Python 2.7.
Collecting absl-py (from -r <https://builds.apache.org/job/beam_PerformanceTests_WordCountIT_Py35/ws/PerfKitBenchmarker/requirements.txt> (line 14))
Collecting jinja2>=2.7 (from -r <https://builds.apache.org/job/beam_PerformanceTests_WordCountIT_Py35/ws/PerfKitBenchmarker/requirements.txt> (line 15))
  Using cached https://files.pythonhosted.org/packages/1d/e7/fd8b501e7a6dfe492a433deb7b9d833d39ca74916fa8bc63dd1a4947a671/Jinja2-2.10.1-py2.py3-none-any.whl
Requirement already satisfied: setuptools in ./env/.perfkit_env/lib/python2.7/site-packages (from -r <https://builds.apache.org/job/beam_PerformanceTests_WordCountIT_Py35/ws/PerfKitBenchmarker/requirements.txt> (line 16)) (41.0.1)
Collecting colorlog[windows]==2.6.0 (from -r <https://builds.apache.org/job/beam_PerformanceTests_WordCountIT_Py35/ws/PerfKitBenchmarker/requirements.txt> (line 17))
  Using cached https://files.pythonhosted.org/packages/59/1a/46a1bf2044ad8b30b52fed0f389338c85747e093fe7f51a567f4cb525892/colorlog-2.6.0-py2.py3-none-any.whl
Collecting blinker>=1.3 (from -r <https://builds.apache.org/job/beam_PerformanceTests_WordCountIT_Py35/ws/PerfKitBenchmarker/requirements.txt> (line 18))
Collecting futures>=3.0.3 (from -r <https://builds.apache.org/job/beam_PerformanceTests_WordCountIT_Py35/ws/PerfKitBenchmarker/requirements.txt> (line 19))
  Using cached https://files.pythonhosted.org/packages/2d/99/b2c4e9d5a30f6471e410a146232b4118e697fa3ffc06d6a65efde84debd0/futures-3.2.0-py2-none-any.whl
Collecting PyYAML==3.12 (from -r <https://builds.apache.org/job/beam_PerformanceTests_WordCountIT_Py35/ws/PerfKitBenchmarker/requirements.txt> (line 20))
Collecting pint>=0.7 (from -r <https://builds.apache.org/job/beam_PerformanceTests_WordCountIT_Py35/ws/PerfKitBenchmarker/requirements.txt> (line 21))
  Using cached https://files.pythonhosted.org/packages/15/9d/bf177ebbc57d25e9e296addc14a1303d1e34d7964af5df428a8332349c42/Pint-0.9-py2.py3-none-any.whl
Collecting numpy==1.13.3 (from -r <https://builds.apache.org/job/beam_PerformanceTests_WordCountIT_Py35/ws/PerfKitBenchmarker/requirements.txt> (line 22))
  Using cached https://files.pythonhosted.org/packages/eb/be/737f3df5806192ac4096e549e48c8c76cfaa2fb880a1c62a7bb085adaa9b/numpy-1.13.3-cp27-cp27mu-manylinux1_x86_64.whl
Collecting functools32 (from -r <https://builds.apache.org/job/beam_PerformanceTests_WordCountIT_Py35/ws/PerfKitBenchmarker/requirements.txt> (line 23))
Collecting contextlib2>=0.5.1 (from -r <https://builds.apache.org/job/beam_PerformanceTests_WordCountIT_Py35/ws/PerfKitBenchmarker/requirements.txt> (line 24))
  Using cached https://files.pythonhosted.org/packages/a2/71/8273a7eeed0aff6a854237ab5453bc9aa67deb49df4832801c21f0ff3782/contextlib2-0.5.5-py2.py3-none-any.whl
Collecting pywinrm (from -r <https://builds.apache.org/job/beam_PerformanceTests_WordCountIT_Py35/ws/PerfKitBenchmarker/requirements.txt> (line 25))
  Using cached https://files.pythonhosted.org/packages/0d/12/13a3117bbd2230043aa32dcfa2198c33269665eaa1a8fa26174ce49b338f/pywinrm-0.3.0-py2.py3-none-any.whl
Collecting timeout-decorator (from -r <https://builds.apache.org/job/beam_PerformanceTests_WordCountIT_Py35/ws/PerfKitBenchmarker/requirements.txt> (line 26))
Collecting enum34; python_version < "3.4" (from absl-py->-r <https://builds.apache.org/job/beam_PerformanceTests_WordCountIT_Py35/ws/PerfKitBenchmarker/requirements.txt> (line 14))
  Using cached https://files.pythonhosted.org/packages/c5/db/e56e6b4bbac7c4a06de1c50de6fe1ef3810018ae11732a50f15f62c7d050/enum34-1.1.6-py2-none-any.whl
Collecting six (from absl-py->-r <https://builds.apache.org/job/beam_PerformanceTests_WordCountIT_Py35/ws/PerfKitBenchmarker/requirements.txt> (line 14))
  Using cached https://files.pythonhosted.org/packages/73/fb/00a976f728d0d1fecfe898238ce23f502a721c0ac0ecfedb80e0d88c64e9/six-1.12.0-py2.py3-none-any.whl
Collecting MarkupSafe>=0.23 (from jinja2>=2.7->-r <https://builds.apache.org/job/beam_PerformanceTests_WordCountIT_Py35/ws/PerfKitBenchmarker/requirements.txt> (line 15))
  Using cached https://files.pythonhosted.org/packages/fb/40/f3adb7cf24a8012813c5edb20329eb22d5d8e2a0ecf73d21d6b85865da11/MarkupSafe-1.1.1-cp27-cp27mu-manylinux1_x86_64.whl
Collecting colorama; extra == "windows" (from colorlog[windows]==2.6.0->-r <https://builds.apache.org/job/beam_PerformanceTests_WordCountIT_Py35/ws/PerfKitBenchmarker/requirements.txt> (line 17))
  Using cached https://files.pythonhosted.org/packages/4f/a6/728666f39bfff1719fc94c481890b2106837da9318031f71a8424b662e12/colorama-0.4.1-py2.py3-none-any.whl
Collecting funcsigs; python_version == "2.7" (from pint>=0.7->-r <https://builds.apache.org/job/beam_PerformanceTests_WordCountIT_Py35/ws/PerfKitBenchmarker/requirements.txt> (line 21))
  Using cached https://files.pythonhosted.org/packages/69/cb/f5be453359271714c01b9bd06126eaf2e368f1fddfff30818754b5ac2328/funcsigs-1.0.2-py2.py3-none-any.whl
Collecting requests-ntlm>=0.3.0 (from pywinrm->-r <https://builds.apache.org/job/beam_PerformanceTests_WordCountIT_Py35/ws/PerfKitBenchmarker/requirements.txt> (line 25))
  Using cached https://files.pythonhosted.org/packages/03/4b/8b9a1afde8072c4d5710d9fa91433d504325821b038e00237dc8d6d833dc/requests_ntlm-1.1.0-py2.py3-none-any.whl
Collecting requests>=2.9.1 (from pywinrm->-r <https://builds.apache.org/job/beam_PerformanceTests_WordCountIT_Py35/ws/PerfKitBenchmarker/requirements.txt> (line 25))
  Using cached https://files.pythonhosted.org/packages/51/bd/23c926cd341ea6b7dd0b2a00aba99ae0f828be89d72b2190f27c11d4b7fb/requests-2.22.0-py2.py3-none-any.whl
Collecting xmltodict (from pywinrm->-r <https://builds.apache.org/job/beam_PerformanceTests_WordCountIT_Py35/ws/PerfKitBenchmarker/requirements.txt> (line 25))
  Using cached https://files.pythonhosted.org/packages/28/fd/30d5c1d3ac29ce229f6bdc40bbc20b28f716e8b363140c26eff19122d8a5/xmltodict-0.12.0-py2.py3-none-any.whl
Collecting cryptography>=1.3 (from requests-ntlm>=0.3.0->pywinrm->-r <https://builds.apache.org/job/beam_PerformanceTests_WordCountIT_Py35/ws/PerfKitBenchmarker/requirements.txt> (line 25))
  Using cached https://files.pythonhosted.org/packages/c3/c1/cf8665c955c9393e9ff0872ba6cd3dc6f46ef915e94afcf6e0410508ca69/cryptography-2.6.1-cp27-cp27mu-manylinux1_x86_64.whl
Collecting ntlm-auth>=1.0.2 (from requests-ntlm>=0.3.0->pywinrm->-r <https://builds.apache.org/job/beam_PerformanceTests_WordCountIT_Py35/ws/PerfKitBenchmarker/requirements.txt> (line 25))
  Using cached https://files.pythonhosted.org/packages/d5/3d/1c54e92f62bbc747a638da94adb439f99dc2d2f3041fe41a06b0da4f2808/ntlm_auth-1.3.0-py2.py3-none-any.whl
Collecting urllib3!=1.25.0,!=1.25.1,<1.26,>=1.21.1 (from requests>=2.9.1->pywinrm->-r <https://builds.apache.org/job/beam_PerformanceTests_WordCountIT_Py35/ws/PerfKitBenchmarker/requirements.txt> (line 25))
  Using cached https://files.pythonhosted.org/packages/39/ec/d93dfc69617a028915df914339ef66936ea976ef24fa62940fd86ba0326e/urllib3-1.25.2-py2.py3-none-any.whl
Collecting certifi>=2017.4.17 (from requests>=2.9.1->pywinrm->-r <https://builds.apache.org/job/beam_PerformanceTests_WordCountIT_Py35/ws/PerfKitBenchmarker/requirements.txt> (line 25))
  Using cached https://files.pythonhosted.org/packages/60/75/f692a584e85b7eaba0e03827b3d51f45f571c2e793dd731e598828d380aa/certifi-2019.3.9-py2.py3-none-any.whl
Collecting chardet<3.1.0,>=3.0.2 (from requests>=2.9.1->pywinrm->-r <https://builds.apache.org/job/beam_PerformanceTests_WordCountIT_Py35/ws/PerfKitBenchmarker/requirements.txt> (line 25))
  Using cached https://files.pythonhosted.org/packages/bc/a9/01ffebfb562e4274b6487b4bb1ddec7ca55ec7510b22e4c51f14098443b8/chardet-3.0.4-py2.py3-none-any.whl
Collecting idna<2.9,>=2.5 (from requests>=2.9.1->pywinrm->-r <https://builds.apache.org/job/beam_PerformanceTests_WordCountIT_Py35/ws/PerfKitBenchmarker/requirements.txt> (line 25))
  Using cached https://files.pythonhosted.org/packages/14/2c/cd551d81dbe15200be1cf41cd03869a46fe7226e7450af7a6545bfc474c9/idna-2.8-py2.py3-none-any.whl
Collecting cffi!=1.11.3,>=1.8 (from cryptography>=1.3->requests-ntlm>=0.3.0->pywinrm->-r <https://builds.apache.org/job/beam_PerformanceTests_WordCountIT_Py35/ws/PerfKitBenchmarker/requirements.txt> (line 25))
  Using cached https://files.pythonhosted.org/packages/8d/e9/0c8afd1579e5cf7bc0f06fbcd7cdb954cbc0baadd505973949a99337da1c/cffi-1.12.3-cp27-cp27mu-manylinux1_x86_64.whl
Collecting asn1crypto>=0.21.0 (from cryptography>=1.3->requests-ntlm>=0.3.0->pywinrm->-r <https://builds.apache.org/job/beam_PerformanceTests_WordCountIT_Py35/ws/PerfKitBenchmarker/requirements.txt> (line 25))
  Using cached https://files.pythonhosted.org/packages/ea/cd/35485615f45f30a510576f1a56d1e0a7ad7bd8ab5ed7cdc600ef7cd06222/asn1crypto-0.24.0-py2.py3-none-any.whl
Collecting ipaddress; python_version < "3" (from cryptography>=1.3->requests-ntlm>=0.3.0->pywinrm->-r <https://builds.apache.org/job/beam_PerformanceTests_WordCountIT_Py35/ws/PerfKitBenchmarker/requirements.txt> (line 25))
  Using cached https://files.pythonhosted.org/packages/fc/d0/7fc3a811e011d4b388be48a0e381db8d990042df54aa4ef4599a31d39853/ipaddress-1.0.22-py2.py3-none-any.whl
Collecting pycparser (from cffi!=1.11.3,>=1.8->cryptography>=1.3->requests-ntlm>=0.3.0->pywinrm->-r <https://builds.apache.org/job/beam_PerformanceTests_WordCountIT_Py35/ws/PerfKitBenchmarker/requirements.txt> (line 25))
Installing collected packages: enum34, six, absl-py, MarkupSafe, jinja2, colorama, colorlog, blinker, futures, PyYAML, funcsigs, pint, numpy, functools32, contextlib2, urllib3, certifi, chardet, idna, requests, pycparser, cffi, asn1crypto, ipaddress, cryptography, ntlm-auth, requests-ntlm, xmltodict, pywinrm, timeout-decorator
Successfully installed MarkupSafe-1.1.1 PyYAML-3.12 absl-py-0.7.1 asn1crypto-0.24.0 blinker-1.4 certifi-2019.3.9 cffi-1.12.3 chardet-3.0.4 colorama-0.4.1 colorlog-2.6.0 contextlib2-0.5.5 cryptography-2.6.1 enum34-1.1.6 funcsigs-1.0.2 functools32-3.2.3.post2 futures-3.2.0 idna-2.8 ipaddress-1.0.22 jinja2-2.10.1 ntlm-auth-1.3.0 numpy-1.13.3 pint-0.9 pycparser-2.19 pywinrm-0.3.0 requests-2.22.0 requests-ntlm-1.1.0 six-1.12.0 timeout-decorator-0.4.1 urllib3-1.25.2 xmltodict-0.12.0
[beam_PerformanceTests_WordCountIT_Py35] $ /bin/bash -xe /tmp/jenkins4225018693274002112.sh
+ <https://builds.apache.org/job/beam_PerformanceTests_WordCountIT_Py35/ws/env/.perfkit_env/bin/python> <https://builds.apache.org/job/beam_PerformanceTests_WordCountIT_Py35/ws/PerfKitBenchmarker/pkb.py> --project=apache-beam-testing --dpb_log_level=INFO --bigquery_table=beam_performance.wordcount_py35_pkb_results --k8s_get_retry_count=36 --k8s_get_wait_interval=10 --temp_dir=<https://builds.apache.org/job/beam_PerformanceTests_WordCountIT_Py35/ws/> --beam_location=<https://builds.apache.org/job/beam_PerformanceTests_WordCountIT_Py35/ws/src> --official=true --beam_sdk=python --benchmarks=beam_integration_benchmark --beam_it_class=apache_beam.examples.wordcount_it_test:WordCountIT.test_wordcount_it --beam_it_module=sdks/python/test-suites/dataflow/py35 --beam_prebuilt=true --beam_python_sdk_location=test-suites/dataflow/py35/build/apache-beam.tar.gz --beam_runner=TestDataflowRunner --beam_it_timeout=1200 --beam_it_args=--project=apache-beam-testing,--staging_location=gs://temp-storage-for-end-to-end-tests/staging-it,--temp_location=gs://temp-storage-for-end-to-end-tests/temp-it,--output=gs://temp-storage-for-end-to-end-tests/py-it-cloud/output
2019-05-17 18:54:22,098 4cf98f87 MainThread INFO     Verbose logging to: <https://builds.apache.org/job/beam_PerformanceTests_WordCountIT_Py35/ws/runs/4cf98f87/pkb.log>
2019-05-17 18:54:22,099 4cf98f87 MainThread INFO     PerfKitBenchmarker version: v1.12.0-1183-g0bd23a1
2019-05-17 18:54:22,100 4cf98f87 MainThread INFO     Flag values:
--beam_it_class=apache_beam.examples.wordcount_it_test:WordCountIT.test_wordcount_it
--beam_it_timeout=1200
--beam_it_module=sdks/python/test-suites/dataflow/py35
--beam_sdk=python
--k8s_get_wait_interval=10
--bigquery_table=beam_performance.wordcount_py35_pkb_results
--temp_dir=<https://builds.apache.org/job/beam_PerformanceTests_WordCountIT_Py35/ws/>
--beam_it_args=--project=apache-beam-testing,--staging_location=gs://temp-storage-for-end-to-end-tests/staging-it,--temp_location=gs://temp-storage-for-end-to-end-tests/temp-it,--output=gs://temp-storage-for-end-to-end-tests/py-it-cloud/output
--beam_prebuilt
--project=apache-beam-testing
--official
--dpb_log_level=INFO
--beam_location=<https://builds.apache.org/job/beam_PerformanceTests_WordCountIT_Py35/ws/src>
--beam_runner=TestDataflowRunner
--k8s_get_retry_count=36
--benchmarks=beam_integration_benchmark
--beam_python_sdk_location=test-suites/dataflow/py35/build/apache-beam.tar.gz
2019-05-17 18:54:22,235 4cf98f87 MainThread INFO     Setting --max_concurrent_threads=200.
2019-05-17 18:54:22,256 4cf98f87 MainThread WARNING  The key "flags" was not in the default config, but was in user overrides. This may indicate a typo.
2019-05-17 18:54:22,278 4cf98f87 MainThread beam_integration_benchmark(1/1) INFO     Provisioning resources for benchmark beam_integration_benchmark
2019-05-17 18:54:22,278 4cf98f87 MainThread beam_integration_benchmark(1/1) ERROR    Error during benchmark beam_integration_benchmark
Traceback (most recent call last):
  File "<https://builds.apache.org/job/beam_PerformanceTests_WordCountIT_Py35/ws/PerfKitBenchmarker/perfkitbenchmarker/pkb.py",> line 752, in RunBenchmark
    DoProvisionPhase(spec, detailed_timer)
  File "<https://builds.apache.org/job/beam_PerformanceTests_WordCountIT_Py35/ws/PerfKitBenchmarker/perfkitbenchmarker/pkb.py",> line 538, in DoProvisionPhase
    spec.ConstructDpbService()
  File "<https://builds.apache.org/job/beam_PerformanceTests_WordCountIT_Py35/ws/PerfKitBenchmarker/perfkitbenchmarker/benchmark_spec.py",> line 209, in ConstructDpbService
    self.dpb_service = dpb_service_class(self.config.dpb_service)
  File "<https://builds.apache.org/job/beam_PerformanceTests_WordCountIT_Py35/ws/PerfKitBenchmarker/perfkitbenchmarker/providers/gcp/gcp_dpb_dataflow.py",> line 53, in __init__
    super(GcpDpbDataflow, self).__init__(dpb_service_spec)
  File "<https://builds.apache.org/job/beam_PerformanceTests_WordCountIT_Py35/ws/PerfKitBenchmarker/perfkitbenchmarker/dpb_service.py",> line 127, in __init__
    'The flag dpb_service_zone must be provided, for provisioning.')
InvalidFlagConfigurationError: The flag dpb_service_zone must be provided, for provisioning.
2019-05-17 18:54:22,280 4cf98f87 MainThread beam_integration_benchmark(1/1) ERROR    Exception running benchmark
Traceback (most recent call last):
  File "<https://builds.apache.org/job/beam_PerformanceTests_WordCountIT_Py35/ws/PerfKitBenchmarker/perfkitbenchmarker/pkb.py",> line 903, in RunBenchmarkTask
    RunBenchmark(spec, collector)
  File "<https://builds.apache.org/job/beam_PerformanceTests_WordCountIT_Py35/ws/PerfKitBenchmarker/perfkitbenchmarker/pkb.py",> line 752, in RunBenchmark
    DoProvisionPhase(spec, detailed_timer)
  File "<https://builds.apache.org/job/beam_PerformanceTests_WordCountIT_Py35/ws/PerfKitBenchmarker/perfkitbenchmarker/pkb.py",> line 538, in DoProvisionPhase
    spec.ConstructDpbService()
  File "<https://builds.apache.org/job/beam_PerformanceTests_WordCountIT_Py35/ws/PerfKitBenchmarker/perfkitbenchmarker/benchmark_spec.py",> line 209, in ConstructDpbService
    self.dpb_service = dpb_service_class(self.config.dpb_service)
  File "<https://builds.apache.org/job/beam_PerformanceTests_WordCountIT_Py35/ws/PerfKitBenchmarker/perfkitbenchmarker/providers/gcp/gcp_dpb_dataflow.py",> line 53, in __init__
    super(GcpDpbDataflow, self).__init__(dpb_service_spec)
  File "<https://builds.apache.org/job/beam_PerformanceTests_WordCountIT_Py35/ws/PerfKitBenchmarker/perfkitbenchmarker/dpb_service.py",> line 127, in __init__
    'The flag dpb_service_zone must be provided, for provisioning.')
InvalidFlagConfigurationError: The flag dpb_service_zone must be provided, for provisioning.
2019-05-17 18:54:22,281 4cf98f87 MainThread beam_integration_benchmark(1/1) ERROR    Benchmark 1/1 beam_integration_benchmark (UID: beam_integration_benchmark0) failed. Execution will continue.
2019-05-17 18:54:22,281 4cf98f87 MainThread beam_integration_benchmark(1/1) INFO     Benchmark run statuses:
---------------------------------------------------------------------------------
Name                        UID                          Status  Failed Substatus
---------------------------------------------------------------------------------
beam_integration_benchmark  beam_integration_benchmark0  FAILED                  
---------------------------------------------------------------------------------
Success rate: 0.00% (0/1)
2019-05-17 18:54:22,281 4cf98f87 MainThread beam_integration_benchmark(1/1) INFO     Complete logs can be found at: <https://builds.apache.org/job/beam_PerformanceTests_WordCountIT_Py35/ws/runs/4cf98f87/pkb.log>
2019-05-17 18:54:22,281 4cf98f87 MainThread beam_integration_benchmark(1/1) INFO     Completion statuses can be found at: <https://builds.apache.org/job/beam_PerformanceTests_WordCountIT_Py35/ws/runs/4cf98f87/completion_statuses.json>
Build step 'Execute shell' marked build as failure

---------------------------------------------------------------------
To unsubscribe, e-mail: builds-unsubscribe@beam.apache.org
For additional commands, e-mail: builds-help@beam.apache.org


Build failed in Jenkins: beam_PerformanceTests_WordCountIT_Py35 #4

Posted by Apache Jenkins Server <je...@builds.apache.org>.
See <https://builds.apache.org/job/beam_PerformanceTests_WordCountIT_Py35/4/display/redirect>

------------------------------------------
Started by timer
[EnvInject] - Loading node environment variables.
Building remotely on apache-beam-jenkins-8 (beam) in workspace <https://builds.apache.org/job/beam_PerformanceTests_WordCountIT_Py35/ws/>
No credentials specified
Cloning the remote Git repository
Cloning repository https://github.com/apache/beam.git
 > git init <https://builds.apache.org/job/beam_PerformanceTests_WordCountIT_Py35/ws/src> # timeout=10
Fetching upstream changes from https://github.com/apache/beam.git
 > git --version # timeout=10
 > git fetch --tags --progress https://github.com/apache/beam.git +refs/heads/*:refs/remotes/origin/*
 > git config remote.origin.url https://github.com/apache/beam.git # timeout=10
 > git config --add remote.origin.fetch +refs/heads/*:refs/remotes/origin/* # timeout=10
 > git config remote.origin.url https://github.com/apache/beam.git # timeout=10
Fetching upstream changes from https://github.com/apache/beam.git
 > git fetch --tags --progress https://github.com/apache/beam.git +refs/heads/*:refs/remotes/origin/* +refs/pull/${ghprbPullId}/*:refs/remotes/origin/pr/${ghprbPullId}/*
 > git rev-parse origin/master^{commit} # timeout=10
Checking out Revision d77474d16734cf63095765cbced97ecd4b016b54 (origin/master)
 > git config core.sparsecheckout # timeout=10
 > git checkout -f d77474d16734cf63095765cbced97ecd4b016b54
Commit message: "[BEAM-6908] Refactor Python performance test groovy file for easy configuration (#8518)"
 > git rev-list --no-walk d77474d16734cf63095765cbced97ecd4b016b54 # timeout=10
Cleaning workspace
 > git rev-parse --verify HEAD # timeout=10
Resetting working tree
 > git reset --hard # timeout=10
 > git clean -fdx # timeout=10
[EnvInject] - Executing scripts and injecting environment variables after the SCM step.
[EnvInject] - Injecting as environment variables the properties content 
SPARK_LOCAL_IP=127.0.0.1

[EnvInject] - Variables injected successfully.
[beam_PerformanceTests_WordCountIT_Py35] $ /bin/bash -xe /tmp/jenkins5158528233903472087.sh
+ rm -rf <https://builds.apache.org/job/beam_PerformanceTests_WordCountIT_Py35/ws/PerfKitBenchmarker>
[beam_PerformanceTests_WordCountIT_Py35] $ /bin/bash -xe /tmp/jenkins5256766569411279350.sh
+ rm -rf <https://builds.apache.org/job/beam_PerformanceTests_WordCountIT_Py35/ws/env/.perfkit_env>
[beam_PerformanceTests_WordCountIT_Py35] $ /bin/bash -xe /tmp/jenkins1776718662658145956.sh
+ virtualenv <https://builds.apache.org/job/beam_PerformanceTests_WordCountIT_Py35/ws/env/.perfkit_env> --python=python2.7
New python executable in <https://builds.apache.org/job/beam_PerformanceTests_WordCountIT_Py35/ws/env/.perfkit_env/bin/python2.7>
Also creating executable in <https://builds.apache.org/job/beam_PerformanceTests_WordCountIT_Py35/ws/env/.perfkit_env/bin/python>
Installing setuptools, pip, wheel...
done.
Running virtualenv with interpreter /usr/bin/python2.7
[beam_PerformanceTests_WordCountIT_Py35] $ /bin/bash -xe /tmp/jenkins577947794133401323.sh
+ <https://builds.apache.org/job/beam_PerformanceTests_WordCountIT_Py35/ws/env/.perfkit_env/bin/pip> install --upgrade setuptools pip
DEPRECATION: Python 2.7 will reach the end of its life on January 1st, 2020. Please upgrade your Python as Python 2.7 won't be maintained after that date. A future version of pip will drop support for Python 2.7.
Requirement already up-to-date: setuptools in ./env/.perfkit_env/lib/python2.7/site-packages (41.0.1)
Requirement already up-to-date: pip in ./env/.perfkit_env/lib/python2.7/site-packages (19.1.1)
[beam_PerformanceTests_WordCountIT_Py35] $ /bin/bash -xe /tmp/jenkins373267711628206108.sh
+ git clone https://github.com/GoogleCloudPlatform/PerfKitBenchmarker.git <https://builds.apache.org/job/beam_PerformanceTests_WordCountIT_Py35/ws/PerfKitBenchmarker>
Cloning into '<https://builds.apache.org/job/beam_PerformanceTests_WordCountIT_Py35/ws/PerfKitBenchmarker'...>
[beam_PerformanceTests_WordCountIT_Py35] $ /bin/bash -xe /tmp/jenkins9080477722320186583.sh
+ <https://builds.apache.org/job/beam_PerformanceTests_WordCountIT_Py35/ws/env/.perfkit_env/bin/pip> install -r <https://builds.apache.org/job/beam_PerformanceTests_WordCountIT_Py35/ws/PerfKitBenchmarker/requirements.txt>
DEPRECATION: Python 2.7 will reach the end of its life on January 1st, 2020. Please upgrade your Python as Python 2.7 won't be maintained after that date. A future version of pip will drop support for Python 2.7.
Collecting absl-py (from -r <https://builds.apache.org/job/beam_PerformanceTests_WordCountIT_Py35/ws/PerfKitBenchmarker/requirements.txt> (line 14))
Collecting jinja2>=2.7 (from -r <https://builds.apache.org/job/beam_PerformanceTests_WordCountIT_Py35/ws/PerfKitBenchmarker/requirements.txt> (line 15))
  Using cached https://files.pythonhosted.org/packages/1d/e7/fd8b501e7a6dfe492a433deb7b9d833d39ca74916fa8bc63dd1a4947a671/Jinja2-2.10.1-py2.py3-none-any.whl
Requirement already satisfied: setuptools in ./env/.perfkit_env/lib/python2.7/site-packages (from -r <https://builds.apache.org/job/beam_PerformanceTests_WordCountIT_Py35/ws/PerfKitBenchmarker/requirements.txt> (line 16)) (41.0.1)
Collecting colorlog[windows]==2.6.0 (from -r <https://builds.apache.org/job/beam_PerformanceTests_WordCountIT_Py35/ws/PerfKitBenchmarker/requirements.txt> (line 17))
  Using cached https://files.pythonhosted.org/packages/59/1a/46a1bf2044ad8b30b52fed0f389338c85747e093fe7f51a567f4cb525892/colorlog-2.6.0-py2.py3-none-any.whl
Collecting blinker>=1.3 (from -r <https://builds.apache.org/job/beam_PerformanceTests_WordCountIT_Py35/ws/PerfKitBenchmarker/requirements.txt> (line 18))
Collecting futures>=3.0.3 (from -r <https://builds.apache.org/job/beam_PerformanceTests_WordCountIT_Py35/ws/PerfKitBenchmarker/requirements.txt> (line 19))
  Using cached https://files.pythonhosted.org/packages/2d/99/b2c4e9d5a30f6471e410a146232b4118e697fa3ffc06d6a65efde84debd0/futures-3.2.0-py2-none-any.whl
Collecting PyYAML==3.12 (from -r <https://builds.apache.org/job/beam_PerformanceTests_WordCountIT_Py35/ws/PerfKitBenchmarker/requirements.txt> (line 20))
Collecting pint>=0.7 (from -r <https://builds.apache.org/job/beam_PerformanceTests_WordCountIT_Py35/ws/PerfKitBenchmarker/requirements.txt> (line 21))
  Using cached https://files.pythonhosted.org/packages/15/9d/bf177ebbc57d25e9e296addc14a1303d1e34d7964af5df428a8332349c42/Pint-0.9-py2.py3-none-any.whl
Collecting numpy==1.13.3 (from -r <https://builds.apache.org/job/beam_PerformanceTests_WordCountIT_Py35/ws/PerfKitBenchmarker/requirements.txt> (line 22))
  Using cached https://files.pythonhosted.org/packages/eb/be/737f3df5806192ac4096e549e48c8c76cfaa2fb880a1c62a7bb085adaa9b/numpy-1.13.3-cp27-cp27mu-manylinux1_x86_64.whl
Collecting functools32 (from -r <https://builds.apache.org/job/beam_PerformanceTests_WordCountIT_Py35/ws/PerfKitBenchmarker/requirements.txt> (line 23))
Collecting contextlib2>=0.5.1 (from -r <https://builds.apache.org/job/beam_PerformanceTests_WordCountIT_Py35/ws/PerfKitBenchmarker/requirements.txt> (line 24))
  Using cached https://files.pythonhosted.org/packages/a2/71/8273a7eeed0aff6a854237ab5453bc9aa67deb49df4832801c21f0ff3782/contextlib2-0.5.5-py2.py3-none-any.whl
Collecting pywinrm (from -r <https://builds.apache.org/job/beam_PerformanceTests_WordCountIT_Py35/ws/PerfKitBenchmarker/requirements.txt> (line 25))
  Using cached https://files.pythonhosted.org/packages/0d/12/13a3117bbd2230043aa32dcfa2198c33269665eaa1a8fa26174ce49b338f/pywinrm-0.3.0-py2.py3-none-any.whl
Collecting timeout-decorator (from -r <https://builds.apache.org/job/beam_PerformanceTests_WordCountIT_Py35/ws/PerfKitBenchmarker/requirements.txt> (line 26))
Collecting enum34; python_version < "3.4" (from absl-py->-r <https://builds.apache.org/job/beam_PerformanceTests_WordCountIT_Py35/ws/PerfKitBenchmarker/requirements.txt> (line 14))
  Using cached https://files.pythonhosted.org/packages/c5/db/e56e6b4bbac7c4a06de1c50de6fe1ef3810018ae11732a50f15f62c7d050/enum34-1.1.6-py2-none-any.whl
Collecting six (from absl-py->-r <https://builds.apache.org/job/beam_PerformanceTests_WordCountIT_Py35/ws/PerfKitBenchmarker/requirements.txt> (line 14))
  Using cached https://files.pythonhosted.org/packages/73/fb/00a976f728d0d1fecfe898238ce23f502a721c0ac0ecfedb80e0d88c64e9/six-1.12.0-py2.py3-none-any.whl
Collecting MarkupSafe>=0.23 (from jinja2>=2.7->-r <https://builds.apache.org/job/beam_PerformanceTests_WordCountIT_Py35/ws/PerfKitBenchmarker/requirements.txt> (line 15))
  Using cached https://files.pythonhosted.org/packages/fb/40/f3adb7cf24a8012813c5edb20329eb22d5d8e2a0ecf73d21d6b85865da11/MarkupSafe-1.1.1-cp27-cp27mu-manylinux1_x86_64.whl
Collecting colorama; extra == "windows" (from colorlog[windows]==2.6.0->-r <https://builds.apache.org/job/beam_PerformanceTests_WordCountIT_Py35/ws/PerfKitBenchmarker/requirements.txt> (line 17))
  Using cached https://files.pythonhosted.org/packages/4f/a6/728666f39bfff1719fc94c481890b2106837da9318031f71a8424b662e12/colorama-0.4.1-py2.py3-none-any.whl
Collecting funcsigs; python_version == "2.7" (from pint>=0.7->-r <https://builds.apache.org/job/beam_PerformanceTests_WordCountIT_Py35/ws/PerfKitBenchmarker/requirements.txt> (line 21))
  Using cached https://files.pythonhosted.org/packages/69/cb/f5be453359271714c01b9bd06126eaf2e368f1fddfff30818754b5ac2328/funcsigs-1.0.2-py2.py3-none-any.whl
Collecting requests-ntlm>=0.3.0 (from pywinrm->-r <https://builds.apache.org/job/beam_PerformanceTests_WordCountIT_Py35/ws/PerfKitBenchmarker/requirements.txt> (line 25))
  Using cached https://files.pythonhosted.org/packages/03/4b/8b9a1afde8072c4d5710d9fa91433d504325821b038e00237dc8d6d833dc/requests_ntlm-1.1.0-py2.py3-none-any.whl
Collecting requests>=2.9.1 (from pywinrm->-r <https://builds.apache.org/job/beam_PerformanceTests_WordCountIT_Py35/ws/PerfKitBenchmarker/requirements.txt> (line 25))
  Using cached https://files.pythonhosted.org/packages/51/bd/23c926cd341ea6b7dd0b2a00aba99ae0f828be89d72b2190f27c11d4b7fb/requests-2.22.0-py2.py3-none-any.whl
Collecting xmltodict (from pywinrm->-r <https://builds.apache.org/job/beam_PerformanceTests_WordCountIT_Py35/ws/PerfKitBenchmarker/requirements.txt> (line 25))
  Using cached https://files.pythonhosted.org/packages/28/fd/30d5c1d3ac29ce229f6bdc40bbc20b28f716e8b363140c26eff19122d8a5/xmltodict-0.12.0-py2.py3-none-any.whl
Collecting cryptography>=1.3 (from requests-ntlm>=0.3.0->pywinrm->-r <https://builds.apache.org/job/beam_PerformanceTests_WordCountIT_Py35/ws/PerfKitBenchmarker/requirements.txt> (line 25))
  Using cached https://files.pythonhosted.org/packages/c3/c1/cf8665c955c9393e9ff0872ba6cd3dc6f46ef915e94afcf6e0410508ca69/cryptography-2.6.1-cp27-cp27mu-manylinux1_x86_64.whl
Collecting ntlm-auth>=1.0.2 (from requests-ntlm>=0.3.0->pywinrm->-r <https://builds.apache.org/job/beam_PerformanceTests_WordCountIT_Py35/ws/PerfKitBenchmarker/requirements.txt> (line 25))
  Using cached https://files.pythonhosted.org/packages/d5/3d/1c54e92f62bbc747a638da94adb439f99dc2d2f3041fe41a06b0da4f2808/ntlm_auth-1.3.0-py2.py3-none-any.whl
Collecting urllib3!=1.25.0,!=1.25.1,<1.26,>=1.21.1 (from requests>=2.9.1->pywinrm->-r <https://builds.apache.org/job/beam_PerformanceTests_WordCountIT_Py35/ws/PerfKitBenchmarker/requirements.txt> (line 25))
  Using cached https://files.pythonhosted.org/packages/39/ec/d93dfc69617a028915df914339ef66936ea976ef24fa62940fd86ba0326e/urllib3-1.25.2-py2.py3-none-any.whl
Collecting certifi>=2017.4.17 (from requests>=2.9.1->pywinrm->-r <https://builds.apache.org/job/beam_PerformanceTests_WordCountIT_Py35/ws/PerfKitBenchmarker/requirements.txt> (line 25))
  Using cached https://files.pythonhosted.org/packages/60/75/f692a584e85b7eaba0e03827b3d51f45f571c2e793dd731e598828d380aa/certifi-2019.3.9-py2.py3-none-any.whl
Collecting chardet<3.1.0,>=3.0.2 (from requests>=2.9.1->pywinrm->-r <https://builds.apache.org/job/beam_PerformanceTests_WordCountIT_Py35/ws/PerfKitBenchmarker/requirements.txt> (line 25))
  Using cached https://files.pythonhosted.org/packages/bc/a9/01ffebfb562e4274b6487b4bb1ddec7ca55ec7510b22e4c51f14098443b8/chardet-3.0.4-py2.py3-none-any.whl
Collecting idna<2.9,>=2.5 (from requests>=2.9.1->pywinrm->-r <https://builds.apache.org/job/beam_PerformanceTests_WordCountIT_Py35/ws/PerfKitBenchmarker/requirements.txt> (line 25))
  Using cached https://files.pythonhosted.org/packages/14/2c/cd551d81dbe15200be1cf41cd03869a46fe7226e7450af7a6545bfc474c9/idna-2.8-py2.py3-none-any.whl
Collecting cffi!=1.11.3,>=1.8 (from cryptography>=1.3->requests-ntlm>=0.3.0->pywinrm->-r <https://builds.apache.org/job/beam_PerformanceTests_WordCountIT_Py35/ws/PerfKitBenchmarker/requirements.txt> (line 25))
  Using cached https://files.pythonhosted.org/packages/8d/e9/0c8afd1579e5cf7bc0f06fbcd7cdb954cbc0baadd505973949a99337da1c/cffi-1.12.3-cp27-cp27mu-manylinux1_x86_64.whl
Collecting asn1crypto>=0.21.0 (from cryptography>=1.3->requests-ntlm>=0.3.0->pywinrm->-r <https://builds.apache.org/job/beam_PerformanceTests_WordCountIT_Py35/ws/PerfKitBenchmarker/requirements.txt> (line 25))
  Using cached https://files.pythonhosted.org/packages/ea/cd/35485615f45f30a510576f1a56d1e0a7ad7bd8ab5ed7cdc600ef7cd06222/asn1crypto-0.24.0-py2.py3-none-any.whl
Collecting ipaddress; python_version < "3" (from cryptography>=1.3->requests-ntlm>=0.3.0->pywinrm->-r <https://builds.apache.org/job/beam_PerformanceTests_WordCountIT_Py35/ws/PerfKitBenchmarker/requirements.txt> (line 25))
  Using cached https://files.pythonhosted.org/packages/fc/d0/7fc3a811e011d4b388be48a0e381db8d990042df54aa4ef4599a31d39853/ipaddress-1.0.22-py2.py3-none-any.whl
Collecting pycparser (from cffi!=1.11.3,>=1.8->cryptography>=1.3->requests-ntlm>=0.3.0->pywinrm->-r <https://builds.apache.org/job/beam_PerformanceTests_WordCountIT_Py35/ws/PerfKitBenchmarker/requirements.txt> (line 25))
Installing collected packages: enum34, six, absl-py, MarkupSafe, jinja2, colorama, colorlog, blinker, futures, PyYAML, funcsigs, pint, numpy, functools32, contextlib2, urllib3, certifi, chardet, idna, requests, pycparser, cffi, asn1crypto, ipaddress, cryptography, ntlm-auth, requests-ntlm, xmltodict, pywinrm, timeout-decorator
Successfully installed MarkupSafe-1.1.1 PyYAML-3.12 absl-py-0.7.1 asn1crypto-0.24.0 blinker-1.4 certifi-2019.3.9 cffi-1.12.3 chardet-3.0.4 colorama-0.4.1 colorlog-2.6.0 contextlib2-0.5.5 cryptography-2.6.1 enum34-1.1.6 funcsigs-1.0.2 functools32-3.2.3.post2 futures-3.2.0 idna-2.8 ipaddress-1.0.22 jinja2-2.10.1 ntlm-auth-1.3.0 numpy-1.13.3 pint-0.9 pycparser-2.19 pywinrm-0.3.0 requests-2.22.0 requests-ntlm-1.1.0 six-1.12.0 timeout-decorator-0.4.1 urllib3-1.25.2 xmltodict-0.12.0
[beam_PerformanceTests_WordCountIT_Py35] $ /bin/bash -xe /tmp/jenkins8942878631408082212.sh
+ <https://builds.apache.org/job/beam_PerformanceTests_WordCountIT_Py35/ws/env/.perfkit_env/bin/python> <https://builds.apache.org/job/beam_PerformanceTests_WordCountIT_Py35/ws/PerfKitBenchmarker/pkb.py> --project=apache-beam-testing --dpb_log_level=INFO --bigquery_table=beam_performance.wordcount_py35_pkb_results --k8s_get_retry_count=36 --k8s_get_wait_interval=10 --temp_dir=<https://builds.apache.org/job/beam_PerformanceTests_WordCountIT_Py35/ws/> --beam_location=<https://builds.apache.org/job/beam_PerformanceTests_WordCountIT_Py35/ws/src> --official=true --beam_sdk=python --benchmarks=beam_integration_benchmark --beam_it_class=apache_beam.examples.wordcount_it_test:WordCountIT.test_wordcount_it --beam_it_module=sdks/python/test-suites/dataflow/py35 --beam_prebuilt=true --beam_python_sdk_location=test-suites/dataflow/py35/build/apache-beam.tar.gz --beam_runner=TestDataflowRunner --beam_it_timeout=1200 --beam_it_args=--project=apache-beam-testing,--staging_location=gs://temp-storage-for-end-to-end-tests/staging-it,--temp_location=gs://temp-storage-for-end-to-end-tests/temp-it,--output=gs://temp-storage-for-end-to-end-tests/py-it-cloud/output
2019-05-17 12:48:35,142 437a8ede MainThread INFO     Verbose logging to: <https://builds.apache.org/job/beam_PerformanceTests_WordCountIT_Py35/ws/runs/437a8ede/pkb.log>
2019-05-17 12:48:35,142 437a8ede MainThread INFO     PerfKitBenchmarker version: v1.12.0-1183-g0bd23a1
2019-05-17 12:48:35,143 437a8ede MainThread INFO     Flag values:
--beam_it_class=apache_beam.examples.wordcount_it_test:WordCountIT.test_wordcount_it
--beam_it_timeout=1200
--beam_it_module=sdks/python/test-suites/dataflow/py35
--beam_sdk=python
--k8s_get_wait_interval=10
--bigquery_table=beam_performance.wordcount_py35_pkb_results
--temp_dir=<https://builds.apache.org/job/beam_PerformanceTests_WordCountIT_Py35/ws/>
--beam_it_args=--project=apache-beam-testing,--staging_location=gs://temp-storage-for-end-to-end-tests/staging-it,--temp_location=gs://temp-storage-for-end-to-end-tests/temp-it,--output=gs://temp-storage-for-end-to-end-tests/py-it-cloud/output
--beam_prebuilt
--project=apache-beam-testing
--official
--dpb_log_level=INFO
--beam_location=<https://builds.apache.org/job/beam_PerformanceTests_WordCountIT_Py35/ws/src>
--beam_runner=TestDataflowRunner
--k8s_get_retry_count=36
--benchmarks=beam_integration_benchmark
--beam_python_sdk_location=test-suites/dataflow/py35/build/apache-beam.tar.gz
2019-05-17 12:48:35,311 437a8ede MainThread INFO     Setting --max_concurrent_threads=200.
2019-05-17 12:48:35,334 437a8ede MainThread WARNING  The key "flags" was not in the default config, but was in user overrides. This may indicate a typo.
2019-05-17 12:48:35,358 437a8ede MainThread beam_integration_benchmark(1/1) INFO     Provisioning resources for benchmark beam_integration_benchmark
2019-05-17 12:48:35,359 437a8ede MainThread beam_integration_benchmark(1/1) ERROR    Error during benchmark beam_integration_benchmark
Traceback (most recent call last):
  File "<https://builds.apache.org/job/beam_PerformanceTests_WordCountIT_Py35/ws/PerfKitBenchmarker/perfkitbenchmarker/pkb.py",> line 752, in RunBenchmark
    DoProvisionPhase(spec, detailed_timer)
  File "<https://builds.apache.org/job/beam_PerformanceTests_WordCountIT_Py35/ws/PerfKitBenchmarker/perfkitbenchmarker/pkb.py",> line 538, in DoProvisionPhase
    spec.ConstructDpbService()
  File "<https://builds.apache.org/job/beam_PerformanceTests_WordCountIT_Py35/ws/PerfKitBenchmarker/perfkitbenchmarker/benchmark_spec.py",> line 209, in ConstructDpbService
    self.dpb_service = dpb_service_class(self.config.dpb_service)
  File "<https://builds.apache.org/job/beam_PerformanceTests_WordCountIT_Py35/ws/PerfKitBenchmarker/perfkitbenchmarker/providers/gcp/gcp_dpb_dataflow.py",> line 53, in __init__
    super(GcpDpbDataflow, self).__init__(dpb_service_spec)
  File "<https://builds.apache.org/job/beam_PerformanceTests_WordCountIT_Py35/ws/PerfKitBenchmarker/perfkitbenchmarker/dpb_service.py",> line 127, in __init__
    'The flag dpb_service_zone must be provided, for provisioning.')
InvalidFlagConfigurationError: The flag dpb_service_zone must be provided, for provisioning.
2019-05-17 12:48:35,361 437a8ede MainThread beam_integration_benchmark(1/1) ERROR    Exception running benchmark
Traceback (most recent call last):
  File "<https://builds.apache.org/job/beam_PerformanceTests_WordCountIT_Py35/ws/PerfKitBenchmarker/perfkitbenchmarker/pkb.py",> line 903, in RunBenchmarkTask
    RunBenchmark(spec, collector)
  File "<https://builds.apache.org/job/beam_PerformanceTests_WordCountIT_Py35/ws/PerfKitBenchmarker/perfkitbenchmarker/pkb.py",> line 752, in RunBenchmark
    DoProvisionPhase(spec, detailed_timer)
  File "<https://builds.apache.org/job/beam_PerformanceTests_WordCountIT_Py35/ws/PerfKitBenchmarker/perfkitbenchmarker/pkb.py",> line 538, in DoProvisionPhase
    spec.ConstructDpbService()
  File "<https://builds.apache.org/job/beam_PerformanceTests_WordCountIT_Py35/ws/PerfKitBenchmarker/perfkitbenchmarker/benchmark_spec.py",> line 209, in ConstructDpbService
    self.dpb_service = dpb_service_class(self.config.dpb_service)
  File "<https://builds.apache.org/job/beam_PerformanceTests_WordCountIT_Py35/ws/PerfKitBenchmarker/perfkitbenchmarker/providers/gcp/gcp_dpb_dataflow.py",> line 53, in __init__
    super(GcpDpbDataflow, self).__init__(dpb_service_spec)
  File "<https://builds.apache.org/job/beam_PerformanceTests_WordCountIT_Py35/ws/PerfKitBenchmarker/perfkitbenchmarker/dpb_service.py",> line 127, in __init__
    'The flag dpb_service_zone must be provided, for provisioning.')
InvalidFlagConfigurationError: The flag dpb_service_zone must be provided, for provisioning.
2019-05-17 12:48:35,361 437a8ede MainThread beam_integration_benchmark(1/1) ERROR    Benchmark 1/1 beam_integration_benchmark (UID: beam_integration_benchmark0) failed. Execution will continue.
2019-05-17 12:48:35,361 437a8ede MainThread beam_integration_benchmark(1/1) INFO     Benchmark run statuses:
---------------------------------------------------------------------------------
Name                        UID                          Status  Failed Substatus
---------------------------------------------------------------------------------
beam_integration_benchmark  beam_integration_benchmark0  FAILED                  
---------------------------------------------------------------------------------
Success rate: 0.00% (0/1)
2019-05-17 12:48:35,361 437a8ede MainThread beam_integration_benchmark(1/1) INFO     Complete logs can be found at: <https://builds.apache.org/job/beam_PerformanceTests_WordCountIT_Py35/ws/runs/437a8ede/pkb.log>
2019-05-17 12:48:35,361 437a8ede MainThread beam_integration_benchmark(1/1) INFO     Completion statuses can be found at: <https://builds.apache.org/job/beam_PerformanceTests_WordCountIT_Py35/ws/runs/437a8ede/completion_statuses.json>
Build step 'Execute shell' marked build as failure

---------------------------------------------------------------------
To unsubscribe, e-mail: builds-unsubscribe@beam.apache.org
For additional commands, e-mail: builds-help@beam.apache.org