You are viewing a plain text version of this content. The canonical link for it is here.
Posted to dev@jclouds.apache.org by je...@cloudbees.com on 2014/01/03 03:25:49 UTC

Build failed in Jenkins: jclouds-karaf #533

See <https://jclouds.ci.cloudbees.com/job/jclouds-karaf/533/>

------------------------------------------
[...truncated 6837 lines...]
[Unloading class sun.reflect.GeneratedSerializationConstructorAccessor77]
[Unloading class com.sun.tools.javac.comp.Infer$1]
[Unloading class com.sun.source.tree.MethodTree]
[Unloading class com.sun.tools.javac.code.Scope$ErrorScope]
[Unloading class com.sun.tools.javac.jvm.Gen$CodeSizeOverflow]
[Unloading class com.sun.tools.javac.jvm.Code$1]
[Unloading class com.sun.tools.javac.util.JCDiagnostic$DiagnosticSource]
[Unloading class com.sun.tools.javac.tree.JCTree$JCBlock]
[Unloading class com.sun.tools.javac.model.JavacElements$1TS]
[Unloading class com.sun.source.tree.ExpressionStatementTree]
[Unloading class com.sun.tools.javac.main.RecognizedOptions]
[Unloading class com.sun.tools.javac.jvm.Items$SelfItem]
[Unloading class com.sun.tools.javac.util.Convert]
[Unloading class sun.reflect.GeneratedSerializationConstructorAccessor20]
[Unloading class com.sun.tools.javac.code.Types$22]
[Unloading class com.sun.tools.javac.code.Types$16]
[Unloading class com.sun.tools.javac.code.Symbol$ClassSymbol]
[Unloading class com.sun.tools.javac.tree.TreeTranslator]
[Unloading class sun.reflect.GeneratedSerializationConstructorAccessor81]
[Unloading class com.sun.tools.javac.util.DefaultFileManager]
[Unloading class com.sun.tools.javac.tree.TreeMaker]
[Unloading class com.sun.source.tree.CompoundAssignmentTree]
[Unloading class sun.reflect.GeneratedSerializationConstructorAccessor66]
[Unloading class com.sun.tools.javac.jvm.Items$1]
[Unloading class com.sun.tools.javac.code.Type$JCNoType]
[Unloading class com.sun.source.tree.ParenthesizedTree]
[Unloading class com.sun.tools.javac.code.Source]
[Unloading class com.sun.tools.javac.jvm.Items$Item]
[Unloading class com.sun.tools.javac.jvm.Gen$CodeSizeOverflow]
[Unloading class com.sun.source.tree.MethodTree]
[Unloading class com.sun.tools.javac.code.Symbol$PackageSymbol]
[Unloading class com.sun.tools.javac.code.Type$PackageType]
[Unloading class com.sun.tools.javac.util.Log]
[Unloading class sun.reflect.GeneratedMethodAccessor8]
[Unloading class com.sun.tools.javac.code.Types$13]
[Unloading class com.sun.tools.javac.util.DefaultFileManager$ZipArchive]
[Unloading class com.sun.tools.javac.util.List$1]
[Unloading class sun.reflect.GeneratedMethodAccessor14]
[Unloading class com.sun.tools.javac.tree.TreeMaker$AnnotationBuilder]
[Unloading class com.sun.tools.javac.tree.JCTree$JCBinary]
[Unloading class com.sun.tools.javac.jvm.ClassFile]
[Unloading class com.sun.tools.javac.jvm.Pool$Variable]
[Unloading class com.sun.tools.javac.code.Type$UndetVar]
[Unloading class sun.reflect.GeneratedSerializationConstructorAccessor19]
[Unloading class com.sun.tools.javac.main.RecognizedOptions$19]
[Unloading class com.sun.tools.javac.tree.JCTree$JCInstanceOf]
[Unloading class com.sun.tools.javac.jvm.Gen$GenFinalizer]
[Unloading class com.sun.tools.javac.code.Types$MapVisitor]
[Unloading class com.sun.tools.javac.parser.Parser$Factory]
[Unloading class com.sun.tools.javac.tree.JCTree$JCReturn]
[Unloading class com.sun.tools.javac.code.Types$10]
[Unloading class com.sun.tools.javac.code.Types$22]
[Unloading class sun.reflect.GeneratedSerializationConstructorAccessor24]
[Unloading class com.sun.tools.javac.code.Types$Subst]
[Unloading class com.sun.tools.javac.util.DefaultFileManager$RegularFileObject]
[Unloading class com.sun.tools.javac.jvm.Items$StaticItem]
[Unloading class com.sun.tools.javac.tree.JCTree$JCClassDecl]
[Unloading class com.sun.tools.javac.util.List]
[Unloading class com.sun.tools.javac.code.Type$CapturedType]
[Unloading class com.sun.tools.javac.model.JavacElements]
[Unloading class com.sun.tools.javac.code.Types$12]
[Unloading class com.sun.tools.javac.comp.Resolve]
[Unloading class com.sun.tools.javac.processing.JavacProcessingEnvironment$NameProcessIterator]
[Unloading class com.sun.tools.javac.main.RecognizedOptions$19]
[Unloading class com.sun.source.tree.IdentifierTree]
[Unloading class com.sun.tools.javac.main.RecognizedOptions$10]
[Unloading class com.sun.tools.javac.main.JavaCompiler$CompilePolicy]
[Unloading class com.sun.tools.javac.main.RecognizedOptions$6]
[Unloading class com.sun.source.tree.ImportTree]
[Unloading class com.sun.tools.javac.jvm.Code$LocalVar]
[Unloading class com.sun.tools.javac.tree.JCTree$JCArrayAccess]
[Unloading class com.sun.tools.javac.jvm.ClassWriter$StackMapTableFrame$ChopFrame]
[Unloading class sun.reflect.GeneratedSerializationConstructorAccessor72]
[Unloading class com.sun.tools.javac.main.JavacOption$Option]
[Unloading class com.sun.tools.javac.comp.ConstFold]
[Unloading class com.sun.tools.javac.main.OptionName]
[Unloading class sun.reflect.GeneratedMethodAccessor44]
[Unloading class com.sun.tools.javac.code.Types$DefaultTypeVisitor]
[Unloading class com.sun.tools.javac.tree.JCTree$JCExpression]
[Unloading class com.sun.tools.javac.code.Attribute$Constant]
[Unloading class com.sun.tools.javac.util.DefaultFileManager$ByteBufferCache]
[Unloading class sun.reflect.GeneratedSerializationConstructorAccessor73]
[Unloading class com.sun.tools.javac.comp.Infer$NoInstanceException]
[Unloading class com.sun.tools.javac.jvm.Code$StackMapFormat]
[Unloading class com.sun.tools.javac.code.Type$Mapping]
[Unloading class com.sun.tools.javac.tree.JCTree$JCTypeApply]
[Unloading class sun.reflect.GeneratedMethodAccessor62]
[Unloading class com.sun.tools.javac.main.RecognizedOptions$17]
[Unloading class com.sun.tools.javac.code.Type$ForAll]
[Unloading class com.sun.tools.javac.comp.Env]
[Unloading class com.sun.tools.javac.code.Types]
[Unloading class sun.reflect.GeneratedMethodAccessor51]
[Unloading class com.sun.tools.javac.util.MandatoryWarningHandler]
[Unloading class com.sun.tools.javac.tree.JCTree$JCCatch]
[Unloading class com.sun.tools.javac.util.JCDiagnostic$1]
[Unloading class com.sun.tools.javac.code.Types$23]
[Unloading class com.sun.tools.javac.jvm.ClassReader$AnnotationCompleter]
[Unloading class sun.reflect.GeneratedSerializationConstructorAccessor15]
[Unloading class com.sun.tools.javac.comp.Annotate]
[Unloading class com.sun.tools.javac.util.DefaultFileManager$MissingArchive]
[Unloading class com.sun.tools.javac.util.DefaultFileManager$ByteBufferCache]
[Unloading class com.sun.tools.javac.util.ByteBuffer]
[Unloading class com.sun.source.tree.AssertTree]
[Unloading class com.sun.tools.javac.comp.Resolve]
[Unloading class com.sun.tools.javac.code.Scope]
[Unloading class com.sun.tools.javac.code.Type$WildcardType]
[Unloading class com.sun.tools.javac.main.RecognizedOptions$23]
[Unloading class com.sun.tools.javac.main.JavacOption$HiddenOption]
[Unloading class com.sun.tools.javac.comp.Resolve$ResolveError]
[Unloading class com.sun.source.tree.ConditionalExpressionTree]
[Unloading class com.sun.tools.javac.comp.ConstFold]
[Unloading class com.sun.tools.javac.tree.JCTree$JCEnhancedForLoop]
[Unloading class com.sun.tools.javac.tree.JCTree$JCSkip]
[Unloading class sun.reflect.GeneratedConstructorAccessor33]
[Unloading class com.sun.tools.javac.code.Type$BottomType]
Jan 2, 2014 9:25:38 PM org.apache.maven.cli.event.ExecutionEventLogger logStats
INFO: Final Memory: 67M/209M
Jan 2, 2014 9:25:38 PM org.apache.maven.cli.event.ExecutionEventLogger sessionEnded
INFO: ------------------------------------------------------------------------
[JENKINS] Archiving <https://jclouds.ci.cloudbees.com/job/jclouds-karaf/ws/utils/pom.xml> to /home/jclouds/hudson_home/jobs/jclouds-karaf/modules/org.apache.jclouds.karaf$utils/builds/2014-01-03_02-03-09/archive/org.apache.jclouds.karaf/utils/1.8.0-SNAPSHOT/utils-1.8.0-SNAPSHOT.pom
[JENKINS] Archiving <https://jclouds.ci.cloudbees.com/job/jclouds-karaf/ws/utils/target/utils-1.8.0-SNAPSHOT.jar> to /home/jclouds/hudson_home/jobs/jclouds-karaf/modules/org.apache.jclouds.karaf$utils/builds/2014-01-03_02-03-09/archive/org.apache.jclouds.karaf/utils/1.8.0-20140103.020811-86/utils-1.8.0-20140103.020811-86.jar
[JENKINS] Archiving <https://jclouds.ci.cloudbees.com/job/jclouds-karaf/ws/cache/pom.xml> to /home/jclouds/hudson_home/jobs/jclouds-karaf/modules/org.apache.jclouds.karaf$cache/builds/2014-01-03_02-03-09/archive/org.apache.jclouds.karaf/cache/1.8.0-SNAPSHOT/cache-1.8.0-SNAPSHOT.pom
[JENKINS] Archiving <https://jclouds.ci.cloudbees.com/job/jclouds-karaf/ws/cache/target/cache-1.8.0-SNAPSHOT.jar> to /home/jclouds/hudson_home/jobs/jclouds-karaf/modules/org.apache.jclouds.karaf$cache/builds/2014-01-03_02-03-09/archive/org.apache.jclouds.karaf/cache/1.8.0-20140103.020829-86/cache-1.8.0-20140103.020829-86.jar
[JENKINS] Archiving <https://jclouds.ci.cloudbees.com/job/jclouds-karaf/ws/chef/commands/pom.xml> to /home/jclouds/hudson_home/jobs/jclouds-karaf/modules/org.apache.jclouds.karaf.chef$commands/builds/2014-01-03_02-03-09/archive/org.apache.jclouds.karaf.chef/commands/1.8.0-SNAPSHOT/commands-1.8.0-SNAPSHOT.pom
[JENKINS] Archiving <https://jclouds.ci.cloudbees.com/job/jclouds-karaf/ws/chef/commands/target/commands-1.8.0-SNAPSHOT.jar> to /home/jclouds/hudson_home/jobs/jclouds-karaf/modules/org.apache.jclouds.karaf.chef$commands/builds/2014-01-03_02-03-09/archive/org.apache.jclouds.karaf.chef/commands/1.8.0-20140103.021116-86/commands-1.8.0-20140103.021116-86.jar
[JENKINS] Archiving <https://jclouds.ci.cloudbees.com/job/jclouds-karaf/ws/recipe/pom.xml> to /home/jclouds/hudson_home/jobs/jclouds-karaf/modules/org.apache.jclouds.karaf$recipe/builds/2014-01-03_02-03-09/archive/org.apache.jclouds.karaf/recipe/1.8.0-SNAPSHOT/recipe-1.8.0-SNAPSHOT.pom
[JENKINS] Archiving <https://jclouds.ci.cloudbees.com/job/jclouds-karaf/ws/recipe/target/recipe-1.8.0-SNAPSHOT.jar> to /home/jclouds/hudson_home/jobs/jclouds-karaf/modules/org.apache.jclouds.karaf$recipe/builds/2014-01-03_02-03-09/archive/org.apache.jclouds.karaf/recipe/1.8.0-20140103.020818-86/recipe-1.8.0-20140103.020818-86.jar
[JENKINS] Archiving <https://jclouds.ci.cloudbees.com/job/jclouds-karaf/ws/feature/pom.xml> to /home/jclouds/hudson_home/jobs/jclouds-karaf/modules/org.apache.jclouds.karaf$jclouds-karaf/builds/2014-01-03_02-03-09/archive/org.apache.jclouds.karaf/jclouds-karaf/1.8.0-SNAPSHOT/jclouds-karaf-1.8.0-SNAPSHOT.pom
[JENKINS] Archiving <https://jclouds.ci.cloudbees.com/job/jclouds-karaf/ws/feature/target/feature.xml> to /home/jclouds/hudson_home/jobs/jclouds-karaf/modules/org.apache.jclouds.karaf$jclouds-karaf/builds/2014-01-03_02-03-09/archive/org.apache.jclouds.karaf/jclouds-karaf/1.8.0-SNAPSHOT/jclouds-karaf-1.8.0-SNAPSHOT-features.xml
[JENKINS] Archiving <https://jclouds.ci.cloudbees.com/job/jclouds-karaf/ws/feature/target/credentials.cfg> to /home/jclouds/hudson_home/jobs/jclouds-karaf/modules/org.apache.jclouds.karaf$jclouds-karaf/builds/2014-01-03_02-03-09/archive/org.apache.jclouds.karaf/jclouds-karaf/1.8.0-SNAPSHOT/jclouds-karaf-1.8.0-SNAPSHOT-credentials.cfg
[JENKINS] Archiving <https://jclouds.ci.cloudbees.com/job/jclouds-karaf/ws/feature/target/shell.cfg> to /home/jclouds/hudson_home/jobs/jclouds-karaf/modules/org.apache.jclouds.karaf$jclouds-karaf/builds/2014-01-03_02-03-09/archive/org.apache.jclouds.karaf/jclouds-karaf/1.8.0-SNAPSHOT/jclouds-karaf-1.8.0-SNAPSHOT-shell.cfg
[JENKINS] Archiving <https://jclouds.ci.cloudbees.com/job/jclouds-karaf/ws/commands/pom.xml> to /home/jclouds/hudson_home/jobs/jclouds-karaf/modules/org.apache.jclouds.karaf$commands/builds/2014-01-03_02-03-09/archive/org.apache.jclouds.karaf/commands/1.8.0-SNAPSHOT/commands-1.8.0-SNAPSHOT.pom
[JENKINS] Archiving <https://jclouds.ci.cloudbees.com/job/jclouds-karaf/ws/commands/target/commands-1.8.0-SNAPSHOT.jar> to /home/jclouds/hudson_home/jobs/jclouds-karaf/modules/org.apache.jclouds.karaf$commands/builds/2014-01-03_02-03-09/archive/org.apache.jclouds.karaf/commands/1.8.0-20140103.021014-86/commands-1.8.0-20140103.021014-86.jar
[JENKINS] Archiving <https://jclouds.ci.cloudbees.com/job/jclouds-karaf/ws/itests/pom.xml> to /home/jclouds/hudson_home/jobs/jclouds-karaf/modules/org.apache.jclouds.karaf$itests/builds/2014-01-03_02-03-09/archive/org.apache.jclouds.karaf/itests/1.8.0-SNAPSHOT/itests-1.8.0-SNAPSHOT.pom
[JENKINS] Archiving <https://jclouds.ci.cloudbees.com/job/jclouds-karaf/ws/urlhandler/pom.xml> to /home/jclouds/hudson_home/jobs/jclouds-karaf/modules/org.apache.jclouds.karaf$urlhandler/builds/2014-01-03_02-03-09/archive/org.apache.jclouds.karaf/urlhandler/1.8.0-SNAPSHOT/urlhandler-1.8.0-SNAPSHOT.pom
[JENKINS] Archiving <https://jclouds.ci.cloudbees.com/job/jclouds-karaf/ws/urlhandler/target/urlhandler-1.8.0-SNAPSHOT.jar> to /home/jclouds/hudson_home/jobs/jclouds-karaf/modules/org.apache.jclouds.karaf$urlhandler/builds/2014-01-03_02-03-09/archive/org.apache.jclouds.karaf/urlhandler/1.8.0-20140103.021022-86/urlhandler-1.8.0-20140103.021022-86.jar
[JENKINS] Archiving <https://jclouds.ci.cloudbees.com/job/jclouds-karaf/ws/services/pom.xml> to /home/jclouds/hudson_home/jobs/jclouds-karaf/modules/org.apache.jclouds.karaf$services/builds/2014-01-03_02-03-09/archive/org.apache.jclouds.karaf/services/1.8.0-SNAPSHOT/services-1.8.0-SNAPSHOT.pom
[JENKINS] Archiving <https://jclouds.ci.cloudbees.com/job/jclouds-karaf/ws/services/target/services-1.8.0-SNAPSHOT.jar> to /home/jclouds/hudson_home/jobs/jclouds-karaf/modules/org.apache.jclouds.karaf$services/builds/2014-01-03_02-03-09/archive/org.apache.jclouds.karaf/services/1.8.0-20140103.020925-86/services-1.8.0-20140103.020925-86.jar
[JENKINS] Archiving <https://jclouds.ci.cloudbees.com/job/jclouds-karaf/ws/chef/core/pom.xml> to /home/jclouds/hudson_home/jobs/jclouds-karaf/modules/org.apache.jclouds.karaf.chef$core/builds/2014-01-03_02-03-09/archive/org.apache.jclouds.karaf.chef/core/1.8.0-SNAPSHOT/core-1.8.0-SNAPSHOT.pom
[JENKINS] Archiving <https://jclouds.ci.cloudbees.com/job/jclouds-karaf/ws/chef/core/target/core-1.8.0-SNAPSHOT.jar> to /home/jclouds/hudson_home/jobs/jclouds-karaf/modules/org.apache.jclouds.karaf.chef$core/builds/2014-01-03_02-03-09/archive/org.apache.jclouds.karaf.chef/core/1.8.0-20140103.021100-86/core-1.8.0-20140103.021100-86.jar
[JENKINS] Archiving <https://jclouds.ci.cloudbees.com/job/jclouds-karaf/ws/chef/services/pom.xml> to /home/jclouds/hudson_home/jobs/jclouds-karaf/modules/org.apache.jclouds.karaf.chef$services/builds/2014-01-03_02-03-09/archive/org.apache.jclouds.karaf.chef/services/1.8.0-SNAPSHOT/services-1.8.0-SNAPSHOT.pom
[JENKINS] Archiving <https://jclouds.ci.cloudbees.com/job/jclouds-karaf/ws/chef/services/target/services-1.8.0-SNAPSHOT.jar> to /home/jclouds/hudson_home/jobs/jclouds-karaf/modules/org.apache.jclouds.karaf.chef$services/builds/2014-01-03_02-03-09/archive/org.apache.jclouds.karaf.chef/services/1.8.0-20140103.021107-86/services-1.8.0-20140103.021107-86.jar
[JENKINS] Archiving <https://jclouds.ci.cloudbees.com/job/jclouds-karaf/ws/chef/pom.xml> to /home/jclouds/hudson_home/jobs/jclouds-karaf/modules/org.apache.jclouds.karaf$chef/builds/2014-01-03_02-03-09/archive/org.apache.jclouds.karaf/chef/1.8.0-SNAPSHOT/chef-1.8.0-SNAPSHOT.pom
[JENKINS] Archiving <https://jclouds.ci.cloudbees.com/job/jclouds-karaf/ws/pom.xml> to /home/jclouds/hudson_home/jobs/jclouds-karaf/modules/org.apache.jclouds$jclouds-karaf/builds/2014-01-03_02-03-09/archive/org.apache.jclouds/jclouds-karaf/1.8.0-SNAPSHOT/jclouds-karaf-1.8.0-SNAPSHOT.pom
[JENKINS] Archiving <https://jclouds.ci.cloudbees.com/job/jclouds-karaf/ws/core/pom.xml> to /home/jclouds/hudson_home/jobs/jclouds-karaf/modules/org.apache.jclouds.karaf$core/builds/2014-01-03_02-03-09/archive/org.apache.jclouds.karaf/core/1.8.0-SNAPSHOT/core-1.8.0-SNAPSHOT.pom
[JENKINS] Archiving <https://jclouds.ci.cloudbees.com/job/jclouds-karaf/ws/core/target/core-1.8.0-SNAPSHOT.jar> to /home/jclouds/hudson_home/jobs/jclouds-karaf/modules/org.apache.jclouds.karaf$core/builds/2014-01-03_02-03-09/archive/org.apache.jclouds.karaf/core/1.8.0-20140103.020758-86/core-1.8.0-20140103.020758-86.jar
[JENKINS] Archiving <https://jclouds.ci.cloudbees.com/job/jclouds-karaf/ws/chef/cache/pom.xml> to /home/jclouds/hudson_home/jobs/jclouds-karaf/modules/org.apache.jclouds.karaf.chef$cache/builds/2014-01-03_02-03-09/archive/org.apache.jclouds.karaf.chef/cache/1.8.0-SNAPSHOT/cache-1.8.0-SNAPSHOT.pom
[JENKINS] Archiving <https://jclouds.ci.cloudbees.com/job/jclouds-karaf/ws/chef/cache/target/cache-1.8.0-SNAPSHOT.jar> to /home/jclouds/hudson_home/jobs/jclouds-karaf/modules/org.apache.jclouds.karaf.chef$cache/builds/2014-01-03_02-03-09/archive/org.apache.jclouds.karaf.chef/cache/1.8.0-20140103.021122-86/cache-1.8.0-20140103.021122-86.jar
Waiting for Jenkins to finish collecting data
mavenExecutionResult exceptions not empty
message : Failed to execute goal org.apache.karaf.tooling:features-maven-plugin:2.2.7:add-features-to-repo (add-features-to-repo) on project jclouds-karaf: Can't resolve bundle org.eclipse.jetty:jetty-plus:jar:7.5.4.v20111024
cause : Can't resolve bundle org.eclipse.jetty:jetty-plus:jar:7.5.4.v20111024
Stack trace : 
org.apache.maven.lifecycle.LifecycleExecutionException: Failed to execute goal org.apache.karaf.tooling:features-maven-plugin:2.2.7:add-features-to-repo (add-features-to-repo) on project jclouds-karaf: Can't resolve bundle org.eclipse.jetty:jetty-plus:jar:7.5.4.v20111024
	at org.apache.maven.lifecycle.internal.MojoExecutor.execute(MojoExecutor.java:213)
	at org.apache.maven.lifecycle.internal.MojoExecutor.execute(MojoExecutor.java:153)
	at org.apache.maven.lifecycle.internal.MojoExecutor.execute(MojoExecutor.java:145)
	at org.apache.maven.lifecycle.internal.LifecycleModuleBuilder.buildProject(LifecycleModuleBuilder.java:84)
	at org.apache.maven.lifecycle.internal.LifecycleModuleBuilder.buildProject(LifecycleModuleBuilder.java:59)
	at org.apache.maven.lifecycle.internal.LifecycleStarter.singleThreadedBuild(LifecycleStarter.java:183)
	at org.apache.maven.lifecycle.internal.LifecycleStarter.execute(LifecycleStarter.java:161)
	at org.apache.maven.DefaultMaven.doExecute(DefaultMaven.java:319)
	at org.apache.maven.DefaultMaven.execute(DefaultMaven.java:156)
	at org.jvnet.hudson.maven3.launcher.Maven3Launcher.main(Maven3Launcher.java:117)
	at sun.reflect.NativeMethodAccessorImpl.invoke0(Native Method)
	at sun.reflect.NativeMethodAccessorImpl.invoke(NativeMethodAccessorImpl.java:39)
	at sun.reflect.DelegatingMethodAccessorImpl.invoke(DelegatingMethodAccessorImpl.java:25)
	at java.lang.reflect.Method.invoke(Method.java:597)
	at org.codehaus.plexus.classworlds.launcher.Launcher.launchStandard(Launcher.java:329)
	at org.codehaus.plexus.classworlds.launcher.Launcher.launch(Launcher.java:239)
	at org.jvnet.hudson.maven3.agent.Maven3Main.launch(Maven3Main.java:178)
	at sun.reflect.NativeMethodAccessorImpl.invoke0(Native Method)
	at sun.reflect.NativeMethodAccessorImpl.invoke(NativeMethodAccessorImpl.java:39)
	at sun.reflect.DelegatingMethodAccessorImpl.invoke(DelegatingMethodAccessorImpl.java:25)
	at java.lang.reflect.Method.invoke(Method.java:597)
	at hudson.maven.Maven3Builder.call(Maven3Builder.java:129)
	at hudson.maven.Maven3Builder.call(Maven3Builder.java:67)
	at hudson.remoting.UserRequest.perform(UserRequest.java:118)
	at hudson.remoting.UserRequest.perform(UserRequest.java:48)
	at hudson.remoting.Request$2.run(Request.java:326)
	at hudson.remoting.InterceptingExecutorService$1.call(InterceptingExecutorService.java:72)
	at java.util.concurrent.FutureTask$Sync.innerRun(FutureTask.java:303)
	at java.util.concurrent.FutureTask.run(FutureTask.java:138)
	at java.util.concurrent.ThreadPoolExecutor$Worker.runTask(ThreadPoolExecutor.java:895)
	at java.util.concurrent.ThreadPoolExecutor$Worker.run(ThreadPoolExecutor.java:918)
	at java.lang.Thread.run(Thread.java:662)
Caused by: org.apache.maven.plugin.MojoFailureException: Can't resolve bundle org.eclipse.jetty:jetty-plus:jar:7.5.4.v20111024
	at org.apache.karaf.tooling.features.AddFeaturesToRepoMojo.resolveBundle(AddFeaturesToRepoMojo.java:270)
	at org.apache.karaf.tooling.features.AddFeaturesToRepoMojo.execute(AddFeaturesToRepoMojo.java:203)
	at org.apache.maven.plugin.DefaultBuildPluginManager.executeMojo(DefaultBuildPluginManager.java:101)
	at org.apache.maven.lifecycle.internal.MojoExecutor.execute(MojoExecutor.java:209)
	... 31 more
Caused by: org.apache.maven.artifact.resolver.ArtifactResolutionException: Could not transfer artifact org.eclipse.jetty:jetty-plus:jar:7.5.4.v20111024 from/to central (http://repo.cloudbees.com/content/repositories/central): Error transferring file: Server returned HTTP response code: 502 for URL: http://repo.cloudbees.com/content/repositories/central/org/eclipse/jetty/jetty-plus/7.5.4.v20111024/jetty-plus-7.5.4.v20111024.jar
  org.eclipse.jetty:jetty-plus:jar:7.5.4.v20111024

from the specified remote repositories:
  central (http://repo.cloudbees.com/content/repositories/central, releases=true, snapshots=false),
  cloudbees-private-snapshot-repository (https://repository-jclouds.forge.cloudbees.com/snapshot, releases=false, snapshots=true),
  cloudbees-private-release-repository (https://repository-jclouds.forge.cloudbees.com/release, releases=true, snapshots=false),
  apache-snapshots (https://repository.apache.org/content/repositories/snapshots, releases=false, snapshots=true),
  sonatype (https://oss.sonatype.org/content/repositories/releases/, releases=true, snapshots=true),
  maven2-repository.dev.java.net (http://download.java.net/maven/2/, releases=true, snapshots=true),
  apache.snapshots (http://repository.apache.org/snapshots, releases=false, snapshots=true)

	at org.apache.maven.artifact.resolver.DefaultArtifactResolver.resolve(DefaultArtifactResolver.java:223)
	at org.apache.maven.artifact.resolver.DefaultArtifactResolver.resolve(DefaultArtifactResolver.java:157)
	at org.apache.maven.artifact.resolver.DefaultArtifactResolver.resolve(DefaultArtifactResolver.java:525)
	at org.apache.karaf.tooling.features.AddFeaturesToRepoMojo.resolveBundle(AddFeaturesToRepoMojo.java:262)
	... 34 more
Caused by: org.sonatype.aether.resolution.ArtifactResolutionException: Could not transfer artifact org.eclipse.jetty:jetty-plus:jar:7.5.4.v20111024 from/to central (http://repo.cloudbees.com/content/repositories/central): Error transferring file: Server returned HTTP response code: 502 for URL: http://repo.cloudbees.com/content/repositories/central/org/eclipse/jetty/jetty-plus/7.5.4.v20111024/jetty-plus-7.5.4.v20111024.jar
	at org.sonatype.aether.impl.internal.DefaultArtifactResolver.resolve(DefaultArtifactResolver.java:541)
	at org.sonatype.aether.impl.internal.DefaultArtifactResolver.resolveArtifacts(DefaultArtifactResolver.java:220)
	at org.sonatype.aether.impl.internal.DefaultArtifactResolver.resolveArtifact(DefaultArtifactResolver.java:197)
	at org.sonatype.aether.impl.internal.DefaultRepositorySystem.resolveArtifact(DefaultRepositorySystem.java:323)
	at org.apache.maven.artifact.resolver.DefaultArtifactResolver.resolve(DefaultArtifactResolver.java:213)
	... 37 more
Caused by: org.sonatype.aether.transfer.ArtifactTransferException: Could not transfer artifact org.eclipse.jetty:jetty-plus:jar:7.5.4.v20111024 from/to central (http://repo.cloudbees.com/content/repositories/central): Error transferring file: Server returned HTTP response code: 502 for URL: http://repo.cloudbees.com/content/repositories/central/org/eclipse/jetty/jetty-plus/7.5.4.v20111024/jetty-plus-7.5.4.v20111024.jar
	at org.sonatype.aether.connector.wagon.WagonRepositoryConnector$4.wrap(WagonRepositoryConnector.java:949)
	at org.sonatype.aether.connector.wagon.WagonRepositoryConnector$4.wrap(WagonRepositoryConnector.java:940)
	at org.sonatype.aether.connector.wagon.WagonRepositoryConnector$GetTask.flush(WagonRepositoryConnector.java:695)
	at org.sonatype.aether.connector.wagon.WagonRepositoryConnector$GetTask.flush(WagonRepositoryConnector.java:689)
	at org.sonatype.aether.connector.wagon.WagonRepositoryConnector.get(WagonRepositoryConnector.java:445)
	at org.sonatype.aether.impl.internal.DefaultArtifactResolver.resolve(DefaultArtifactResolver.java:460)
	... 41 more
Caused by: org.apache.maven.wagon.TransferFailedException: Error transferring file: Server returned HTTP response code: 502 for URL: http://repo.cloudbees.com/content/repositories/central/org/eclipse/jetty/jetty-plus/7.5.4.v20111024/jetty-plus-7.5.4.v20111024.jar
	at org.apache.maven.wagon.providers.http.LightweightHttpWagon.fillInputData(LightweightHttpWagon.java:143)
	at org.apache.maven.wagon.StreamWagon.getInputStream(StreamWagon.java:116)
	at org.apache.maven.wagon.StreamWagon.getIfNewer(StreamWagon.java:88)
	at org.apache.maven.wagon.StreamWagon.get(StreamWagon.java:61)
	at org.sonatype.aether.connector.wagon.WagonRepositoryConnector$GetTask.run(WagonRepositoryConnector.java:608)
	at org.sonatype.aether.util.concurrency.RunnableErrorForwarder$1.run(RunnableErrorForwarder.java:64)
	... 3 more
Caused by: java.io.IOException: Server returned HTTP response code: 502 for URL: http://repo.cloudbees.com/content/repositories/central/org/eclipse/jetty/jetty-plus/7.5.4.v20111024/jetty-plus-7.5.4.v20111024.jar
	at sun.reflect.NativeConstructorAccessorImpl.newInstance0(Native Method)
	at sun.reflect.NativeConstructorAccessorImpl.newInstance(NativeConstructorAccessorImpl.java:39)
	at sun.reflect.DelegatingConstructorAccessorImpl.newInstance(DelegatingConstructorAccessorImpl.java:27)
	at java.lang.reflect.Constructor.newInstance(Constructor.java:513)
	at sun.net.www.protocol.http.HttpURLConnection$6.run(HttpURLConnection.java:1514)
	at java.security.AccessController.doPrivileged(Native Method)
	at sun.net.www.protocol.http.HttpURLConnection.getChainedException(HttpURLConnection.java:1508)
	at sun.net.www.protocol.http.HttpURLConnection.getInputStream(HttpURLConnection.java:1162)
	at org.apache.maven.wagon.providers.http.LightweightHttpWagon.fillInputData(LightweightHttpWagon.java:122)
	... 8 more
Caused by: java.io.IOException: Server returned HTTP response code: 502 for URL: http://repo.cloudbees.com/content/repositories/central/org/eclipse/jetty/jetty-plus/7.5.4.v20111024/jetty-plus-7.5.4.v20111024.jar
	at sun.net.www.protocol.http.HttpURLConnection.getInputStream(HttpURLConnection.java:1459)
	at java.net.HttpURLConnection.getResponseCode(HttpURLConnection.java:379)
	at org.apache.maven.wagon.providers.http.LightweightHttpWagon.fillInputData(LightweightHttpWagon.java:115)
	... 8 more
channel stopped

Build failed in Jenkins: jclouds-karaf #534

Posted by je...@cloudbees.com.
See <https://jclouds.ci.cloudbees.com/job/jclouds-karaf/534/>

------------------------------------------
Started by an SCM change
Building remotely on 63b3552f in workspace <https://jclouds.ci.cloudbees.com/job/jclouds-karaf/ws/>
$ sudo /opt/jenkins/sbin/mount-webdav https://repository-jclouds.forge.cloudbees.com/private jclouds alert
/private/jclouds is not a mountpoint
webdav mount try 1
/private/jclouds is not a mountpoint
p11-kit: couldn't read config file: /etc/pkcs11/modules/.
/private/jclouds is a mountpoint
Checkout:jclouds-karaf / <https://jclouds.ci.cloudbees.com/job/jclouds-karaf/ws/> - hudson.remoting.Channel@10f4cae2:63b3552f
Using strategy: Default
Last Built Revision: Revision 3b3c129f2c762cad3fee8ff6871d7f62f20738ff (origin/master)
Cloning the remote Git repository
Cloning repository https://git-wip-us.apache.org/repos/asf/jclouds-karaf.git
git --version
git version 1.7.11.7
Fetching upstream changes from origin
Commencing build of Revision 3b3c129f2c762cad3fee8ff6871d7f62f20738ff (origin/master)
Checking out Revision 3b3c129f2c762cad3fee8ff6871d7f62f20738ff (origin/master)
Parsing POMs
Failed to transfer Could not transfer artifact org.apache:apache:pom:13 from/to central (http://repo.cloudbees.com/content/repositories/central): Failed to transfer file: http://repo.cloudbees.com/content/repositories/central/org/apache/apache/13/apache-13.pom. Return code is: 502 , ReasonPhrase:Proxy Error.
Failed to transfer Could not find artifact org.apache:apache:pom:13 in cloudbees-private-release-repository (https://repository-jclouds.forge.cloudbees.com/release)
Failed to transfer Could not find artifact org.apache:apache:pom:13 in sonatype (https://oss.sonatype.org/content/repositories/releases/)
Failed to transfer Could not find artifact org.apache:apache:pom:13 in maven2-repository.dev.java.net (http://download.java.net/maven/2/)
ERROR: Failed to parse POMs
hudson.util.IOException2: remote file operation failed: <https://jclouds.ci.cloudbees.com/job/jclouds-karaf/ws/> at hudson.remoting.Channel@10f4cae2:63b3552f
	at hudson.FilePath.act(FilePath.java:906)
	at hudson.FilePath.act(FilePath.java:883)
	at hudson.maven.MavenModuleSetBuild$MavenModuleSetBuildExecution.parsePoms(MavenModuleSetBuild.java:922)
	at hudson.maven.MavenModuleSetBuild$MavenModuleSetBuildExecution.doRun(MavenModuleSetBuild.java:654)
	at hudson.model.AbstractBuild$AbstractBuildExecution.run(AbstractBuild.java:575)
	at hudson.model.Run.execute(Run.java:1592)
	at hudson.maven.MavenModuleSetBuild.run(MavenModuleSetBuild.java:508)
	at hudson.model.ResourceController.execute(ResourceController.java:88)
	at hudson.model.Executor.run(Executor.java:237)
Caused by: hudson.remoting.ProxyException: hudson.maven.MavenModuleSetBuild$MavenExecutionException: org.apache.maven.project.ProjectBuildingException: Some problems were encountered while processing the POMs:
[FATAL] Non-resolvable parent POM: Could not transfer artifact org.apache:apache:pom:13 from/to central (http://repo.cloudbees.com/content/repositories/central): Failed to transfer file: http://repo.cloudbees.com/content/repositories/central/org/apache/apache/13/apache-13.pom. Return code is: 502 , ReasonPhrase:Proxy Error. and 'parent.relativePath' points at wrong local POM @ line 21, column 11

	at hudson.maven.MavenModuleSetBuild$PomParser.invoke(MavenModuleSetBuild.java:1325)
	at hudson.maven.MavenModuleSetBuild$PomParser.invoke(MavenModuleSetBuild.java:1060)
	at hudson.FilePath$FileCallableWrapper.call(FilePath.java:2394)
	at hudson.remoting.UserRequest.perform(UserRequest.java:118)
	at hudson.remoting.UserRequest.perform(UserRequest.java:48)
	at hudson.remoting.Request$2.run(Request.java:326)
	at hudson.remoting.InterceptingExecutorService$1.call(InterceptingExecutorService.java:72)
	at java.util.concurrent.FutureTask$Sync.innerRun(FutureTask.java:334)
	at java.util.concurrent.FutureTask.run(FutureTask.java:166)
	at java.util.concurrent.ThreadPoolExecutor.runWorker(ThreadPoolExecutor.java:1145)
	at java.util.concurrent.ThreadPoolExecutor$Worker.run(ThreadPoolExecutor.java:615)
	at java.lang.Thread.run(Thread.java:724)
Caused by: hudson.remoting.ProxyException: org.apache.maven.project.ProjectBuildingException: Some problems were encountered while processing the POMs:
[FATAL] Non-resolvable parent POM: Could not transfer artifact org.apache:apache:pom:13 from/to central (http://repo.cloudbees.com/content/repositories/central): Failed to transfer file: http://repo.cloudbees.com/content/repositories/central/org/apache/apache/13/apache-13.pom. Return code is: 502 , ReasonPhrase:Proxy Error. and 'parent.relativePath' points at wrong local POM @ line 21, column 11

	at org.apache.maven.project.DefaultProjectBuilder.build(DefaultProjectBuilder.java:364)
	at hudson.maven.MavenEmbedder.buildProjects(MavenEmbedder.java:361)
	at hudson.maven.MavenEmbedder.readProjects(MavenEmbedder.java:331)
	at hudson.maven.MavenModuleSetBuild$PomParser.invoke(MavenModuleSetBuild.java:1262)
	... 11 more