You are viewing a plain text version of this content. The canonical link for it is here.
Posted to dev@poi.apache.org by Apache Jenkins Server <je...@builds.apache.org> on 2021/01/17 07:48:14 UTC
Build failed in Jenkins: POI » POI-DSL-IBM-JDK #26
See <https://ci-builds.apache.org/job/POI/job/POI-DSL-IBM-JDK/26/display/redirect?page=changes>
Changes:
[Andreas Beeker] Remove superfluous test
[Andreas Beeker] Sonar fixes
add asserts to tests
[Andreas Beeker] integration tests: Fix handling of NullPointerExceptions for Java 16+ (again ...)
Refactor TestAllFiles to provide an API for mass testing
[Andreas Beeker] integration tests: Fix JDK version handling
[Andreas Beeker] integration tests: NullPointerExceptions contain now a description in Java 16+
[Andreas Beeker] include externals on release build checkout
[Andreas Beeker] #65046 - Simplify integration tests
[Andreas Beeker] Sonar fixes
add asserts to tests
[Andreas Beeker] Sonar fixes
add asserts to tests
[PJ Fanning] fix date in news
[PJ Fanning] sync up xmlbeans date with https://xmlbeans.apache.org/
[PJ Fanning] add CVE info to news section
[Andreas Beeker] prepare for 5.0.1
[Andreas Beeker] add lz4-java for svn/release operations
[Andreas Beeker] release prepare for 5.0.0 - updating build.xml and changes.xml
[Andreas Beeker] update changes based on github history
[Andreas Beeker] remove EPL license
see https://lists.apache.org/thread.html/r605598dd36a371a8439652c8b362f4099d57662aeaf837fe5c22ad25%40%3Cdev.poi.apache.org%3E
[PJ Fanning] add missing release not for XMLBeans 4.0.0
[Andreas Beeker] Update license / NOTICE
[Andreas Beeker] Update maven dependencies
[Andreas Beeker] Update maven dependencies
------------------------------------------
[...truncated 375.90 KB...]
[echo] Tests run: 98, Failures: 0, Aborted: 0, Skipped: 0, Time elapsed: 0.052000 sec
[echo] Ran org.apache.poi.ss.formula.functions.TestIndirect
[echo] Tests run: 3, Failures: 0, Aborted: 0, Skipped: 0, Time elapsed: 0.008000 sec
[echo] Ran org.apache.poi.ss.formula.functions.TestIndirectFunctionFromSpreadsheet
[echo] Tests run: 11, Failures: 0, Aborted: 0, Skipped: 0, Time elapsed: 0.010000 sec
[echo] Ran org.apache.poi.ss.formula.functions.TestIntercept
[echo] Tests run: 4, Failures: 0, Aborted: 0, Skipped: 0, Time elapsed: 0.005000 sec
[echo] Ran org.apache.poi.ss.formula.functions.TestIrr
[echo] Tests run: 3, Failures: 0, Aborted: 0, Skipped: 0, Time elapsed: 0.003000 sec
[echo] Ran org.apache.poi.ss.formula.functions.TestIsBlank
[echo] Tests run: 1, Failures: 0, Aborted: 0, Skipped: 0, Time elapsed: 0.002000 sec
[echo] Ran org.apache.poi.ss.formula.functions.TestLeftRight
[echo] Tests run: 2, Failures: 0, Aborted: 0, Skipped: 0, Time elapsed: 0.001000 sec
[echo] Ran org.apache.poi.ss.formula.functions.TestLen
[echo] Tests run: 3, Failures: 0, Aborted: 0, Skipped: 0, Time elapsed: 0.002000 sec
[echo] Ran org.apache.poi.ss.formula.functions.TestLogicalFunction
[echo] Tests run: 2, Failures: 0, Aborted: 0, Skipped: 0, Time elapsed: 0.002000 sec
[echo] Ran org.apache.poi.ss.formula.functions.TestLogicalFunctionsFromSpreadsheet
[echo] Tests run: 15, Failures: 0, Aborted: 0, Skipped: 0, Time elapsed: 0.022000 sec
[echo] Ran org.apache.poi.ss.formula.functions.TestLookupFunctionsFromSpreadsheet
[echo] Tests run: 205, Failures: 0, Aborted: 0, Skipped: 0, Time elapsed: 0.131000 sec
[echo] Ran org.apache.poi.ss.formula.functions.TestMatch
[echo] Tests run: 9, Failures: 0, Aborted: 0, Skipped: 0, Time elapsed: 0.008000 sec
[echo] Ran org.apache.poi.ss.formula.functions.TestMatchFunctionsFromSpreadsheet
[echo] Tests run: 14, Failures: 0, Aborted: 0, Skipped: 0, Time elapsed: 0.011000 sec
[echo] Ran org.apache.poi.ss.formula.functions.TestMathX
[echo] Tests run: 23, Failures: 0, Aborted: 0, Skipped: 0, Time elapsed: 0.010000 sec
[echo] Ran org.apache.poi.ss.formula.functions.TestMid
[echo] Tests run: 4, Failures: 0, Aborted: 0, Skipped: 0, Time elapsed: 0.002000 sec
[echo] Ran org.apache.poi.ss.formula.functions.TestMirr
[echo] Tests run: 4, Failures: 0, Aborted: 0, Skipped: 0, Time elapsed: 0.005000 sec
[echo] Ran org.apache.poi.ss.formula.functions.TestMultiOperandNumericFunction
[echo] Tests run: 3, Failures: 0, Aborted: 0, Skipped: 0, Time elapsed: 0.001000 sec
[echo] Ran org.apache.poi.ss.formula.functions.TestNper
[echo] Tests run: 2, Failures: 0, Aborted: 0, Skipped: 0, Time elapsed: 0.002000 sec
[echo] Ran org.apache.poi.ss.formula.functions.TestNpv
[echo] Tests run: 2, Failures: 0, Aborted: 0, Skipped: 0, Time elapsed: 0.003000 sec
[echo] Ran org.apache.poi.ss.formula.functions.TestOct2Dec
[echo] Tests run: 2, Failures: 0, Aborted: 0, Skipped: 0, Time elapsed: 0.001000 sec
[echo] Ran org.apache.poi.ss.formula.functions.TestOffset
[echo] Tests run: 21, Failures: 0, Aborted: 0, Skipped: 0, Time elapsed: 0.015000 sec
[echo] Ran org.apache.poi.ss.formula.functions.TestPPMT
[echo] Tests run: 1, Failures: 0, Aborted: 0, Skipped: 0, Time elapsed: 0.002000 sec
[echo] Ran org.apache.poi.ss.formula.functions.TestPmt
[echo] Tests run: 2, Failures: 0, Aborted: 0, Skipped: 0, Time elapsed: 0.001000 sec
[echo] Ran org.apache.poi.ss.formula.functions.TestPoisson
[echo] Tests run: 6, Failures: 0, Aborted: 0, Skipped: 0, Time elapsed: 0.001000 sec
[echo] Ran org.apache.poi.ss.formula.functions.TestProduct
[echo] Tests run: 4, Failures: 0, Aborted: 0, Skipped: 0, Time elapsed: 0.001000 sec
[echo] Ran org.apache.poi.ss.formula.functions.TestQuotient
[echo] Tests run: 2, Failures: 0, Aborted: 0, Skipped: 0, Time elapsed: 0.002000 sec
[echo] Ran org.apache.poi.ss.formula.functions.TestQuotientFunctionsFromSpreadsheet
[echo] Tests run: 8, Failures: 0, Aborted: 0, Skipped: 0, Time elapsed: 0.010000 sec
[echo] Ran org.apache.poi.ss.formula.functions.TestRank
[echo] Tests run: 1, Failures: 0, Aborted: 0, Skipped: 0, Time elapsed: 0.005000 sec
[echo] Ran org.apache.poi.ss.formula.functions.TestRelationalOperations
[echo] Tests run: 5, Failures: 0, Aborted: 0, Skipped: 0, Time elapsed: 0.005000 sec
[echo] Ran org.apache.poi.ss.formula.functions.TestReptFunctionsFromSpreadsheet
[echo] Tests run: 5, Failures: 0, Aborted: 0, Skipped: 0, Time elapsed: 0.015000 sec
[echo] Ran org.apache.poi.ss.formula.functions.TestRomanFunctionsFromSpreadsheet
[echo] Tests run: 35, Failures: 0, Aborted: 0, Skipped: 0, Time elapsed: 0.028000 sec
[echo] Ran org.apache.poi.ss.formula.functions.TestRoundFuncs
[echo] Tests run: 5, Failures: 0, Aborted: 0, Skipped: 1, Time elapsed: 0.002000 sec
[echo] Ran org.apache.poi.ss.formula.functions.TestRowCol
[echo] Tests run: 4, Failures: 0, Aborted: 0, Skipped: 0, Time elapsed: 0.002000 sec
[echo] Ran org.apache.poi.ss.formula.functions.TestSlope
[echo] Tests run: 3, Failures: 0, Aborted: 0, Skipped: 0, Time elapsed: 0.003000 sec
[echo] Ran org.apache.poi.ss.formula.functions.TestStatsLib
[echo] Tests run: 8, Failures: 0, Aborted: 0, Skipped: 0, Time elapsed: 0.003000 sec
[echo] Ran org.apache.poi.ss.formula.functions.TestSubstitute
[echo] Tests run: 5, Failures: 0, Aborted: 0, Skipped: 0, Time elapsed: 0.002000 sec
[echo] Ran org.apache.poi.ss.formula.functions.TestSubtotal
[echo] Tests run: 11, Failures: 0, Aborted: 0, Skipped: 0, Time elapsed: 0.014000 sec
[echo] Ran org.apache.poi.ss.formula.functions.TestSumif
[echo] Tests run: 3, Failures: 0, Aborted: 0, Skipped: 0, Time elapsed: 0.002000 sec
[echo] Ran org.apache.poi.ss.formula.functions.TestSumifs
[echo] Tests run: 7, Failures: 0, Aborted: 0, Skipped: 0, Time elapsed: 0.008000 sec
[echo] Ran org.apache.poi.ss.formula.functions.TestSumproduct
[echo] Tests run: 5, Failures: 0, Aborted: 0, Skipped: 0, Time elapsed: 0.002000 sec
[echo] Ran org.apache.poi.ss.formula.functions.TestTFunc
[echo] Tests run: 5, Failures: 0, Aborted: 0, Skipped: 0, Time elapsed: 0.002000 sec
[echo] Ran org.apache.poi.ss.formula.functions.TestText
[echo] Tests run: 4, Failures: 0, Aborted: 0, Skipped: 0, Time elapsed: 0.006000 sec
[echo] Ran org.apache.poi.ss.formula.functions.TestTime
[echo] Tests run: 2, Failures: 0, Aborted: 0, Skipped: 0, Time elapsed: 0.006000 sec
[echo] Ran org.apache.poi.ss.formula.functions.TestTrendFunctionsFromSpreadsheet
[echo] Tests run: 41, Failures: 0, Aborted: 0, Skipped: 0, Time elapsed: 0.117000 sec
[echo] Ran org.apache.poi.ss.formula.functions.TestTrim
[echo] Tests run: 3, Failures: 0, Aborted: 0, Skipped: 0, Time elapsed: 0.001000 sec
[echo] Ran org.apache.poi.ss.formula.functions.TestTrunc
[echo] Tests run: 7, Failures: 0, Aborted: 0, Skipped: 0, Time elapsed: 0.002000 sec
[echo] Ran org.apache.poi.ss.formula.functions.TestTwoOperandNumericFunctionsFromSpreadsheet
[echo] Tests run: 34, Failures: 0, Aborted: 0, Skipped: 0, Time elapsed: 0.032000 sec
[echo] Ran org.apache.poi.ss.formula.functions.TestValue
[echo] Tests run: 2, Failures: 0, Aborted: 0, Skipped: 0, Time elapsed: 0.003000 sec
[echo] Ran org.apache.poi.ss.formula.functions.TestWeekNumFunctionsFromSpreadsheet
[echo] Tests run: 7, Failures: 0, Aborted: 0, Skipped: 0, Time elapsed: 0.009000 sec
[echo] Ran org.apache.poi.ss.formula.functions.TestWeekNumFunctionsFromSpreadsheet2013
[echo] Tests run: 7, Failures: 0, Aborted: 0, Skipped: 0, Time elapsed: 0.007000 sec
[echo] Ran org.apache.poi.ss.formula.functions.TestWeekdayFunc
[echo] Tests run: 2, Failures: 0, Aborted: 0, Skipped: 0, Time elapsed: 0.002000 sec
[echo] Ran org.apache.poi.ss.formula.functions.TestXYNumericFunction
[echo] Tests run: 3, Failures: 0, Aborted: 0, Skipped: 0, Time elapsed: 0.005000 sec
[echo] Ran org.apache.poi.ss.formula.ptg.TestAbstractFunctionPtg
[echo] Tests run: 3, Failures: 0, Aborted: 0, Skipped: 0, Time elapsed: 0.002000 sec
[echo] Ran org.apache.poi.ss.formula.ptg.TestArea3DPtg
[echo] Tests run: 1, Failures: 0, Aborted: 0, Skipped: 0, Time elapsed: 0.001000 sec
[echo] Ran org.apache.poi.ss.formula.ptg.TestAreaErrPtg
[echo] Tests run: 1, Failures: 0, Aborted: 0, Skipped: 0, Time elapsed: 0.002000 sec
[echo] Ran org.apache.poi.ss.formula.ptg.TestAreaPtg
[echo] Tests run: 5, Failures: 0, Aborted: 0, Skipped: 0, Time elapsed: 0.002000 sec
[echo] Ran org.apache.poi.ss.formula.ptg.TestArrayPtg
[echo] Tests run: 5, Failures: 0, Aborted: 0, Skipped: 0, Time elapsed: 0.002000 sec
[echo] Ran org.apache.poi.ss.formula.ptg.TestAttrPtg
[echo] Tests run: 1, Failures: 0, Aborted: 0, Skipped: 0, Time elapsed: 0.001000 sec
[echo] Ran org.apache.poi.ss.formula.ptg.TestErrPtg
[echo] Tests run: 1, Failures: 0, Aborted: 0, Skipped: 0, Time elapsed: 0.002000 sec
[echo] Ran org.apache.poi.ss.formula.ptg.TestExternalFunctionFormulas
[echo] Tests run: 3, Failures: 0, Aborted: 0, Skipped: 0, Time elapsed: 0.004000 sec
[echo] Ran org.apache.poi.ss.formula.ptg.TestExternalNameReference
[echo] Tests run: 3, Failures: 0, Aborted: 0, Skipped: 0, Time elapsed: 0.006000 sec
[echo] Ran org.apache.poi.ss.formula.ptg.TestFuncPtg
[echo] Tests run: 2, Failures: 0, Aborted: 0, Skipped: 0, Time elapsed: 0.000000 sec
[echo] Ran org.apache.poi.ss.formula.ptg.TestFuncVarPtg
[echo] Tests run: 1, Failures: 0, Aborted: 0, Skipped: 0, Time elapsed: 0.001000 sec
[echo] Ran org.apache.poi.ss.formula.ptg.TestIntersectionPtg
[echo] Tests run: 1, Failures: 0, Aborted: 0, Skipped: 0, Time elapsed: 0.001000 sec
[echo] Ran org.apache.poi.ss.formula.ptg.TestPercentPtg
[echo] Tests run: 1, Failures: 0, Aborted: 0, Skipped: 0, Time elapsed: 0.002000 sec
[echo] Ran org.apache.poi.ss.formula.ptg.TestRangePtg
[echo] Tests run: 1, Failures: 0, Aborted: 0, Skipped: 0, Time elapsed: 0.001000 sec
[echo] Ran org.apache.poi.ss.formula.ptg.TestRef3DPtg
[echo] Tests run: 1, Failures: 0, Aborted: 0, Skipped: 0, Time elapsed: 0.001000 sec
[echo] Ran org.apache.poi.ss.formula.ptg.TestReferencePtg
[echo] Tests run: 4, Failures: 0, Aborted: 0, Skipped: 0, Time elapsed: 0.010000 sec
[echo] Ran org.apache.poi.ss.formula.ptg.TestUnionPtg
[echo] Tests run: 1, Failures: 0, Aborted: 0, Skipped: 0, Time elapsed: 0.001000 sec
[echo] Ran org.apache.poi.ss.formula.udf.TestAggregatingUDFFinder
[echo] Tests run: 2, Failures: 0, Aborted: 0, Skipped: 0, Time elapsed: 0.002000 sec
[echo] Ran org.apache.poi.ss.formula.udf.TestDefaultUDFFinder
[echo] Tests run: 1, Failures: 0, Aborted: 0, Skipped: 0, Time elapsed: 0.001000 sec
[echo] Ran org.apache.poi.ss.usermodel.TestDataFormatter
[echo] Tests run: 37, Failures: 0, Aborted: 0, Skipped: 1, Time elapsed: 0.435000 sec
[echo] Ran org.apache.poi.ss.usermodel.TestDateUtil
[echo] Tests run: 26, Failures: 0, Aborted: 0, Skipped: 0, Time elapsed: 0.027000 sec
[echo] Ran org.apache.poi.ss.usermodel.TestExcelStyleDateFormatter
[echo] Tests run: 123, Failures: 0, Aborted: 0, Skipped: 0, Time elapsed: 0.108000 sec
[echo] Ran org.apache.poi.ss.usermodel.TestFractionFormat
[echo] Tests run: 5, Failures: 0, Aborted: 0, Skipped: 1, Time elapsed: 0.376000 sec
[echo] Ran org.apache.poi.ss.usermodel.TestHSSFBorderStyle
[echo] Tests run: 1, Failures: 0, Aborted: 0, Skipped: 0, Time elapsed: 0.002000 sec
[echo] Ran org.apache.poi.ss.usermodel.TestIndexedColors
[echo] Tests run: 3, Failures: 0, Aborted: 0, Skipped: 0, Time elapsed: 0.001000 sec
[echo] Ran org.apache.poi.ss.util.TestAreaReference
[echo] Tests run: 3, Failures: 0, Aborted: 0, Skipped: 0, Time elapsed: 0.002000 sec
[echo] Ran org.apache.poi.ss.util.TestCellAddress
[echo] Tests run: 6, Failures: 0, Aborted: 0, Skipped: 0, Time elapsed: 0.002000 sec
[echo] Ran org.apache.poi.ss.util.TestCellRangeAddress
[echo] Tests run: 14, Failures: 0, Aborted: 0, Skipped: 0, Time elapsed: 0.009000 sec
[echo] Ran org.apache.poi.ss.util.TestCellRangeUtil
[echo] Tests run: 1, Failures: 0, Aborted: 0, Skipped: 0, Time elapsed: 0.001000 sec
[echo] Ran org.apache.poi.ss.util.TestCellReference
[echo] Tests run: 27, Failures: 0, Aborted: 0, Skipped: 0, Time elapsed: 0.365000 sec
[echo] Ran org.apache.poi.ss.util.TestDateFormatConverter
[echo] Tests run: 18, Failures: 0, Aborted: 0, Skipped: 0, Time elapsed: 2.162000 sec
[echo] Ran org.apache.poi.ss.util.TestDateParser
[echo] Tests run: 5, Failures: 0, Aborted: 0, Skipped: 0, Time elapsed: 0.062000 sec
[echo] Ran org.apache.poi.ss.util.TestExpandedDouble
[echo] Tests run: 18, Failures: 0, Aborted: 0, Skipped: 0, Time elapsed: 0.015000 sec
[echo] Ran org.apache.poi.ss.util.TestHSSFCellUtil
[echo] Tests run: 14, Failures: 0, Aborted: 0, Skipped: 0, Time elapsed: 0.027000 sec
[echo] Ran org.apache.poi.ss.util.TestNumberComparer
[echo] Tests run: 115, Failures: 0, Aborted: 0, Skipped: 0, Time elapsed: 0.090000 sec
[echo] Ran org.apache.poi.ss.util.TestNumberToTextConverter
[echo] Tests run: 2, Failures: 0, Aborted: 0, Skipped: 0, Time elapsed: 0.008000 sec
[echo] Ran org.apache.poi.ss.util.TestPropertyTemplate
[echo] Tests run: 8, Failures: 0, Aborted: 0, Skipped: 0, Time elapsed: 0.040000 sec
[echo] Ran org.apache.poi.ss.util.TestRegionUtil
[echo] Tests run: 10, Failures: 0, Aborted: 0, Skipped: 0, Time elapsed: 0.026000 sec
[echo] Ran org.apache.poi.ss.util.TestSheetBuilder
[echo] Tests run: 3, Failures: 0, Aborted: 0, Skipped: 0, Time elapsed: 0.003000 sec
[echo] Ran org.apache.poi.ss.util.TestSheetUtil
[echo] Tests run: 7, Failures: 0, Aborted: 0, Skipped: 0, Time elapsed: 0.580000 sec
[echo] Ran org.apache.poi.ss.util.TestWorkbookUtil
[echo] Tests run: 1, Failures: 0, Aborted: 0, Skipped: 0, Time elapsed: 0.001000 sec
[echo] Ran org.apache.poi.ss.util.cellwalk.TestCellWalk
[echo] Tests run: 1, Failures: 0, Aborted: 0, Skipped: 0, Time elapsed: 0.005000 sec
[echo] Ran org.apache.poi.util.TestArrayUtil
[echo] Tests run: 1, Failures: 0, Aborted: 0, Skipped: 0, Time elapsed: 0.003000 sec
[echo] Ran org.apache.poi.util.TestBitField
[echo] Tests run: 16, Failures: 0, Aborted: 0, Skipped: 0, Time elapsed: 0.005000 sec
[echo] Ran org.apache.poi.util.TestByteField
[echo] Tests run: 5, Failures: 0, Aborted: 0, Skipped: 0, Time elapsed: 0.002000 sec
[echo] Ran org.apache.poi.util.TestHexDump
[echo] Tests run: 8, Failures: 0, Aborted: 0, Skipped: 0, Time elapsed: 0.009000 sec
[echo] Ran org.apache.poi.util.TestIOUtils
[echo] Tests run: 36, Failures: 0, Aborted: 0, Skipped: 0, Time elapsed: 0.022000 sec
[echo] Ran org.apache.poi.util.TestIntList
[echo] Tests run: 19, Failures: 0, Aborted: 0, Skipped: 0, Time elapsed: 0.067000 sec
[echo] Ran org.apache.poi.util.TestIntegerField
[echo] Tests run: 5, Failures: 0, Aborted: 0, Skipped: 0, Time elapsed: 0.003000 sec
[echo] Ran org.apache.poi.util.TestLittleEndian
[echo] Tests run: 15, Failures: 0, Aborted: 0, Skipped: 0, Time elapsed: 0.005000 sec
[echo] Ran org.apache.poi.util.TestLittleEndianStreams
[echo] Tests run: 5, Failures: 0, Aborted: 0, Skipped: 0, Time elapsed: 0.002000 sec
[echo] Ran org.apache.poi.util.TestLocaleUtil
[echo] Tests run: 3, Failures: 0, Aborted: 0, Skipped: 0, Time elapsed: 0.002000 sec
[echo] Ran org.apache.poi.util.TestLongField
[echo] Tests run: 5, Failures: 0, Aborted: 0, Skipped: 0, Time elapsed: 0.004000 sec
[echo] Ran org.apache.poi.util.TestPOILogger
[echo] Tests run: 1, Failures: 0, Aborted: 0, Skipped: 0, Time elapsed: 0.001000 sec
[echo] Ran org.apache.poi.util.TestRLEDecompressingInputStream
[echo] Tests run: 4, Failures: 0, Aborted: 0, Skipped: 0, Time elapsed: 0.001000 sec
[echo] Ran org.apache.poi.util.TestShortField
[echo] Tests run: 5, Failures: 0, Aborted: 0, Skipped: 0, Time elapsed: 0.003000 sec
[echo] Ran org.apache.poi.util.TestStringCodepointsIterable
[echo] Tests run: 1, Failures: 0, Aborted: 0, Skipped: 0, Time elapsed: 0.002000 sec
[echo] Ran org.apache.poi.util.TestStringUtil
[echo] Tests run: 7, Failures: 0, Aborted: 0, Skipped: 0, Time elapsed: 0.004000 sec
[echo] Ran org.apache.poi.util.TestTempFile
[echo] Tests run: 4, Failures: 0, Aborted: 0, Skipped: 0, Time elapsed: 0.006000 sec
[echo] Ran org.apache.poi.util.TestXMLHelper
[echo] Tests run: 8, Failures: 0, Aborted: 0, Skipped: 0, Time elapsed: 0.205000 sec
-test-excelant-write-testfile:
test:
compile-integration:
[javac] Compiling 27 source files to <https://ci-builds.apache.org/job/POI/job/POI-DSL-IBM-JDK/ws/build/integration-test-classes>
[javac] Support for javac --release has been added in Java9 ignoring it
[mkdir] Created dir: <https://ci-builds.apache.org/job/POI/job/POI-DSL-IBM-JDK/ws/build/integration-test-classes/META-INF/versions/9>
[jar] Building jar: <https://ci-builds.apache.org/job/POI/job/POI-DSL-IBM-JDK/ws/build/dist/maven/poi-integration/poi-integration-5.0.1.jar>
-test-integration-check:
test-integration:
BUILD FAILED
<https://ci-builds.apache.org/job/POI/job/POI-DSL-IBM-JDK/ws/build.xml>:1709: The following error occurred while executing this line:
<https://ci-builds.apache.org/job/POI/job/POI-DSL-IBM-JDK/ws/build.xml>:1256: Some test(s) have failure(s)
Total time: 18 minutes 57 seconds
Build step 'Invoke Ant' marked build as failure
[SpotBugs] Skipping execution of recorder since overall result is 'FAILURE'
Archiving artifacts
[Fast Archiver] Compressed 9.91 MB of artifacts by 30.9% relative to #25
Skipping publisher since build result is FAILURE
Recording test results
---------------------------------------------------------------------
To unsubscribe, e-mail: dev-unsubscribe@poi.apache.org
For additional commands, e-mail: dev-help@poi.apache.org
Jenkins build is back to normal : POI » POI-DSL-IBM-JDK #27
Posted by Apache Jenkins Server <je...@builds.apache.org>.
See <https://ci-builds.apache.org/job/POI/job/POI-DSL-IBM-JDK/27/display/redirect?page=changes>
---------------------------------------------------------------------
To unsubscribe, e-mail: dev-unsubscribe@poi.apache.org
For additional commands, e-mail: dev-help@poi.apache.org