You are viewing a plain text version of this content. The canonical link for it is here.
Posted to commits@flex.apache.org by bi...@gmail.com on 2014/01/23 03:55:47 UTC

flex-sdk_mustella - Build # 73 - Still Failing!

flex-sdk_mustella - Build # 73 - Still Failing:

http://bigosmallm.cloudapp.net:8080/job/flex-sdk_mustella/73/

Changes for Build #63

Changes for Build #64
[jmclean] FLEX-33971 removed line from across checkbox

[jmclean] FLEX-33893 CSS memory / performance fix

[jmclean] FLEX-33891 stop getstyleManager being called twice

[jmclean] Changed scale factor to 1.5 of 320 dpi skins rather than 2x 320 dpi skins. Adjusted x and y coordinated to be 1.5x 320 dpi skins.

[jmclean] FLEX-33897 MediaQueryParser memory use improvements

[jmclean] FLEX-33904 memory fix


Changes for Build #65
[jmclean] FLEX-33836 lazy loading of resource files give performance improvement (esp mobile)


Changes for Build #66

Changes for Build #67
[jmclean] remove try catch to improve performance. ADG tests pass.

[jmclean] make catch block empty to improve performance

[jmclean] make catch block empty to improve performance

[jmclean] make catch block empty to improve performance

[jmclean] FLEX-34019 stop combo box from staying open

[jmclean] changed private to protected

[jmclean] made code constant in both classes

[jmclean] CXForm add toString method

[jmclean] remove try and catch to improve performance

[jmclean] FLEX-33913 fix for lists getting mixed up

[jmclean] added helpful comment about compiler generating skin parts

[aharui] add imagediff target that compiles and runs the imagediff tool

[aharui] tidy up the pb release packaging


Changes for Build #68

Changes for Build #69
[jmclean] fix for RTE in mustella tests

[aharui] add rat task for general purpose ratting

[aharui] attempt to fix build

[fthomas] FLEX-26768  When debugging multi-module projects impossible to set breakpoint if there are

[fthomas] FLEX-34046: prints full stack if Flash Player detects not handled exception

[fthomas] FLEX-34045: adds file id to the stack info printed by fdb

[fthomas] FLEX-34043: Impossible to set breakpoint in MXML files that contains item renderer.

[maurice.amsellem] FIXED - FLEX-34038 Mobilegrid overflow

[jmclean] Update to release versions of AIR 4.0 and Flash Player 12.0

[jmclean] update with recent changes

[jmclean] updated year to 2014

[jmclean] Update default year to 2104


Changes for Build #70
[fthomas] FLEX-34049: Allow the ouput symbols to be escaped when called from an IDE


Changes for Build #71
[jmclean] FLEX-34051 fix for RTE


Changes for Build #72
[aharui] only sign zips and tar.gz files

[aharui] fix failing tests.  It appears the tests were not operating correctly and now are

[jmclean] FLEX-34052 added guard for RTE


Changes for Build #73
[aharui] update main keys file with my new key

[aharui] switch over to official release of pixelbender bits

[aharui] using enum as variable name caused issues in Java 7 compiler

[carlosrovira] FLEX-34053 - New MaskedTextinput in experimental library



--------------------------------

[...truncated 171228 lines...]
     [java] After Wait loop 02:55:17.321 waiting = 0
     [java] clobberProcess false
     [java] Total Results so far: 16
     [java] waited 1900
     [java] ClobberProcess, it was already null
     [java] Grab log, do parse = false
     [java] Grabbing the log from: C:\Users\apacheflex\Application Data\Macromedia/Flash Player/Logs/flashlog.txt to: C:\jenkins_slave\workspace\flex-sdk_mustella\mustella\tests\spark\validators\NumberValidator\SWFs\NV_minValue_Main.log
     [java] Skipping: C:\jenkins_slave\workspace\flex-sdk_mustella\mustella\tests\spark\validators\NumberValidator\SWFs\NV_negativeNumberFormat_Main.lnk.xml
     [java] Skipping: C:\jenkins_slave\workspace\flex-sdk_mustella\mustella\tests\spark\validators\NumberValidator\SWFs\NV_negativeNumberFormat_Main.mxml
     [java] new test file: C:\jenkins_slave\workspace\flex-sdk_mustella\mustella\tests\spark\validators\NumberValidator\SWFs\NV_negativeNumberFormat_Main.swf
     [java] ******** cmdArr before: 
     [java] 	C:\ApacheFlex\dependencies\FlashPlayer_Debug\flashplayer11-9_debugsa_win_32.exe
     [java] 	C:\jenkins_slave\workspace\flex-sdk_mustella\mustella\tests\spark\validators\NumberValidator\SWFs\NV_negativeNumberFormat_Main.swf
     [java] ******** moreParameters before: 
     [java] ******** cmdArr after: 
     [java] 	C:\ApacheFlex\dependencies\FlashPlayer_Debug\flashplayer11-9_debugsa_win_32.exe
     [java] 	C:\jenkins_slave\workspace\flex-sdk_mustella\mustella\tests\spark\validators\NumberValidator\SWFs\NV_negativeNumberFormat_Main.swf
     [java] getting directory from the swf file
     [java] derived directory: C:\jenkins_slave\workspace\flex-sdk_mustella\mustella\tests\spark\validators\NumberValidator\SWFs
     [java] Launching: 
     [java]  C:\ApacheFlex\dependencies\FlashPlayer_Debug\flashplayer11-9_debugsa_win_32.exe C:\jenkins_slave\workspace\flex-sdk_mustella\mustella\tests\spark\validators\NumberValidator\SWFs\NV_negativeNumberFormat_Main.swf Launching: C:\ApacheFlex\dependencies\FlashPlayer_Debug\flashplayer11-9_debugsa_win_32.exe C:\jenkins_slave\workspace\flex-sdk_mustella\mustella\tests\spark\validators\NumberValidator\SWFs\NV_negativeNumberFormat_Main.swf
     [java] USING directory: C:\jenkins_slave\workspace\flex-sdk_mustella\mustella\tests\spark\validators\NumberValidator\SWFs
     [java] time: 02:55:19.600
     [java] SCRIPTDONE! 02:55:22.685
     [java] GET /ScriptComplete?0 HTTP/1.1
     [java] Before Wait loop 02:55:22.685 waiting = 0
     [java] After Wait loop 02:55:22.685 waiting = 0
     [java] clobberProcess false
     [java] Total Results so far: 16
     [java] Grab log, do parse = false
     [java] Grabbing the log from: C:\Users\apacheflex\Application Data\Macromedia/Flash Player/Logs/flashlog.txt to: C:\jenkins_slave\workspace\flex-sdk_mustella\mustella\tests\spark\validators\NumberValidator\SWFs\NV_negativeNumberFormat_Main.log
     [java] Skipping: C:\jenkins_slave\workspace\flex-sdk_mustella\mustella\tests\spark\validators\NumberValidator\SWFs\NV_negativeSymbol_Main.lnk.xml
     [java] Skipping: C:\jenkins_slave\workspace\flex-sdk_mustella\mustella\tests\spark\validators\NumberValidator\SWFs\NV_negativeSymbol_Main.mxml
     [java] new test file: C:\jenkins_slave\workspace\flex-sdk_mustella\mustella\tests\spark\validators\NumberValidator\SWFs\NV_negativeSymbol_Main.swf
     [java] ******** cmdArr before: 
     [java] 	C:\ApacheFlex\dependencies\FlashPlayer_Debug\flashplayer11-9_debugsa_win_32.exe
     [java] 	C:\jenkins_slave\workspace\flex-sdk_mustella\mustella\tests\spark\validators\NumberValidator\SWFs\NV_negativeSymbol_Main.swf
     [java] ******** moreParameters before: 
     [java] ******** cmdArr after: 
     [java] 	C:\ApacheFlex\dependencies\FlashPlayer_Debug\flashplayer11-9_debugsa_win_32.exe
     [java] 	C:\jenkins_slave\workspace\flex-sdk_mustella\mustella\tests\spark\validators\NumberValidator\SWFs\NV_negativeSymbol_Main.swf
     [java] getting directory from the swf file
     [java] derived directory: C:\jenkins_slave\workspace\flex-sdk_mustella\mustella\tests\spark\validators\NumberValidator\SWFs
     [java] Launching: 
     [java]  C:\ApacheFlex\dependencies\FlashPlayer_Debug\flashplayer11-9_debugsa_win_32.exe C:\jenkins_slave\workspace\flex-sdk_mustella\mustella\tests\spark\validators\NumberValidator\SWFs\NV_negativeSymbol_Main.swf Launching: C:\ApacheFlex\dependencies\FlashPlayer_Debug\flashplayer11-9_debugsa_win_32.exe C:\jenkins_slave\workspace\flex-sdk_mustella\mustella\tests\spark\validators\NumberValidator\SWFs\NV_negativeSymbol_Main.swf
     [java] USING directory: C:\jenkins_slave\workspace\flex-sdk_mustella\mustella\tests\spark\validators\NumberValidator\SWFs
     [java] time: 02:55:24.948
     [java] waited 2000
     [java] ClobberProcess, it was already null
     [java] SCRIPTDONE! 02:55:27.984
     [java] GET /ScriptComplete?0 HTTP/1.1
     [java] Before Wait loop 02:55:27.984 waiting = 0
     [java] After Wait loop 02:55:27.984 waiting = 0
     [java] clobberProcess false
     [java] Total Results so far: 16
     [java] waited 1900
     [java] ClobberProcess, it was already null
     [java] Grab log, do parse = false
     [java] Grabbing the log from: C:\Users\apacheflex\Application Data\Macromedia/Flash Player/Logs/flashlog.txt to: C:\jenkins_slave\workspace\flex-sdk_mustella\mustella\tests\spark\validators\NumberValidator\SWFs\NV_negativeSymbol_Main.log
     [java] Skipping: C:\jenkins_slave\workspace\flex-sdk_mustella\mustella\tests\spark\validators\NumberValidator\SWFs\NV_validate.lnk.xml
     [java] Skipping: C:\jenkins_slave\workspace\flex-sdk_mustella\mustella\tests\spark\validators\NumberValidator\SWFs\NV_validate.mxml
     [java] new test file: C:\jenkins_slave\workspace\flex-sdk_mustella\mustella\tests\spark\validators\NumberValidator\SWFs\NV_validate.swf
     [java] ******** cmdArr before: 
     [java] 	C:\ApacheFlex\dependencies\FlashPlayer_Debug\flashplayer11-9_debugsa_win_32.exe
     [java] 	C:\jenkins_slave\workspace\flex-sdk_mustella\mustella\tests\spark\validators\NumberValidator\SWFs\NV_validate.swf
     [java] ******** moreParameters before: 
     [java] ******** cmdArr after: 
     [java] 	C:\ApacheFlex\dependencies\FlashPlayer_Debug\flashplayer11-9_debugsa_win_32.exe
     [java] 	C:\jenkins_slave\workspace\flex-sdk_mustella\mustella\tests\spark\validators\NumberValidator\SWFs\NV_validate.swf
     [java] getting directory from the swf file
     [java] derived directory: C:\jenkins_slave\workspace\flex-sdk_mustella\mustella\tests\spark\validators\NumberValidator\SWFs
     [java] Launching: 
     [java]  C:\ApacheFlex\dependencies\FlashPlayer_Debug\flashplayer11-9_debugsa_win_32.exe C:\jenkins_slave\workspace\flex-sdk_mustella\mustella\tests\spark\validators\NumberValidator\SWFs\NV_validate.swf Launching: C:\ApacheFlex\dependencies\FlashPlayer_Debug\flashplayer11-9_debugsa_win_32.exe C:\jenkins_slave\workspace\flex-sdk_mustella\mustella\tests\spark\validators\NumberValidator\SWFs\NV_validate.swf
     [java] USING directory: C:\jenkins_slave\workspace\flex-sdk_mustella\mustella\tests\spark\validators\NumberValidator\SWFs
     [java] time: 02:55:30.217
     [java] SCRIPTDONE! 02:55:33.199
     [java] GET /ScriptComplete?0 HTTP/1.1
     [java] Before Wait loop 02:55:33.199 waiting = 0
     [java] After Wait loop 02:55:33.199 waiting = 0
     [java] clobberProcess false
     [java] Total Results so far: 16
     [java] Grab log, do parse = false
     [java] Grabbing the log from: C:\Users\apacheflex\Application Data\Macromedia/Flash Player/Logs/flashlog.txt to: C:\jenkins_slave\workspace\flex-sdk_mustella\mustella\tests\spark\validators\NumberValidator\SWFs\NV_validate.log
     [java] Skipping: C:\jenkins_slave\workspace\flex-sdk_mustella\mustella\tests\spark\validators\NumberValidator\SWFs\NV_validateAll.lnk.xml
     [java] Skipping: C:\jenkins_slave\workspace\flex-sdk_mustella\mustella\tests\spark\validators\NumberValidator\SWFs\NV_validateAll.mxml
     [java] new test file: C:\jenkins_slave\workspace\flex-sdk_mustella\mustella\tests\spark\validators\NumberValidator\SWFs\NV_validateAll.swf
     [java] ******** cmdArr before: 
     [java] 	C:\ApacheFlex\dependencies\FlashPlayer_Debug\flashplayer11-9_debugsa_win_32.exe
     [java] 	C:\jenkins_slave\workspace\flex-sdk_mustella\mustella\tests\spark\validators\NumberValidator\SWFs\NV_validateAll.swf
     [java] ******** moreParameters before: 
     [java] ******** cmdArr after: 
     [java] 	C:\ApacheFlex\dependencies\FlashPlayer_Debug\flashplayer11-9_debugsa_win_32.exe
     [java] 	C:\jenkins_slave\workspace\flex-sdk_mustella\mustella\tests\spark\validators\NumberValidator\SWFs\NV_validateAll.swf
     [java] getting directory from the swf file
     [java] derived directory: C:\jenkins_slave\workspace\flex-sdk_mustella\mustella\tests\spark\validators\NumberValidator\SWFs
     [java] Launching: 
     [java]  C:\ApacheFlex\dependencies\FlashPlayer_Debug\flashplayer11-9_debugsa_win_32.exe C:\jenkins_slave\workspace\flex-sdk_mustella\mustella\tests\spark\validators\NumberValidator\SWFs\NV_validateAll.swf Launching: C:\ApacheFlex\dependencies\FlashPlayer_Debug\flashplayer11-9_debugsa_win_32.exe C:\jenkins_slave\workspace\flex-sdk_mustella\mustella\tests\spark\validators\NumberValidator\SWFs\NV_validateAll.swf
     [java] USING directory: C:\jenkins_slave\workspace\flex-sdk_mustella\mustella\tests\spark\validators\NumberValidator\SWFs
     [java] time: 02:55:35.470
     [java] waited 2000
     [java] ClobberProcess, it was already null
     [java] SCRIPTDONE! 02:55:39.624
     [java] GET /ScriptComplete?0 HTTP/1.1
     [java] Before Wait loop 02:55:39.624 waiting = 0
     [java] After Wait loop 02:55:39.624 waiting = 0
     [java] clobberProcess false
     [java] Total Results so far: 16
     [java] Grab log, do parse = false
     [java] Grabbing the log from: C:\Users\apacheflex\Application Data\Macromedia/Flash Player/Logs/flashlog.txt to: C:\jenkins_slave\workspace\flex-sdk_mustella\mustella\tests\spark\validators\NumberValidator\SWFs\NV_validateAll.log
     [java] Skipping: C:\jenkins_slave\workspace\flex-sdk_mustella\mustella\tests\spark\validators\NumberValidator\SWFs\NV_validateNumber.lnk.xml
     [java] Skipping: C:\jenkins_slave\workspace\flex-sdk_mustella\mustella\tests\spark\validators\NumberValidator\SWFs\NV_validateNumber.mxml
     [java] new test file: C:\jenkins_slave\workspace\flex-sdk_mustella\mustella\tests\spark\validators\NumberValidator\SWFs\NV_validateNumber.swf
     [java] ******** cmdArr before: 
     [java] 	C:\ApacheFlex\dependencies\FlashPlayer_Debug\flashplayer11-9_debugsa_win_32.exe
     [java] 	C:\jenkins_slave\workspace\flex-sdk_mustella\mustella\tests\spark\validators\NumberValidator\SWFs\NV_validateNumber.swf
     [java] ******** moreParameters before: 
     [java] ******** cmdArr after: 
     [java] 	C:\ApacheFlex\dependencies\FlashPlayer_Debug\flashplayer11-9_debugsa_win_32.exe
     [java] 	C:\jenkins_slave\workspace\flex-sdk_mustella\mustella\tests\spark\validators\NumberValidator\SWFs\NV_validateNumber.swf
     [java] getting directory from the swf file
     [java] derived directory: C:\jenkins_slave\workspace\flex-sdk_mustella\mustella\tests\spark\validators\NumberValidator\SWFs
     [java] Launching: 
     [java]  C:\ApacheFlex\dependencies\FlashPlayer_Debug\flashplayer11-9_debugsa_win_32.exe C:\jenkins_slave\workspace\flex-sdk_mustella\mustella\tests\spark\validators\NumberValidator\SWFs\NV_validateNumber.swf Launching: C:\ApacheFlex\dependencies\FlashPlayer_Debug\flashplayer11-9_debugsa_win_32.exe C:\jenkins_slave\workspace\flex-sdk_mustella\mustella\tests\spark\validators\NumberValidator\SWFs\NV_validateNumber.swf
     [java] USING directory: C:\jenkins_slave\workspace\flex-sdk_mustella\mustella\tests\spark\validators\NumberValidator\SWFs
     [java] time: 02:55:41.933
     [java] waited 2000
     [java] ClobberProcess, it was already null
     [java] SCRIPTDONE! 02:55:44.725
     [java] GET /ScriptComplete?0 HTTP/1.1
     [java] Before Wait loop 02:55:44.725 waiting = 0
     [java] After Wait loop 02:55:44.725 waiting = 0
     [java] clobberProcess false
     [java] Total Results so far: 16
     [java] Grab log, do parse = false
     [java] Grabbing the log from: C:\Users\apacheflex\Application Data\Macromedia/Flash Player/Logs/flashlog.txt to: C:\jenkins_slave\workspace\flex-sdk_mustella\mustella\tests\spark\validators\NumberValidator\SWFs\NV_validateNumber.log
     [java] Skipping: C:\jenkins_slave\workspace\flex-sdk_mustella\mustella\tests\spark\validators\NumberValidator\SWFs\assets\CustomNV.mxml
     [java] Skipping: C:\jenkins_slave\workspace\flex-sdk_mustella\mustella\tests\spark\validators\NumberValidator\SWFs\assets\CustomNVAll.mxml
     [java] Skipping: C:\jenkins_slave\workspace\flex-sdk_mustella\mustella\tests\spark\validators\NumberValidator\SWFs\assets\CustomNVComp.mxml
     [java] Skipping: C:\jenkins_slave\workspace\flex-sdk_mustella\mustella\tests\spark\validators\NumberValidator\SWFs\assets\DefaultLocaleComponent.mxml
     [java] Skipping: C:\jenkins_slave\workspace\flex-sdk_mustella\mustella\tests\spark\validators\NumberValidator\SWFs\assets\FallbackNVComp.mxml
     [java] Skipping: C:\jenkins_slave\workspace\flex-sdk_mustella\mustella\tests\spark\validators\NumberValidator\SWFs\assets\FlexNVBorderContainerComponent.mxml
     [java] Skipping: C:\jenkins_slave\workspace\flex-sdk_mustella\mustella\tests\spark\validators\NumberValidator\SWFs\assets\FlexNVComponent.mxml
     [java] Skipping: C:\jenkins_slave\workspace\flex-sdk_mustella\mustella\tests\spark\validators\NumberValidator\SWFs\assets\INVModuleInterface.as
     [java] Skipping: C:\jenkins_slave\workspace\flex-sdk_mustella\mustella\tests\spark\validators\NumberValidator\SWFs\assets\MyNumValidatorComp.mxml
     [java] Skipping: C:\jenkins_slave\workspace\flex-sdk_mustella\mustella\tests\spark\validators\NumberValidator\SWFs\assets\MyNumberValidator.as
     [java] Skipping: C:\jenkins_slave\workspace\flex-sdk_mustella\mustella\tests\spark\validators\NumberValidator\SWFs\assets\NVConstants.as
     [java] Skipping: C:\jenkins_slave\workspace\flex-sdk_mustella\mustella\tests\spark\validators\NumberValidator\SWFs\assets\NV_FlexModule.mxml
     [java] Skipping: C:\jenkins_slave\workspace\flex-sdk_mustella\mustella\tests\spark\validators\NumberValidator\SWFs\assets\NV_Style_FlexModule.mxml
     [java] Skipping: C:\jenkins_slave\workspace\flex-sdk_mustella\mustella\tests\spark\validators\NumberValidator\SWFs\assets\myExtStyle.css
     [java] Skipping: C:\jenkins_slave\workspace\flex-sdk_mustella\mustella\tests\spark\validators\NumberValidator\SWFs\pre_compile.sh
     [java] Skipping: C:\jenkins_slave\workspace\flex-sdk_mustella\mustella\tests\spark\validators\NumberValidator\SWFs\pre_compile.sh.0.log
     [java] Skipping: C:\jenkins_slave\workspace\flex-sdk_mustella\mustella\tests\spark\validators\NumberValidator\Styles\NV_Ext_Style_tester.mxml
     [java] Skipping: C:\jenkins_slave\workspace\flex-sdk_mustella\mustella\tests\spark\validators\NumberValidator\Styles\NV_StyleManager_loadExtCSS_tester.mxml
     [java] Skipping: C:\jenkins_slave\workspace\flex-sdk_mustella\mustella\tests\spark\validators\NumberValidator\Styles\NV_StyleManager_tester.mxml
     [java] Skipping: C:\jenkins_slave\workspace\flex-sdk_mustella\mustella\tests\spark\validators\NumberValidator\Styles\NV_Style_DefaultLocale_comp_app_tester.mxml
     [java] Skipping: C:\jenkins_slave\workspace\flex-sdk_mustella\mustella\tests\spark\validators\NumberValidator\Styles\NV_Style_DefaultLocale_comp_global_tester.mxml
     [java] Skipping: C:\jenkins_slave\workspace\flex-sdk_mustella\mustella\tests\spark\validators\NumberValidator\Styles\NV_Style_DefaultLocale_comp_tester.mxml
     [java] Skipping: C:\jenkins_slave\workspace\flex-sdk_mustella\mustella\tests\spark\validators\NumberValidator\Styles\NV_Style_DefaultLocale_module_app_tester.mxml
     [java] Skipping: C:\jenkins_slave\workspace\flex-sdk_mustella\mustella\tests\spark\validators\NumberValidator\Styles\NV_Style_DefaultLocale_module_global_tester.mxml
     [java] Skipping: C:\jenkins_slave\workspace\flex-sdk_mustella\mustella\tests\spark\validators\NumberValidator\Styles\NV_Style_DefaultLocale_module_tester.mxml
     [java] Skipping: C:\jenkins_slave\workspace\flex-sdk_mustella\mustella\tests\spark\validators\NumberValidator\Styles\NV_Style_DefaultLocale_tester.mxml
     [java] Skipping: C:\jenkins_slave\workspace\flex-sdk_mustella\mustella\tests\spark\validators\NumberValidator\Styles\NV_inline_style_tester.mxml
     [java] Skipping: C:\jenkins_slave\workspace\flex-sdk_mustella\mustella\tests\spark\validators\NumberValidator\Styles\NV_localCSSStyle_tester.mxml
     [java] Skipping: C:\jenkins_slave\workspace\flex-sdk_mustella\mustella\tests\spark\validators\NumberValidator\Styles\NV_localStyle_typeSelector_tester.mxml
     [java] at the end of main
     [java] Shutting down the results server
     [java] shutting down the baseline server
     [java] done waiting for results...bye
     [java] =====================================================
     [java]     Passes: 15
     [java]     Fails: 1
     [java] =====================================================
     [java] 
     [java] =====================================================
     [java] =====================================================
     [java] 	Passed: 
     [java] =====================================================
     [java] components/Alert/Properties/Alert_Properties Alert_layoutDirection_direction_rtl_with_alertIcon Passed  
     [java] components/Alert/Styles/Alert_Styles Alert_letterSpacing Passed  
     [java] components/Alert/Styles/Alert_Styles Alert_buttonStyleName Passed  
     [java] components/Alert/Styles/Alert_Styles Alert_messageStyleName Passed  
     [java] components/Alert/Styles/Alert_Styles Alert_titleStyleName Passed  
     [java] components/Alert/Styles/Alert_Styles Alert_embedded_font_verdana Passed  
     [java] components/Alert/Styles/Alert_Styles Alert_embedded_font_verdana_italic Passed  
     [java] components/Alert/Styles/Alert_Styles Alert_embedded_font_verdana_bold Passed  
     [java] gumbo/components/Application/properties/Application_Properties Application_Properties_skin_test7 Passed  
     [java] gumbo/components/Image/styles/Image_styles_smoothingQuality Image_Scale_stretch_smoothingQuality_high Passed  
     [java] itemRenderers/Halo/List/test_scripts/List_itemEditor DateFieldItemEditor_Scrolling Passed  
     [java] itemRenderers/Halo/List/test_scripts/List_itemRenderer DateFieldRenderer_Scrolling Passed  
     [java] itemRenderers/Spark/List/test_scripts/List_itemRenderer_spark DateFieldRenderer_Scrolling Passed  
     [java] mx/controls/MovieClipSWFLoader/methods/MovieClipSWFLoader_Methods MovieClipSWFLoader_prevScene_beginning Passed  
     [java] resources/ResourceManager/Integration/ResourceManager_Integration_UIComponent_resourcesChanged ResourceManager_Integration_UIComponent_resourcesChanged_localeChain Passed  
     [java] =====================================================
     [java] 	Failed: 
     [java] =====================================================
     [java] spark/validators/CurrencyValidator/Methods/CV_validate_error_message_localized_tester CV_errorTip_custom_parseError_invalid_buttonTrig_29 Failed AssertPropertyValue%28body%3Astep%205%29%20%20uiCustomComp.uiTI.errorString%20Currency%20name%20is%20repeated%20or%20not%20correct.%20%21=%20%u8FD9%u662F%u4E2A%u4E2D%u6587%u7684%u9519%u8BEF%u6587%u672C%21%21%21 
     [java] 
     [java] 
     [java] =====================================================
     [java]     Passes: 15
     [java]     Fails: 1
     [java] =====================================================
     [java] 
     [java] 
     [java] Wrote summary to results.txt
     [java] Wrote failures to failures.txt

BUILD FAILED
C:\jenkins_slave\workspace\flex-sdk_mustella\mustella\build.xml:1538: The following error occurred while executing this line:
C:\jenkins_slave\workspace\flex-sdk_mustella\mustella\build.xml:1656: Java returned: 1

Total time: 431 minutes 21 seconds



============ JENKINS MUSTELLA RUN REPORT ============

Date and time: 01-23-2014 02:55

Settings:
player.version = 11.9
air.version = 3.9
FLASHPLAYER_DEBUGGER = C:\ApacheFlex\dependencies\FlashPlayer_Debug\flashplayer11-9_debugsa_win_32.exe
AIR_HOME = C:\ApacheFlex\dependencies\AdobeAIRSDK\3.9

Build: 
  type = main
  command = -timeout=60000
  set = -all

Log:
- Made Cygwin ignore carriage returns
- Cleaned up 'local.properties' files from previous runs
- Set FLASH_VERSION to '11.9' and AIR_VERSION to '3.9'
- Set AIR_HOME to 'C:\ApacheFlex\dependencies\AdobeAIRSDK\3.9'
- Set FLASHPLAYER_DEBUGGER to 'C:\ApacheFlex\dependencies\FlashPlayer_Debug\flashplayer11-9_debugsa_win_32.exe'
- Ran 'clean', 'main' and 'other.locales' ant targets to prepare the SDK for testing
- Ran Mustella on the SDK with these parameters: '-timeout=60000 -all'
- Some tests failed: running '-failures'
- Some of tests failed, even after running '-failures'...


=====================================================



Build step 'Execute shell' marked build as failure
Email was triggered for: Always
Sending email for trigger: Always

flex-sdk_mustella - Build # 77 - Still Failing!

Posted by bi...@gmail.com.
flex-sdk_mustella - Build # 77 - Still Failing:

http://bigosmallm.cloudapp.net:8080/job/flex-sdk_mustella/77/

Changes for Build #67
[jmclean] remove try catch to improve performance. ADG tests pass.

[jmclean] make catch block empty to improve performance

[jmclean] make catch block empty to improve performance

[jmclean] make catch block empty to improve performance

[jmclean] FLEX-34019 stop combo box from staying open

[jmclean] changed private to protected

[jmclean] made code constant in both classes

[jmclean] CXForm add toString method

[jmclean] remove try and catch to improve performance

[jmclean] FLEX-33913 fix for lists getting mixed up

[jmclean] added helpful comment about compiler generating skin parts

[aharui] add imagediff target that compiles and runs the imagediff tool

[aharui] tidy up the pb release packaging


Changes for Build #68

Changes for Build #69
[jmclean] fix for RTE in mustella tests

[aharui] add rat task for general purpose ratting

[aharui] attempt to fix build

[fthomas] FLEX-26768  When debugging multi-module projects impossible to set breakpoint if there are

[fthomas] FLEX-34046: prints full stack if Flash Player detects not handled exception

[fthomas] FLEX-34045: adds file id to the stack info printed by fdb

[fthomas] FLEX-34043: Impossible to set breakpoint in MXML files that contains item renderer.

[maurice.amsellem] FIXED - FLEX-34038 Mobilegrid overflow

[jmclean] Update to release versions of AIR 4.0 and Flash Player 12.0

[jmclean] update with recent changes

[jmclean] updated year to 2014

[jmclean] Update default year to 2104


Changes for Build #70
[fthomas] FLEX-34049: Allow the ouput symbols to be escaped when called from an IDE


Changes for Build #71
[jmclean] FLEX-34051 fix for RTE


Changes for Build #72
[aharui] only sign zips and tar.gz files

[aharui] fix failing tests.  It appears the tests were not operating correctly and now are

[jmclean] FLEX-34052 added guard for RTE


Changes for Build #73
[aharui] update main keys file with my new key

[aharui] switch over to official release of pixelbender bits

[aharui] using enum as variable name caused issues in Java 7 compiler

[carlosrovira] FLEX-34053 - New MaskedTextinput in experimental library


Changes for Build #74

Changes for Build #75
[carlosrovira] FLEX-34053 - avoid copy operation remove all text in maskedtextinput


Changes for Build #76

Changes for Build #77


--------------------------------

Started by timer
[EnvInject] - Loading node environment variables.
Building remotely on WindowsSlave-bigosmallm in workspace c:\jenkins_slave\workspace\flex-sdk_mustella
Fetching changes from the remote Git repository
Fetching upstream changes from https://git-wip-us.apache.org/repos/asf/flex-sdk.git
Checking out Revision ab14cf9f8d65f23fdd4c21d15834859bcd346f38 (origin/develop)
FATAL: Could not checkout null with start point ab14cf9f8d65f23fdd4c21d15834859bcd346f38
hudson.plugins.git.GitException: Could not checkout null with start point ab14cf9f8d65f23fdd4c21d15834859bcd346f38
	at org.jenkinsci.plugins.gitclient.CliGitAPIImpl.checkoutBranch(CliGitAPIImpl.java:1090)
	at sun.reflect.NativeMethodAccessorImpl.invoke0(Native Method)
	at sun.reflect.NativeMethodAccessorImpl.invoke(Unknown Source)
	at sun.reflect.DelegatingMethodAccessorImpl.invoke(Unknown Source)
	at java.lang.reflect.Method.invoke(Unknown Source)
	at hudson.remoting.RemoteInvocationHandler$RPCRequest.perform(RemoteInvocationHandler.java:299)
	at hudson.remoting.RemoteInvocationHandler$RPCRequest.call(RemoteInvocationHandler.java:280)
	at hudson.remoting.RemoteInvocationHandler$RPCRequest.call(RemoteInvocationHandler.java:239)
	at hudson.remoting.UserRequest.perform(UserRequest.java:118)
	at hudson.remoting.UserRequest.perform(UserRequest.java:48)
	at hudson.remoting.Request$2.run(Request.java:328)
	at hudson.remoting.InterceptingExecutorService$1.call(InterceptingExecutorService.java:72)
	at java.util.concurrent.FutureTask$Sync.innerRun(Unknown Source)
	at java.util.concurrent.FutureTask.run(Unknown Source)
	at java.util.concurrent.ThreadPoolExecutor$Worker.runTask(Unknown Source)
	at java.util.concurrent.ThreadPoolExecutor$Worker.run(Unknown Source)
	at hudson.remoting.Engine$1$1.run(Engine.java:63)
	at java.lang.Thread.run(Unknown Source)
Caused by: hudson.plugins.git.GitException: Command "checkout -f ab14cf9f8d65f23fdd4c21d15834859bcd346f38" returned status code 1:
stdout: 
stderr: error: unable to create file mustella/jenkins.sh (Permission denied)
HEAD is now at ab14cf9... FLEX-34053 - avoid copy operation remove all text in maskedtextinput

	at org.jenkinsci.plugins.gitclient.CliGitAPIImpl.launchCommandIn(CliGitAPIImpl.java:981)
	at org.jenkinsci.plugins.gitclient.CliGitAPIImpl.launchCommandIn(CliGitAPIImpl.java:961)
	at org.jenkinsci.plugins.gitclient.CliGitAPIImpl.launchCommandIn(CliGitAPIImpl.java:957)
	at org.jenkinsci.plugins.gitclient.CliGitAPIImpl.launchCommand(CliGitAPIImpl.java:877)
	at org.jenkinsci.plugins.gitclient.CliGitAPIImpl.launchCommand(CliGitAPIImpl.java:887)
	at org.jenkinsci.plugins.gitclient.CliGitAPIImpl.checkout(CliGitAPIImpl.java:1067)
	at hudson.plugins.git.GitAPI.checkout(GitAPI.java:207)
	at org.jenkinsci.plugins.gitclient.CliGitAPIImpl.checkoutBranch(CliGitAPIImpl.java:1077)
	... 17 more

flex-sdk_mustella - Build # 76 - Failure!

Posted by bi...@gmail.com.
flex-sdk_mustella - Build # 76 - Failure:

http://bigosmallm.cloudapp.net:8080/job/flex-sdk_mustella/76/

Changes for Build #66

Changes for Build #67
[jmclean] remove try catch to improve performance. ADG tests pass.

[jmclean] make catch block empty to improve performance

[jmclean] make catch block empty to improve performance

[jmclean] make catch block empty to improve performance

[jmclean] FLEX-34019 stop combo box from staying open

[jmclean] changed private to protected

[jmclean] made code constant in both classes

[jmclean] CXForm add toString method

[jmclean] remove try and catch to improve performance

[jmclean] FLEX-33913 fix for lists getting mixed up

[jmclean] added helpful comment about compiler generating skin parts

[aharui] add imagediff target that compiles and runs the imagediff tool

[aharui] tidy up the pb release packaging


Changes for Build #68

Changes for Build #69
[jmclean] fix for RTE in mustella tests

[aharui] add rat task for general purpose ratting

[aharui] attempt to fix build

[fthomas] FLEX-26768  When debugging multi-module projects impossible to set breakpoint if there are

[fthomas] FLEX-34046: prints full stack if Flash Player detects not handled exception

[fthomas] FLEX-34045: adds file id to the stack info printed by fdb

[fthomas] FLEX-34043: Impossible to set breakpoint in MXML files that contains item renderer.

[maurice.amsellem] FIXED - FLEX-34038 Mobilegrid overflow

[jmclean] Update to release versions of AIR 4.0 and Flash Player 12.0

[jmclean] update with recent changes

[jmclean] updated year to 2014

[jmclean] Update default year to 2104


Changes for Build #70
[fthomas] FLEX-34049: Allow the ouput symbols to be escaped when called from an IDE


Changes for Build #71
[jmclean] FLEX-34051 fix for RTE


Changes for Build #72
[aharui] only sign zips and tar.gz files

[aharui] fix failing tests.  It appears the tests were not operating correctly and now are

[jmclean] FLEX-34052 added guard for RTE


Changes for Build #73
[aharui] update main keys file with my new key

[aharui] switch over to official release of pixelbender bits

[aharui] using enum as variable name caused issues in Java 7 compiler

[carlosrovira] FLEX-34053 - New MaskedTextinput in experimental library


Changes for Build #74

Changes for Build #75
[carlosrovira] FLEX-34053 - avoid copy operation remove all text in maskedtextinput


Changes for Build #76


--------------------------------

Started by timer
Started by timer
Started by timer
Started by timer
Started by timer
[EnvInject] - Loading node environment variables.
Building remotely on WindowsSlave-bigosmallm in workspace c:\jenkins_slave\workspace\flex-sdk_mustella
Fetching changes from the remote Git repository
Fetching upstream changes from https://git-wip-us.apache.org/repos/asf/flex-sdk.git
Checking out Revision ab14cf9f8d65f23fdd4c21d15834859bcd346f38 (origin/develop)
FATAL: Could not checkout null with start point ab14cf9f8d65f23fdd4c21d15834859bcd346f38
hudson.plugins.git.GitException: Could not checkout null with start point ab14cf9f8d65f23fdd4c21d15834859bcd346f38
	at org.jenkinsci.plugins.gitclient.CliGitAPIImpl.checkoutBranch(CliGitAPIImpl.java:1090)
	at sun.reflect.NativeMethodAccessorImpl.invoke0(Native Method)
	at sun.reflect.NativeMethodAccessorImpl.invoke(Unknown Source)
	at sun.reflect.DelegatingMethodAccessorImpl.invoke(Unknown Source)
	at java.lang.reflect.Method.invoke(Unknown Source)
	at hudson.remoting.RemoteInvocationHandler$RPCRequest.perform(RemoteInvocationHandler.java:299)
	at hudson.remoting.RemoteInvocationHandler$RPCRequest.call(RemoteInvocationHandler.java:280)
	at hudson.remoting.RemoteInvocationHandler$RPCRequest.call(RemoteInvocationHandler.java:239)
	at hudson.remoting.UserRequest.perform(UserRequest.java:118)
	at hudson.remoting.UserRequest.perform(UserRequest.java:48)
	at hudson.remoting.Request$2.run(Request.java:328)
	at hudson.remoting.InterceptingExecutorService$1.call(InterceptingExecutorService.java:72)
	at java.util.concurrent.FutureTask$Sync.innerRun(Unknown Source)
	at java.util.concurrent.FutureTask.run(Unknown Source)
	at java.util.concurrent.ThreadPoolExecutor$Worker.runTask(Unknown Source)
	at java.util.concurrent.ThreadPoolExecutor$Worker.run(Unknown Source)
	at hudson.remoting.Engine$1$1.run(Engine.java:63)
	at java.lang.Thread.run(Unknown Source)
Caused by: hudson.plugins.git.GitException: Command "checkout -f ab14cf9f8d65f23fdd4c21d15834859bcd346f38" returned status code 1:
stdout: 
stderr: error: unable to create file mustella/jenkins.sh (Permission denied)
HEAD is now at ab14cf9... FLEX-34053 - avoid copy operation remove all text in maskedtextinput

	at org.jenkinsci.plugins.gitclient.CliGitAPIImpl.launchCommandIn(CliGitAPIImpl.java:981)
	at org.jenkinsci.plugins.gitclient.CliGitAPIImpl.launchCommandIn(CliGitAPIImpl.java:961)
	at org.jenkinsci.plugins.gitclient.CliGitAPIImpl.launchCommandIn(CliGitAPIImpl.java:957)
	at org.jenkinsci.plugins.gitclient.CliGitAPIImpl.launchCommand(CliGitAPIImpl.java:877)
	at org.jenkinsci.plugins.gitclient.CliGitAPIImpl.launchCommand(CliGitAPIImpl.java:887)
	at org.jenkinsci.plugins.gitclient.CliGitAPIImpl.checkout(CliGitAPIImpl.java:1067)
	at hudson.plugins.git.GitAPI.checkout(GitAPI.java:207)
	at org.jenkinsci.plugins.gitclient.CliGitAPIImpl.checkoutBranch(CliGitAPIImpl.java:1077)
	... 17 more

flex-sdk_mustella - Build # 75 - Aborted!

Posted by bi...@gmail.com.
flex-sdk_mustella - Build # 75 - Aborted:

http://bigosmallm.cloudapp.net:8080/job/flex-sdk_mustella/75/

Changes for Build #65
[jmclean] FLEX-33836 lazy loading of resource files give performance improvement (esp mobile)


Changes for Build #66

Changes for Build #67
[jmclean] remove try catch to improve performance. ADG tests pass.

[jmclean] make catch block empty to improve performance

[jmclean] make catch block empty to improve performance

[jmclean] make catch block empty to improve performance

[jmclean] FLEX-34019 stop combo box from staying open

[jmclean] changed private to protected

[jmclean] made code constant in both classes

[jmclean] CXForm add toString method

[jmclean] remove try and catch to improve performance

[jmclean] FLEX-33913 fix for lists getting mixed up

[jmclean] added helpful comment about compiler generating skin parts

[aharui] add imagediff target that compiles and runs the imagediff tool

[aharui] tidy up the pb release packaging


Changes for Build #68

Changes for Build #69
[jmclean] fix for RTE in mustella tests

[aharui] add rat task for general purpose ratting

[aharui] attempt to fix build

[fthomas] FLEX-26768  When debugging multi-module projects impossible to set breakpoint if there are

[fthomas] FLEX-34046: prints full stack if Flash Player detects not handled exception

[fthomas] FLEX-34045: adds file id to the stack info printed by fdb

[fthomas] FLEX-34043: Impossible to set breakpoint in MXML files that contains item renderer.

[maurice.amsellem] FIXED - FLEX-34038 Mobilegrid overflow

[jmclean] Update to release versions of AIR 4.0 and Flash Player 12.0

[jmclean] update with recent changes

[jmclean] updated year to 2014

[jmclean] Update default year to 2104


Changes for Build #70
[fthomas] FLEX-34049: Allow the ouput symbols to be escaped when called from an IDE


Changes for Build #71
[jmclean] FLEX-34051 fix for RTE


Changes for Build #72
[aharui] only sign zips and tar.gz files

[aharui] fix failing tests.  It appears the tests were not operating correctly and now are

[jmclean] FLEX-34052 added guard for RTE


Changes for Build #73
[aharui] update main keys file with my new key

[aharui] switch over to official release of pixelbender bits

[aharui] using enum as variable name caused issues in Java 7 compiler

[carlosrovira] FLEX-34053 - New MaskedTextinput in experimental library


Changes for Build #74

Changes for Build #75
[carlosrovira] FLEX-34053 - avoid copy operation remove all text in maskedtextinput



--------------------------------

[...truncated 13562 lines...]
     [java] 
     [java] C:\jenkins_slave\workspace\flex-sdk_mustella\mustella\tests\States\Flex3Syntax\RemoveChild\Properties\RemoveChild_Properties.mxml(88): Warning: 'application' has been deprecated since 4.0.  Please use 'FlexGlobals.topLevelApplication'.
     [java] 
     [java]                 <RunCode code="Application.application.oldChildren = Application.application.getChildren()" />
     [java] 
     [java] C:\jenkins_slave\workspace\flex-sdk_mustella\mustella\tests\States\Flex3Syntax\RemoveChild\Properties\RemoveChild_Properties.mxml(89): Warning: 'application' has been deprecated since 4.0.  Please use 'FlexGlobals.topLevelApplication'.
     [java] 
     [java]                 <SetProperty target="{Application.application}" propertyName="currentState" value="RemoveChild_03" waitTarget="{Application.application}" waitEvent="currentStateChange" />
     [java] 
     [java] C:\jenkins_slave\workspace\flex-sdk_mustella\mustella\tests\States\Flex3Syntax\RemoveChild\Properties\RemoveChild_Properties.mxml(90): Warning: 'application' has been deprecated since 4.0.  Please use 'FlexGlobals.topLevelApplication'.
     [java] 
     [java]                 <AssertMethodValue method="value = Application.application.confirmChildRemoval(Application.application.box1)" value="true" />
     [java] 
     [java] C:\jenkins_slave\workspace\flex-sdk_mustella\mustella\tests\States\Flex3Syntax\RemoveChild\Properties\RemoveChild_Properties.mxml(91): Warning: 'application' has been deprecated since 4.0.  Please use 'FlexGlobals.topLevelApplication'.
     [java] 
     [java]                 <AssertMethodValue method="value = Application.application.confirmChildRemoval(Application.application.btn4, Application.application.box1)" value="false" />
     [java] C:\jenkins_slave\workspace\flex-sdk_mustella\mustella\tests\gumbo\components\SkinnableDataContainer\swfs\FxDataContainer_StatesIntegration.swf (1322382 bytes)
     [java] 
     [java] C:\jenkins_slave\workspace\flex-sdk_mustella\mustella\tests\States\Flex3Syntax\RemoveChild\Properties\RemoveChild_Properties.mxml(92): Warning: 'application' has been deprecated since 4.0.  Please use 'FlexGlobals.topLevelApplication'.
     [java] 
     [java]                 <AssertMethodValue method="value = Application.application.confirmChildRemoval(Application.application.btn5, Application.application.box1)" value="false" />
     [java] 
     [java] C:\jenkins_slave\workspace\flex-sdk_mustella\mustella\tests\States\Flex3Syntax\RemoveChild\Properties\RemoveChild_Properties.mxml(93): Warning: 'application' has been deprecated since 4.0.  Please use 'FlexGlobals.topLevelApplication'.
     [java] 
     [java]                 <AssertMethodValue method="value = Application.application.confirmChildRemoval(Application.application.btn6, Application.application.box1)" value="false" />
     [java] 
     [java] C:\jenkins_slave\workspace\flex-sdk_mustella\mustella\tests\gumbo\components\Application\SWFs\Application_Styles_App2.swf (717199 bytes)
     [java] Choosing local runner bitmap save
     [java] okey doke, going to compile C:\jenkins_slave\workspace\flex-sdk_mustella\mustella\tests\spark\formatters\DateTimeFormatter\SWFs\DF_getFirstWeekday_Main.mxml
     [java] C:\jenkins_slave\workspace\flex-sdk_mustella\mustella\tests\States\Flex3Syntax\RemoveChild\SWFs\RemoveChildApp01.swf (943617 bytes)
     [java] Choosing local runner bitmap save
     [java] okey doke, going to compile C:\jenkins_slave\workspace\flex-sdk_mustella\mustella\tests\PerModuleStyles\SWFs\MergedCSSDeclarationApp.mxml
     [java] Loading configuration file C:\jenkins_slave\workspace\flex-sdk_mustella\frameworks\flex-config.xml
     [java] Loading configuration file C:\jenkins_slave\workspace\flex-sdk_mustella\frameworks\flex-config.xml
     [java] Choosing local runner bitmap save
     [java] okey doke, going to compile C:\jenkins_slave\workspace\flex-sdk_mustella\mustella\tests\SparkModules\Fonts\SWFs\TLFAppUsingFontFromModule.mxml
     [java] Loading configuration file C:\jenkins_slave\workspace\flex-sdk_mustella\frameworks\flex-config.xml
     [java] C:\jenkins_slave\workspace\flex-sdk_mustella\mustella\tests\spark\formatters\CurrencyFormatter\SWFs\CF_locale_inheritance_global.swf (696567 bytes)
     [java] Choosing local runner bitmap save
     [java] okey doke, going to compile C:\jenkins_slave\workspace\flex-sdk_mustella\mustella\tests\Application\Application_HaloSkin\SWFs\FixedApplication_Halo.mxml
     [java] Loading configuration file C:\jenkins_slave\workspace\flex-sdk_mustella\frameworks\flex-config.xml
     [java] C:\jenkins_slave\workspace\flex-sdk_mustella\mustella\tests\spark\formatters\DateTimeFormatter\SWFs\DF_getFirstWeekday_Main.swf (676901 bytes)
     [java] Choosing local runner bitmap save
     [java] okey doke, going to compile C:\jenkins_slave\workspace\flex-sdk_mustella\mustella\tests\gumbo\components\ListDragDrop\SWFs\Spark_HListIconsBasic.mxml
     [java] Loading configuration file C:\jenkins_slave\workspace\flex-sdk_mustella\frameworks\flex-config.xml
     [java] C:\jenkins_slave\workspace\flex-sdk_mustella\mustella\tests\Application\Application_HaloSkin\SWFs\FixedApplication_Halo.swf (622706 bytes)
     [java] Choosing local runner bitmap save
     [java] okey doke, going to compile C:\jenkins_slave\workspace\flex-sdk_mustella\mustella\tests\gumbo\layout\TileLayout\SWFs\TileLayoutApp2_states.mxml
     [java] Loading configuration file C:\jenkins_slave\workspace\flex-sdk_mustella\frameworks\flex-config.xml
     [java] C:\jenkins_slave\workspace\flex-sdk_mustella\mustella\tests\SparkModules\Fonts\SWFs\TLFAppUsingFontFromModule.swf (1984300 bytes)
     [java] Choosing local runner bitmap save
     [java] okey doke, going to compile C:\jenkins_slave\workspace\flex-sdk_mustella\mustella\tests\spark\effects\AnimateTransform\SWFs\../SWFs/AnimateTransform_translationX_main.mxml
     [java] Loading configuration file C:\jenkins_slave\workspace\flex-sdk_mustella\frameworks\flex-config.xml
     [java] C:\jenkins_slave\workspace\flex-sdk_mustella\mustella\tests\PerModuleStyles\SWFs\MergedCSSDeclarationApp.swf (2269238 bytes)
     [java] Choosing local runner bitmap save
     [java] okey doke, going to compile C:\jenkins_slave\workspace\flex-sdk_mustella\mustella\tests\spark\components\Form\SWFs\StackedForm_main.mxml
     [java] Loading configuration file C:\jenkins_slave\workspace\flex-sdk_mustella\frameworks\flex-config.xml
     [java] C:\jenkins_slave\workspace\flex-sdk_mustella\mustella\tests\gumbo\layout\TileLayout\SWFs\TileLayoutApp2_states.mxml(61): Warning: The CSS type selector 'spark.components.Button' was not processed, because the type was not used in the application.
     [java] 
     [java]     s|Button{
     [java] 
     [java] C:\jenkins_slave\workspace\flex-sdk_mustella\mustella\tests\gumbo\layout\TileLayout\SWFs\TileLayoutApp2_states.mxml(67): Warning: The CSS type selector 'spark.components.Label' was not processed, because the type was not used in the application.
     [java] 
     [java]     s|Label{
     [java] 
     [java] C:\jenkins_slave\workspace\flex-sdk_mustella\mustella\tests\gumbo\layout\TileLayout\SWFs\TileLayoutApp2_states.swf (851409 bytes)
     [java] Choosing local runner bitmap save
     [java] okey doke, going to compile C:\jenkins_slave\workspace\flex-sdk_mustella\mustella\tests\gumbo\layout\TileLayout\SWFs\TileLayoutApp4_list.mxml
     [java] Loading configuration file C:\jenkins_slave\workspace\flex-sdk_mustella\frameworks\flex-config.xml
     [java] C:\jenkins_slave\workspace\flex-sdk_mustella\mustella\tests\spark\effects\AnimateTransform\SWFs\AnimateTransform_translationX_main.swf (750793 bytes)
     [java] Choosing local runner bitmap save
     [java] okey doke, going to compile C:\jenkins_slave\workspace\flex-sdk_mustella\mustella\tests\containers\DividedBox\SWFs\DivBoxMain_spark.mxml
     [java] Loading configuration file C:\jenkins_slave\workspace\flex-sdk_mustella\frameworks\flex-config.xml
     [java] C:\jenkins_slave\workspace\flex-sdk_mustella\mustella\tests\gumbo\components\ListDragDrop\swfs\Spark_HListIconsBasic.swf (1600376 bytes)
     [java] Choosing local runner bitmap save
     [java] okey doke, going to compile C:\jenkins_slave\workspace\flex-sdk_mustella\mustella\tests\containers\FormItem\SWFs\FormItem_Percents_spark.mxml
     [java] Loading configuration file C:\jenkins_slave\workspace\flex-sdk_mustella\frameworks\flex-config.xml
     [java] C:\jenkins_slave\workspace\flex-sdk_mustella\mustella\tests\gumbo\layout\TileLayout\SWFs\TileLayoutApp4_list.swf (980932 bytes)
     [java] Choosing local runner bitmap save
     [java] okey doke, going to compile C:\jenkins_slave\workspace\flex-sdk_mustella\mustella\tests\spark\collections\Sort\SWFs\SF_mxList.mxml
     [java] Loading configuration file C:\jenkins_slave\workspace\flex-sdk_mustella\frameworks\flex-config.xml
     [java] C:\jenkins_slave\workspace\flex-sdk_mustella\mustella\tests\spark\components\Form\Properties\StackedForm_properties_tester.mxml(43): Warning: variable 'hlayout' has no type declaration.
     [java] 
     [java] 		private var hlayout = new HorizontalLayout();
     [java] 
     [java] C:\jenkins_slave\workspace\flex-sdk_mustella\mustella\tests\spark\components\Form\SWFs\StackedForm_main.mxml(105): Warning: The CSS type selector 'mx.containers.Panel' was not processed, because the type was not used in the application.
     [java] 
     [java] 		mx|Panel, mx|NumericStepper, mx|List, mx|TextArea, mx|TextInput, mx|TabNavigator, mx|DateChooser, mx|ToolTip, mx|Label{
     [java] 
     [java] C:\jenkins_slave\workspace\flex-sdk_mustella\mustella\tests\spark\components\Form\SWFs\StackedForm_main.mxml(105): Warning: The CSS type selector 'mx.controls.NumericStepper' was not processed, because the type was not used in the application.
     [java] 
     [java] 		mx|Panel, mx|NumericStepper, mx|List, mx|TextArea, mx|TextInput, mx|TabNavigator, mx|DateChooser, mx|ToolTip, mx|Label{
     [java] 
     [java] C:\jenkins_slave\workspace\flex-sdk_mustella\mustella\tests\spark\components\Form\SWFs\StackedForm_main.mxml(105): Warning: The CSS type selector 'mx.controls.List' was not processed, because the type was not used in the application.
     [java] 
     [java] 		mx|Panel, mx|NumericStepper, mx|List, mx|TextArea, mx|TextInput, mx|TabNavigator, mx|DateChooser, mx|ToolTip, mx|Label{
     [java] 
     [java] C:\jenkins_slave\workspace\flex-sdk_mustella\mustella\tests\spark\components\Form\SWFs\StackedForm_main.mxml(105): Warning: The CSS type selector 'mx.controls.TextArea' was not processed, because the type was not used in the application.
     [java] 
     [java] 		mx|Panel, mx|NumericStepper, mx|List, mx|TextArea, mx|TextInput, mx|TabNavigator, mx|DateChooser, mx|ToolTip, mx|Label{
     [java] 
     [java] C:\jenkins_slave\workspace\flex-sdk_mustella\mustella\tests\spark\components\Form\SWFs\StackedForm_main.mxml(105): Warning: The CSS type selector 'mx.controls.TextInput' was not processed, because the type was not used in the application.
     [java] 
     [java] 		mx|Panel, mx|NumericStepper, mx|List, mx|TextArea, mx|TextInput, mx|TabNavigator, mx|DateChooser, mx|ToolTip, mx|Label{
     [java] 
     [java] C:\jenkins_slave\workspace\flex-sdk_mustella\mustella\tests\spark\components\Form\SWFs\StackedForm_main.mxml(105): Warning: The CSS type selector 'mx.containers.TabNavigator' was not processed, because the type was not used in the application.
     [java] 
     [java] 		mx|Panel, mx|NumericStepper, mx|List, mx|TextArea, mx|TextInput, mx|TabNavigator, mx|DateChooser, mx|ToolTip, mx|Label{
     [java] 
     [java] C:\jenkins_slave\workspace\flex-sdk_mustella\mustella\tests\spark\components\Form\SWFs\StackedForm_main.mxml(105): Warning: The CSS type selector 'mx.controls.DateChooser' was not processed, because the type was not used in the application.
     [java] 
     [java] 		mx|Panel, mx|NumericStepper, mx|List, mx|TextArea, mx|TextInput, mx|TabNavigator, mx|DateChooser, mx|ToolTip, mx|Label{
     [java] 
     [java] C:\jenkins_slave\workspace\flex-sdk_mustella\mustella\tests\containers\DividedBox\SWFs\DivBoxMain_spark.swf (801247 bytes)
     [java] C:\jenkins_slave\workspace\flex-sdk_mustella\mustella\tests\spark\components\Form\SWFs\StackedForm_main.swf (2316335 bytes)
     [java] Choosing local runner bitmap save
     [java] okey doke, going to compile C:\jenkins_slave\workspace\flex-sdk_mustella\mustella\tests\gumbo\components\ButtonBar\SWFs\ButtonBar_mirroring.mxml
     [java] Choosing local runner bitmap save
     [java] okey doke, going to compile C:\jenkins_slave\workspace\flex-sdk_mustella\mustella\tests\spark\globalization\Collator\SWFs\CLT_locale_inheritance.mxml
     [java] Loading configuration file C:\jenkins_slave\workspace\flex-sdk_mustella\frameworks\flex-config.xml
     [java] Loading configuration file C:\jenkins_slave\workspace\flex-sdk_mustella\frameworks\flex-config.xml
     [java] C:\jenkins_slave\workspace\flex-sdk_mustella\mustella\tests\containers\FormItem\SWFs\FormItem_Percents_spark.swf (1395557 bytes)
     [java] C:\jenkins_slave\workspace\flex-sdk_mustella\mustella\tests\spark\collections\Sort\SWFs\SF_mxList.swf (954675 bytes)
     [java] Choosing local runner bitmap save
     [java] okey doke, going to compile C:\jenkins_slave\workspace\flex-sdk_mustella\mustella\tests\mx\utils\MediaQueryParser\SWFs\MediaQueryApp.mxml
     [java] Loading configuration file C:\jenkins_slave\workspace\flex-sdk_mustella\frameworks\flex-config.xml
     [java] Choosing local runner bitmap save
     [java] okey doke, going to compile C:\jenkins_slave\workspace\flex-sdk_mustella\mustella\tests\Modules\Constraints\SWFs\FixedModule.mxml
     [java] Loading configuration file C:\jenkins_slave\workspace\flex-sdk_mustella\frameworks\flex-config.xml
     [java] C:\jenkins_slave\workspace\flex-sdk_mustella\mustella\tests\spark\globalization\Collator\SWFs\CLT_locale_inheritance.swf (688900 bytes)
     [java] Choosing local runner bitmap save
     [java] okey doke, going to compile C:\jenkins_slave\workspace\flex-sdk_mustella\mustella\tests\gumbo\components\RichText\SWFs\GraphicTags_TextBitmapGraphic.mxml
     [java] Loading configuration file C:\jenkins_slave\workspace\flex-sdk_mustella\frameworks\flex-config.xml
     [java] C:\jenkins_slave\workspace\flex-sdk_mustella\mustella\tests\mx\utils\MediaQueryParser\swfs\MediaQueryApp.swf (721622 bytes)
     [java] Warning: comps:FixedModuleComp is a module or application that is directly referenced. This will cause comps:FixedModuleComp and all of its dependencies to be linked in with FixedModule. Using an interface is the recommended practice to avoid this.
     [java] 
     [java] Warning: comps:ButtonModuleComp is a module or application that is directly referenced. This will cause comps:ButtonModuleComp and all of its dependencies to be linked in with FixedModule. Using an interface is the recommended practice to avoid this.
     [java] 
     [java] C:\jenkins_slave\workspace\flex-sdk_mustella\mustella\tests\Modules\Constraints\SWFs\FixedModule.swf (598116 bytes)
     [java] Choosing local runner bitmap save
     [java] okey doke, going to compile C:\jenkins_slave\workspace\flex-sdk_mustella\mustella\tests\components\LinkBar\SWFs\LinkBar_InContainer.mxml
     [java] Choosing local runner bitmap save
     [java] okey doke, going to compile C:\jenkins_slave\workspace\flex-sdk_mustella\mustella\tests\gumbo\components\Panel\SWFs\Panel_Mirroring.mxml
     [java] Loading configuration file C:\jenkins_slave\workspace\flex-sdk_mustella\frameworks\flex-config.xml
     [java] C:\jenkins_slave\workspace\flex-sdk_mustella\mustella\tests\gumbo\components\ButtonBar\SWFs\ButtonBar_mirroring.swf (1357523 bytes)
     [java] Loading configuration file C:\jenkins_slave\workspace\flex-sdk_mustella\frameworks\flex-config.xml
     [java] Choosing local runner bitmap save
     [java] okey doke, going to compile C:\jenkins_slave\workspace\flex-sdk_mustella\mustella\tests\Application\Application_HaloSkin\SWFs\Application_ModalTransparencyColor_Test4_Halo.mxml
     [java] Loading configuration file C:\jenkins_slave\workspace\flex-sdk_mustella\frameworks\flex-config.xml
     [java] C:\jenkins_slave\workspace\flex-sdk_mustella\mustella\tests\Application\Application_HaloSkin\Styles\Application_Styles_ModalTransparencyColor_Test4_Halo.mxml(56): Warning: 'application' has been deprecated since 4.0.  Please use 'FlexGlobals.topLevelApplication'.
     [java] 
     [java]             <SetStyle target="{Application.application}" styleName="modalTransparencyColor" value="0xff0000" />
     [java] 
     [java] C:\jenkins_slave\workspace\flex-sdk_mustella\mustella\tests\Application\Application_HaloSkin\Styles\Application_Styles_ModalTransparencyColor_Test4_Halo.mxml(57): Warning: 'application' has been deprecated since 4.0.  Please use 'FlexGlobals.topLevelApplication'.
     [java] 
     [java]             <SetStyle target="{Application.application}" styleName="modalTransparency" value="1" />
     [java] 
     [java] C:\jenkins_slave\workspace\flex-sdk_mustella\mustella\tests\Application\Application_HaloSkin\Styles\Application_Styles_ModalTransparencyColor_Test4_Halo.mxml(58): Warning: 'application' has been deprecated since 4.0.  Please use 'FlexGlobals.topLevelApplication'.
     [java] 
     [java]             <SetStyle target="{Application.application}" styleName="backgroundImage" value="" />
     [java] 
     [java] C:\jenkins_slave\workspace\flex-sdk_mustella\mustella\tests\Application\Application_HaloSkin\Styles\Application_Styles_ModalTransparencyColor_Test4_Halo.mxml(59): Warning: 'application' has been deprecated since 4.0.  Please use 'FlexGlobals.topLevelApplication'.
     [java] 
     [java]             <SetStyle target="{Application.application}" styleName="backgroundColor" value="0xffffff" waitEvent="updateComplete" />
     [java] 
     [java] C:\jenkins_slave\workspace\flex-sdk_mustella\mustella\tests\Application\Application_HaloSkin\Styles\Application_Styles_ModalTransparencyColor_Test4_Halo.mxml(64): Warning: 'application' has been deprecated since 4.0.  Please use 'FlexGlobals.topLevelApplication'.
     [java] 
     [java]             <AssertStyleValue target="{Application.application}" styleName="modalTransparencyColor" value="0xff0000" />
     [java] 
     [java] C:\jenkins_slave\workspace\flex-sdk_mustella\mustella\tests\Application\Application_HaloSkin\SWFs\Application_ModalTransparencyColor_Test4_Halo.swf (850875 bytes)
     [java] C:\jenkins_slave\workspace\flex-sdk_mustella\mustella\tests\gumbo\components\RichText\SWFs\GraphicTags_TextBitmapGraphic.mxml(111): Warning: The CSS type selector 'spark.components.Label' was not processed, because the type was not used in the application.
     [java] 
     [java] 	s|Label {
     [java] 
     [java] Choosing local runner bitmap save
     [java] okey doke, going to compile C:\jenkins_slave\workspace\flex-sdk_mustella\mustella\tests\spark\formatters\NumberFormatter\SWFs\NF_leadingAndTrailingZeros.mxml
     [java] Loading configuration file C:\jenkins_slave\workspace\flex-sdk_mustella\frameworks\flex-config.xml
     [java] C:\jenkins_slave\workspace\flex-sdk_mustella\mustella\tests\gumbo\components\RichText\SWFs\GraphicTags_TextBitmapGraphic.swf (1908104 bytes)
     [java] Choosing local runner bitmap save
     [java] okey doke, going to compile C:\jenkins_slave\workspace\flex-sdk_mustella\mustella\tests\gumbo\components\CheckBox\SWFs\Flex4_CheckBox_styles.mxml
     [java] C:\jenkins_slave\workspace\flex-sdk_mustella\mustella\tests\gumbo\components\Panel\SWFs\Panel_Mirroring.mxml(69): Warning: The CSS type selector 'mx.containers.Accordion' was not processed, because the type was not used in the application.
     [java] 
     [java] 		mx|Accordion,
     [java] 
     [java] C:\jenkins_slave\workspace\flex-sdk_mustella\mustella\tests\gumbo\components\Panel\SWFs\Panel_Mirroring.mxml(70): Warning: The CSS type selector 'mx.controls.RadioButton' was not processed, because the type was not used in the application.
     [java] 
     [java] 		mx|RadioButton,
     [java] 
     [java] C:\jenkins_slave\workspace\flex-sdk_mustella\mustella\tests\gumbo\components\Panel\SWFs\Panel_Mirroring.mxml(71): Warning: The CSS type selector 'mx.controls.CheckBox' was not processed, because the type was not used in the application.
     [java] 
     [java] 		mx|CheckBox,
     [java] 
     [java] C:\jenkins_slave\workspace\flex-sdk_mustella\mustella\tests\gumbo\components\Panel\SWFs\Panel_Mirroring.mxml(72): Warning: The CSS type selector 'mx.controls.List' was not processed, because the type was not used in the application.
     [java] 
     [java] 		mx|List,
     [java] 
     [java] C:\jenkins_slave\workspace\flex-sdk_mustella\mustella\tests\gumbo\components\Panel\SWFs\Panel_Mirroring.mxml(73): Warning: The CSS type selector 'mx.controls.DataGrid' was not processed, because the type was not used in the application.
     [java] 
     [java] 		mx|DataGrid,
     [java] 
     [java] C:\jenkins_slave\workspace\flex-sdk_mustella\mustella\tests\gumbo\components\Panel\SWFs\Panel_Mirroring.mxml(74): Warning: The CSS type selector 'mx.controls.Button' was not processed, because the type was not used in the application.
     [java] 
     [java] 		mx|Button,
     [java] 
     [java] C:\jenkins_slave\workspace\flex-sdk_mustella\mustella\tests\gumbo\components\Panel\SWFs\Panel_Mirroring.mxml(75): Warning: The CSS type selector 'mx.controls.Text' was not processed, because the type was not used in the application.
     [java] 
     [java] 		mx|Text,
     [java] 
     [java] C:\jenkins_slave\workspace\flex-sdk_mustella\mustella\tests\gumbo\components\Panel\SWFs\Panel_Mirroring.mxml(76): Warning: The CSS type selector 'mx.controls.Label' was not processed, because the type was not used in the application.
     [java] 
     [java] 		mx|Label,
     [java] 
     [java] C:\jenkins_slave\workspace\flex-sdk_mustella\mustella\tests\gumbo\components\Panel\SWFs\Panel_Mirroring.mxml(77): Warning: The CSS type selector 'mx.controls.NumericStepper' was not processed, because the type was not used in the application.
     [java] 
     [java] 		mx|NumericStepper,
     [java] 
     [java] C:\jenkins_slave\workspace\flex-sdk_mustella\mustella\tests\components\LinkBar\SWFs\LinkBar_InContainer.swf (1221058 bytes)
     [java] C:\jenkins_slave\workspace\flex-sdk_mustella\mustella\tests\gumbo\components\Panel\SWFs\Panel_Mirroring.swf (1340919 bytes)
     [java] Loading configuration file C:\jenkins_slave\workspace\flex-sdk_mustella\frameworks\flex-config.xml
     [java] Choosing local runner bitmap save
     [java] okey doke, going to compile C:\jenkins_slave\workspace\flex-sdk_mustella\mustella\tests\spark\globalization\Collator\SWFs\CLT_locale_inheritance_global.mxml
     [java] Choosing local runner bitmap save
     [java] okey doke, going to compile C:\jenkins_slave\workspace\flex-sdk_mustella\mustella\tests\gumbo\components\RichEditableText\SWFs\RichEditableText_TLF20Integration.mxml
     [java] Loading configuration file C:\jenkins_slave\workspace\flex-sdk_mustella\frameworks\flex-config.xml
     [java] Loading configuration file C:\jenkins_slave\workspace\flex-sdk_mustella\frameworks\flex-config.xml
     [java] C:\jenkins_slave\workspace\flex-sdk_mustella\mustella\tests\spark\formatters\NumberFormatter\SWFs\NF_leadingAndTrailingZeros.swf (708151 bytes)
     [java] Choosing local runner bitmap save
     [java] okey doke, going to compile C:\jenkins_slave\workspace\flex-sdk_mustella\mustella\tests\mx\styles\AdvancedStyleClient\SWFs\ADV_externalStyle_classTypeCompound_main.mxml
     [java] Loading configuration file C:\jenkins_slave\workspace\flex-sdk_mustella\frameworks\flex-config.xml
     [java] C:\jenkins_slave\workspace\flex-sdk_mustella\mustella\tests\spark\globalization\Collator\SWFs\CLT_locale_inheritance_global.swf (693185 bytes)
     [java] Choosing local runner bitmap save
     [java] okey doke, going to compile C:\jenkins_slave\workspace\flex-sdk_mustella\mustella\tests\gumbo\components\NumericStepper\SWFs\NumericStepper_Mirroring_Basic.mxml
     [java] Loading configuration file C:\jenkins_slave\workspace\flex-sdk_mustella\frameworks\flex-config.xml
     [java] C:\jenkins_slave\workspace\flex-sdk_mustella\mustella\tests\mx\styles\AdvancedStyleClient\SWFs\ADV_externalStyle_classTypeCompound_main.swf (837249 bytes)
     [java] Choosing local runner bitmap save
     [java] okey doke, going to compile C:\jenkins_slave\workspace\flex-sdk_mustella\mustella\tests\containers\TitleWindow\SWFs\TitleWindow_Basic.mxml
     [java] Loading configuration file C:\jenkins_slave\workspace\flex-sdk_mustella\frameworks\flex-config.xml
     [java] C:\jenkins_slave\workspace\flex-sdk_mustella\mustella\tests\gumbo\components\CheckBox\swfs\Flex4_CheckBox_styles.swf (1181823 bytes)
     [java] Choosing local runner bitmap save
     [java] okey doke, going to compile C:\jenkins_slave\workspace\flex-sdk_mustella\mustella\tests\containers\TitleWindow\SWFs\TitleWindow_Mirroring_Basic.mxml
     [java] C:\jenkins_slave\workspace\flex-sdk_mustella\mustella\tests\gumbo\components\RichEditableText\SWFs\RichEditableText_TLF20Integration.swf (1581282 bytes)
     [java] Loading configuration file C:\jenkins_slave\workspace\flex-sdk_mustella\frameworks\flex-config.xml
     [java] Choosing local runner bitmap save
     [java] okey doke, going to compile C:\jenkins_slave\workspace\flex-sdk_mustella\mustella\tests\spark\formatters\NumberFormatter\SWFs\NF_ModuleUsage.mxml
     [java] Loading configuration file C:\jenkins_slave\workspace\flex-sdk_mustella\frameworks\flex-config.xml
Build was aborted
Aborted by Om
Email was triggered for: Always
Sending email for trigger: Always

flex-sdk_mustella - Build # 74 - Still Failing!

Posted by bi...@gmail.com.
flex-sdk_mustella - Build # 74 - Still Failing:

http://bigosmallm.cloudapp.net:8080/job/flex-sdk_mustella/74/

Changes for Build #64
[jmclean] FLEX-33971 removed line from across checkbox

[jmclean] FLEX-33893 CSS memory / performance fix

[jmclean] FLEX-33891 stop getstyleManager being called twice

[jmclean] Changed scale factor to 1.5 of 320 dpi skins rather than 2x 320 dpi skins. Adjusted x and y coordinated to be 1.5x 320 dpi skins.

[jmclean] FLEX-33897 MediaQueryParser memory use improvements

[jmclean] FLEX-33904 memory fix


Changes for Build #65
[jmclean] FLEX-33836 lazy loading of resource files give performance improvement (esp mobile)


Changes for Build #66

Changes for Build #67
[jmclean] remove try catch to improve performance. ADG tests pass.

[jmclean] make catch block empty to improve performance

[jmclean] make catch block empty to improve performance

[jmclean] make catch block empty to improve performance

[jmclean] FLEX-34019 stop combo box from staying open

[jmclean] changed private to protected

[jmclean] made code constant in both classes

[jmclean] CXForm add toString method

[jmclean] remove try and catch to improve performance

[jmclean] FLEX-33913 fix for lists getting mixed up

[jmclean] added helpful comment about compiler generating skin parts

[aharui] add imagediff target that compiles and runs the imagediff tool

[aharui] tidy up the pb release packaging


Changes for Build #68

Changes for Build #69
[jmclean] fix for RTE in mustella tests

[aharui] add rat task for general purpose ratting

[aharui] attempt to fix build

[fthomas] FLEX-26768  When debugging multi-module projects impossible to set breakpoint if there are

[fthomas] FLEX-34046: prints full stack if Flash Player detects not handled exception

[fthomas] FLEX-34045: adds file id to the stack info printed by fdb

[fthomas] FLEX-34043: Impossible to set breakpoint in MXML files that contains item renderer.

[maurice.amsellem] FIXED - FLEX-34038 Mobilegrid overflow

[jmclean] Update to release versions of AIR 4.0 and Flash Player 12.0

[jmclean] update with recent changes

[jmclean] updated year to 2014

[jmclean] Update default year to 2104


Changes for Build #70
[fthomas] FLEX-34049: Allow the ouput symbols to be escaped when called from an IDE


Changes for Build #71
[jmclean] FLEX-34051 fix for RTE


Changes for Build #72
[aharui] only sign zips and tar.gz files

[aharui] fix failing tests.  It appears the tests were not operating correctly and now are

[jmclean] FLEX-34052 added guard for RTE


Changes for Build #73
[aharui] update main keys file with my new key

[aharui] switch over to official release of pixelbender bits

[aharui] using enum as variable name caused issues in Java 7 compiler

[carlosrovira] FLEX-34053 - New MaskedTextinput in experimental library


Changes for Build #74


--------------------------------

[...truncated 171150 lines...]
     [java] USING directory: C:\jenkins_slave\workspace\flex-sdk_mustella\mustella\tests\spark\validators\NumberValidator\SWFs
     [java] time: 22:14:21.968
     [java] waited 2000
     [java] ClobberProcess, it was already null
     [java] SCRIPTDONE! 22:14:25.027
     [java] GET /ScriptComplete?0 HTTP/1.1
     [java] Before Wait loop 22:14:25.027 waiting = 0
     [java] After Wait loop 22:14:25.027 waiting = 0
     [java] clobberProcess false
     [java] Total Results so far: 7
     [java] waited 1900
     [java] ClobberProcess, it was already null
     [java] Grab log, do parse = false
     [java] Grabbing the log from: C:\Users\apacheflex\Application Data\Macromedia/Flash Player/Logs/flashlog.txt to: C:\jenkins_slave\workspace\flex-sdk_mustella\mustella\tests\spark\validators\NumberValidator\SWFs\NV_minValue_Main.log
     [java] Skipping: C:\jenkins_slave\workspace\flex-sdk_mustella\mustella\tests\spark\validators\NumberValidator\SWFs\NV_negativeNumberFormat_Main.lnk.xml
     [java] Skipping: C:\jenkins_slave\workspace\flex-sdk_mustella\mustella\tests\spark\validators\NumberValidator\SWFs\NV_negativeNumberFormat_Main.mxml
     [java] new test file: C:\jenkins_slave\workspace\flex-sdk_mustella\mustella\tests\spark\validators\NumberValidator\SWFs\NV_negativeNumberFormat_Main.swf
     [java] ******** cmdArr before: 
     [java] 	C:\ApacheFlex\dependencies\FlashPlayer_Debug\flashplayer12-0_debugsa_win_32.exe
     [java] 	C:\jenkins_slave\workspace\flex-sdk_mustella\mustella\tests\spark\validators\NumberValidator\SWFs\NV_negativeNumberFormat_Main.swf
     [java] ******** moreParameters before: 
     [java] ******** cmdArr after: 
     [java] 	C:\ApacheFlex\dependencies\FlashPlayer_Debug\flashplayer12-0_debugsa_win_32.exe
     [java] 	C:\jenkins_slave\workspace\flex-sdk_mustella\mustella\tests\spark\validators\NumberValidator\SWFs\NV_negativeNumberFormat_Main.swf
     [java] getting directory from the swf file
     [java] derived directory: C:\jenkins_slave\workspace\flex-sdk_mustella\mustella\tests\spark\validators\NumberValidator\SWFs
     [java] Launching: 
     [java]  C:\ApacheFlex\dependencies\FlashPlayer_Debug\flashplayer12-0_debugsa_win_32.exe C:\jenkins_slave\workspace\flex-sdk_mustella\mustella\tests\spark\validators\NumberValidator\SWFs\NV_negativeNumberFormat_Main.swf Launching: C:\ApacheFlex\dependencies\FlashPlayer_Debug\flashplayer12-0_debugsa_win_32.exe C:\jenkins_slave\workspace\flex-sdk_mustella\mustella\tests\spark\validators\NumberValidator\SWFs\NV_negativeNumberFormat_Main.swf
     [java] USING directory: C:\jenkins_slave\workspace\flex-sdk_mustella\mustella\tests\spark\validators\NumberValidator\SWFs
     [java] time: 22:14:27.273
     [java] SCRIPTDONE! 22:14:30.322
     [java] GET /ScriptComplete?0 HTTP/1.1
     [java] Before Wait loop 22:14:30.322 waiting = 0
     [java] After Wait loop 22:14:30.322 waiting = 0
     [java] clobberProcess false
     [java] Total Results so far: 7
     [java] Grab log, do parse = false
     [java] Grabbing the log from: C:\Users\apacheflex\Application Data\Macromedia/Flash Player/Logs/flashlog.txt to: C:\jenkins_slave\workspace\flex-sdk_mustella\mustella\tests\spark\validators\NumberValidator\SWFs\NV_negativeNumberFormat_Main.log
     [java] Skipping: C:\jenkins_slave\workspace\flex-sdk_mustella\mustella\tests\spark\validators\NumberValidator\SWFs\NV_negativeSymbol_Main.lnk.xml
     [java] Skipping: C:\jenkins_slave\workspace\flex-sdk_mustella\mustella\tests\spark\validators\NumberValidator\SWFs\NV_negativeSymbol_Main.mxml
     [java] new test file: C:\jenkins_slave\workspace\flex-sdk_mustella\mustella\tests\spark\validators\NumberValidator\SWFs\NV_negativeSymbol_Main.swf
     [java] ******** cmdArr before: 
     [java] 	C:\ApacheFlex\dependencies\FlashPlayer_Debug\flashplayer12-0_debugsa_win_32.exe
     [java] 	C:\jenkins_slave\workspace\flex-sdk_mustella\mustella\tests\spark\validators\NumberValidator\SWFs\NV_negativeSymbol_Main.swf
     [java] ******** moreParameters before: 
     [java] ******** cmdArr after: 
     [java] 	C:\ApacheFlex\dependencies\FlashPlayer_Debug\flashplayer12-0_debugsa_win_32.exe
     [java] 	C:\jenkins_slave\workspace\flex-sdk_mustella\mustella\tests\spark\validators\NumberValidator\SWFs\NV_negativeSymbol_Main.swf
     [java] getting directory from the swf file
     [java] derived directory: C:\jenkins_slave\workspace\flex-sdk_mustella\mustella\tests\spark\validators\NumberValidator\SWFs
     [java] Launching: 
     [java]  C:\ApacheFlex\dependencies\FlashPlayer_Debug\flashplayer12-0_debugsa_win_32.exe C:\jenkins_slave\workspace\flex-sdk_mustella\mustella\tests\spark\validators\NumberValidator\SWFs\NV_negativeSymbol_Main.swf Launching: C:\ApacheFlex\dependencies\FlashPlayer_Debug\flashplayer12-0_debugsa_win_32.exe C:\jenkins_slave\workspace\flex-sdk_mustella\mustella\tests\spark\validators\NumberValidator\SWFs\NV_negativeSymbol_Main.swf
     [java] USING directory: C:\jenkins_slave\workspace\flex-sdk_mustella\mustella\tests\spark\validators\NumberValidator\SWFs
     [java] time: 22:14:32.657
     [java] waited 2000
     [java] ClobberProcess, it was already null
     [java] SCRIPTDONE! 22:14:35.657
     [java] GET /ScriptComplete?0 HTTP/1.1
     [java] Before Wait loop 22:14:35.657 waiting = 0
     [java] After Wait loop 22:14:35.657 waiting = 0
     [java] clobberProcess false
     [java] Total Results so far: 7
     [java] Grab log, do parse = false
     [java] Grabbing the log from: C:\Users\apacheflex\Application Data\Macromedia/Flash Player/Logs/flashlog.txt to: C:\jenkins_slave\workspace\flex-sdk_mustella\mustella\tests\spark\validators\NumberValidator\SWFs\NV_negativeSymbol_Main.log
     [java] Skipping: C:\jenkins_slave\workspace\flex-sdk_mustella\mustella\tests\spark\validators\NumberValidator\SWFs\NV_validate.lnk.xml
     [java] Skipping: C:\jenkins_slave\workspace\flex-sdk_mustella\mustella\tests\spark\validators\NumberValidator\SWFs\NV_validate.mxml
     [java] new test file: C:\jenkins_slave\workspace\flex-sdk_mustella\mustella\tests\spark\validators\NumberValidator\SWFs\NV_validate.swf
     [java] ******** cmdArr before: 
     [java] 	C:\ApacheFlex\dependencies\FlashPlayer_Debug\flashplayer12-0_debugsa_win_32.exe
     [java] 	C:\jenkins_slave\workspace\flex-sdk_mustella\mustella\tests\spark\validators\NumberValidator\SWFs\NV_validate.swf
     [java] ******** moreParameters before: 
     [java] ******** cmdArr after: 
     [java] 	C:\ApacheFlex\dependencies\FlashPlayer_Debug\flashplayer12-0_debugsa_win_32.exe
     [java] 	C:\jenkins_slave\workspace\flex-sdk_mustella\mustella\tests\spark\validators\NumberValidator\SWFs\NV_validate.swf
     [java] getting directory from the swf file
     [java] derived directory: C:\jenkins_slave\workspace\flex-sdk_mustella\mustella\tests\spark\validators\NumberValidator\SWFs
     [java] Launching: 
     [java]  C:\ApacheFlex\dependencies\FlashPlayer_Debug\flashplayer12-0_debugsa_win_32.exe C:\jenkins_slave\workspace\flex-sdk_mustella\mustella\tests\spark\validators\NumberValidator\SWFs\NV_validate.swf Launching: C:\ApacheFlex\dependencies\FlashPlayer_Debug\flashplayer12-0_debugsa_win_32.exe C:\jenkins_slave\workspace\flex-sdk_mustella\mustella\tests\spark\validators\NumberValidator\SWFs\NV_validate.swf
     [java] USING directory: C:\jenkins_slave\workspace\flex-sdk_mustella\mustella\tests\spark\validators\NumberValidator\SWFs
     [java] time: 22:14:37.954
     [java] waited 2000
     [java] ClobberProcess, it was already null
     [java] SCRIPTDONE! 22:14:40.886
     [java] GET /ScriptComplete?0 HTTP/1.1
     [java] Before Wait loop 22:14:40.886 waiting = 0
     [java] After Wait loop 22:14:40.886 waiting = 0
     [java] clobberProcess false
     [java] Total Results so far: 7
     [java] Grab log, do parse = false
     [java] Grabbing the log from: C:\Users\apacheflex\Application Data\Macromedia/Flash Player/Logs/flashlog.txt to: C:\jenkins_slave\workspace\flex-sdk_mustella\mustella\tests\spark\validators\NumberValidator\SWFs\NV_validate.log
     [java] Skipping: C:\jenkins_slave\workspace\flex-sdk_mustella\mustella\tests\spark\validators\NumberValidator\SWFs\NV_validateAll.lnk.xml
     [java] Skipping: C:\jenkins_slave\workspace\flex-sdk_mustella\mustella\tests\spark\validators\NumberValidator\SWFs\NV_validateAll.mxml
     [java] new test file: C:\jenkins_slave\workspace\flex-sdk_mustella\mustella\tests\spark\validators\NumberValidator\SWFs\NV_validateAll.swf
     [java] ******** cmdArr before: 
     [java] 	C:\ApacheFlex\dependencies\FlashPlayer_Debug\flashplayer12-0_debugsa_win_32.exe
     [java] 	C:\jenkins_slave\workspace\flex-sdk_mustella\mustella\tests\spark\validators\NumberValidator\SWFs\NV_validateAll.swf
     [java] ******** moreParameters before: 
     [java] ******** cmdArr after: 
     [java] 	C:\ApacheFlex\dependencies\FlashPlayer_Debug\flashplayer12-0_debugsa_win_32.exe
     [java] 	C:\jenkins_slave\workspace\flex-sdk_mustella\mustella\tests\spark\validators\NumberValidator\SWFs\NV_validateAll.swf
     [java] getting directory from the swf file
     [java] derived directory: C:\jenkins_slave\workspace\flex-sdk_mustella\mustella\tests\spark\validators\NumberValidator\SWFs
     [java] Launching: 
     [java]  C:\ApacheFlex\dependencies\FlashPlayer_Debug\flashplayer12-0_debugsa_win_32.exe C:\jenkins_slave\workspace\flex-sdk_mustella\mustella\tests\spark\validators\NumberValidator\SWFs\NV_validateAll.swf Launching: C:\ApacheFlex\dependencies\FlashPlayer_Debug\flashplayer12-0_debugsa_win_32.exe C:\jenkins_slave\workspace\flex-sdk_mustella\mustella\tests\spark\validators\NumberValidator\SWFs\NV_validateAll.swf
     [java] USING directory: C:\jenkins_slave\workspace\flex-sdk_mustella\mustella\tests\spark\validators\NumberValidator\SWFs
     [java] time: 22:14:43.096
     [java] waited 1900
     [java] ClobberProcess, it was already null
     [java] SCRIPTDONE! 22:14:47.222
     [java] GET /ScriptComplete?0 HTTP/1.1
     [java] Before Wait loop 22:14:47.222 waiting = 0
     [java] After Wait loop 22:14:47.222 waiting = 0
     [java] clobberProcess false
     [java] Total Results so far: 7
     [java] Grab log, do parse = false
     [java] Grabbing the log from: C:\Users\apacheflex\Application Data\Macromedia/Flash Player/Logs/flashlog.txt to: C:\jenkins_slave\workspace\flex-sdk_mustella\mustella\tests\spark\validators\NumberValidator\SWFs\NV_validateAll.log
     [java] Skipping: C:\jenkins_slave\workspace\flex-sdk_mustella\mustella\tests\spark\validators\NumberValidator\SWFs\NV_validateNumber.lnk.xml
     [java] Skipping: C:\jenkins_slave\workspace\flex-sdk_mustella\mustella\tests\spark\validators\NumberValidator\SWFs\NV_validateNumber.mxml
     [java] new test file: C:\jenkins_slave\workspace\flex-sdk_mustella\mustella\tests\spark\validators\NumberValidator\SWFs\NV_validateNumber.swf
     [java] ******** cmdArr before: 
     [java] 	C:\ApacheFlex\dependencies\FlashPlayer_Debug\flashplayer12-0_debugsa_win_32.exe
     [java] 	C:\jenkins_slave\workspace\flex-sdk_mustella\mustella\tests\spark\validators\NumberValidator\SWFs\NV_validateNumber.swf
     [java] ******** moreParameters before: 
     [java] ******** cmdArr after: 
     [java] 	C:\ApacheFlex\dependencies\FlashPlayer_Debug\flashplayer12-0_debugsa_win_32.exe
     [java] 	C:\jenkins_slave\workspace\flex-sdk_mustella\mustella\tests\spark\validators\NumberValidator\SWFs\NV_validateNumber.swf
     [java] getting directory from the swf file
     [java] derived directory: C:\jenkins_slave\workspace\flex-sdk_mustella\mustella\tests\spark\validators\NumberValidator\SWFs
     [java] Launching: 
     [java]  C:\ApacheFlex\dependencies\FlashPlayer_Debug\flashplayer12-0_debugsa_win_32.exe C:\jenkins_slave\workspace\flex-sdk_mustella\mustella\tests\spark\validators\NumberValidator\SWFs\NV_validateNumber.swf Launching: C:\ApacheFlex\dependencies\FlashPlayer_Debug\flashplayer12-0_debugsa_win_32.exe C:\jenkins_slave\workspace\flex-sdk_mustella\mustella\tests\spark\validators\NumberValidator\SWFs\NV_validateNumber.swf
     [java] USING directory: C:\jenkins_slave\workspace\flex-sdk_mustella\mustella\tests\spark\validators\NumberValidator\SWFs
     [java] time: 22:14:49.520
     [java] waited 2000
     [java] ClobberProcess, it was already null
     [java] SCRIPTDONE! 22:14:52.306
     [java] GET /ScriptComplete?0 HTTP/1.1
     [java] Before Wait loop 22:14:52.306 waiting = 0
     [java] After Wait loop 22:14:52.306 waiting = 0
     [java] clobberProcess false
     [java] Total Results so far: 7
     [java] waited 1900
     [java] ClobberProcess, it was already null
     [java] Grab log, do parse = false
     [java] Grabbing the log from: C:\Users\apacheflex\Application Data\Macromedia/Flash Player/Logs/flashlog.txt to: C:\jenkins_slave\workspace\flex-sdk_mustella\mustella\tests\spark\validators\NumberValidator\SWFs\NV_validateNumber.log
     [java] Skipping: C:\jenkins_slave\workspace\flex-sdk_mustella\mustella\tests\spark\validators\NumberValidator\SWFs\assets\CustomNV.mxml
     [java] Skipping: C:\jenkins_slave\workspace\flex-sdk_mustella\mustella\tests\spark\validators\NumberValidator\SWFs\assets\CustomNVAll.mxml
     [java] Skipping: C:\jenkins_slave\workspace\flex-sdk_mustella\mustella\tests\spark\validators\NumberValidator\SWFs\assets\CustomNVComp.mxml
     [java] Skipping: C:\jenkins_slave\workspace\flex-sdk_mustella\mustella\tests\spark\validators\NumberValidator\SWFs\assets\DefaultLocaleComponent.mxml
     [java] Skipping: C:\jenkins_slave\workspace\flex-sdk_mustella\mustella\tests\spark\validators\NumberValidator\SWFs\assets\FallbackNVComp.mxml
     [java] Skipping: C:\jenkins_slave\workspace\flex-sdk_mustella\mustella\tests\spark\validators\NumberValidator\SWFs\assets\FlexNVBorderContainerComponent.mxml
     [java] Skipping: C:\jenkins_slave\workspace\flex-sdk_mustella\mustella\tests\spark\validators\NumberValidator\SWFs\assets\FlexNVComponent.mxml
     [java] Skipping: C:\jenkins_slave\workspace\flex-sdk_mustella\mustella\tests\spark\validators\NumberValidator\SWFs\assets\INVModuleInterface.as
     [java] Skipping: C:\jenkins_slave\workspace\flex-sdk_mustella\mustella\tests\spark\validators\NumberValidator\SWFs\assets\MyNumValidatorComp.mxml
     [java] Skipping: C:\jenkins_slave\workspace\flex-sdk_mustella\mustella\tests\spark\validators\NumberValidator\SWFs\assets\MyNumberValidator.as
     [java] Skipping: C:\jenkins_slave\workspace\flex-sdk_mustella\mustella\tests\spark\validators\NumberValidator\SWFs\assets\NVConstants.as
     [java] Skipping: C:\jenkins_slave\workspace\flex-sdk_mustella\mustella\tests\spark\validators\NumberValidator\SWFs\assets\NV_FlexModule.mxml
     [java] Skipping: C:\jenkins_slave\workspace\flex-sdk_mustella\mustella\tests\spark\validators\NumberValidator\SWFs\assets\NV_Style_FlexModule.mxml
     [java] Skipping: C:\jenkins_slave\workspace\flex-sdk_mustella\mustella\tests\spark\validators\NumberValidator\SWFs\assets\myExtStyle.css
     [java] Skipping: C:\jenkins_slave\workspace\flex-sdk_mustella\mustella\tests\spark\validators\NumberValidator\SWFs\pre_compile.sh
     [java] Skipping: C:\jenkins_slave\workspace\flex-sdk_mustella\mustella\tests\spark\validators\NumberValidator\SWFs\pre_compile.sh.0.log
     [java] Skipping: C:\jenkins_slave\workspace\flex-sdk_mustella\mustella\tests\spark\validators\NumberValidator\Styles\NV_Ext_Style_tester.mxml
     [java] Skipping: C:\jenkins_slave\workspace\flex-sdk_mustella\mustella\tests\spark\validators\NumberValidator\Styles\NV_StyleManager_loadExtCSS_tester.mxml
     [java] Skipping: C:\jenkins_slave\workspace\flex-sdk_mustella\mustella\tests\spark\validators\NumberValidator\Styles\NV_StyleManager_tester.mxml
     [java] Skipping: C:\jenkins_slave\workspace\flex-sdk_mustella\mustella\tests\spark\validators\NumberValidator\Styles\NV_Style_DefaultLocale_comp_app_tester.mxml
     [java] Skipping: C:\jenkins_slave\workspace\flex-sdk_mustella\mustella\tests\spark\validators\NumberValidator\Styles\NV_Style_DefaultLocale_comp_global_tester.mxml
     [java] Skipping: C:\jenkins_slave\workspace\flex-sdk_mustella\mustella\tests\spark\validators\NumberValidator\Styles\NV_Style_DefaultLocale_comp_tester.mxml
     [java] Skipping: C:\jenkins_slave\workspace\flex-sdk_mustella\mustella\tests\spark\validators\NumberValidator\Styles\NV_Style_DefaultLocale_module_app_tester.mxml
     [java] Skipping: C:\jenkins_slave\workspace\flex-sdk_mustella\mustella\tests\spark\validators\NumberValidator\Styles\NV_Style_DefaultLocale_module_global_tester.mxml
     [java] Skipping: C:\jenkins_slave\workspace\flex-sdk_mustella\mustella\tests\spark\validators\NumberValidator\Styles\NV_Style_DefaultLocale_module_tester.mxml
     [java] Skipping: C:\jenkins_slave\workspace\flex-sdk_mustella\mustella\tests\spark\validators\NumberValidator\Styles\NV_Style_DefaultLocale_tester.mxml
     [java] Skipping: C:\jenkins_slave\workspace\flex-sdk_mustella\mustella\tests\spark\validators\NumberValidator\Styles\NV_inline_style_tester.mxml
     [java] Skipping: C:\jenkins_slave\workspace\flex-sdk_mustella\mustella\tests\spark\validators\NumberValidator\Styles\NV_localCSSStyle_tester.mxml
     [java] Skipping: C:\jenkins_slave\workspace\flex-sdk_mustella\mustella\tests\spark\validators\NumberValidator\Styles\NV_localStyle_typeSelector_tester.mxml
     [java] at the end of main
     [java] Shutting down the results server
     [java] shutting down the baseline server
     [java] done waiting for results...bye
     [java] =====================================================
     [java]     Passes: 6
     [java]     Fails: 1
     [java] =====================================================
     [java] 
     [java] =====================================================
     [java] =====================================================
     [java] 	Passed: 
     [java] =====================================================
     [java] gumbo/components/Application/properties/Application_Properties Application_Properties_skin_test7 Passed  
     [java] gumbo/components/Image/styles/Image_styles_smoothingQuality Image_Scale_stretch_smoothingQuality_high Passed  
     [java] itemRenderers/Halo/List/test_scripts/List_itemEditor DateFieldItemEditor_Scrolling Passed  
     [java] itemRenderers/Halo/List/test_scripts/List_itemRenderer DateFieldRenderer_Scrolling Passed  
     [java] itemRenderers/Spark/List/test_scripts/List_itemRenderer_spark DateFieldRenderer_Scrolling Passed  
     [java] resources/ResourceManager/Integration/ResourceManager_Integration_UIComponent_resourcesChanged ResourceManager_Integration_UIComponent_resourcesChanged_localeChain Passed  
     [java] =====================================================
     [java] 	Failed: 
     [java] =====================================================
     [java] spark/validators/CurrencyValidator/Methods/CV_validate_error_message_localized_tester CV_errorTip_custom_parseError_invalid_buttonTrig_29 Failed AssertPropertyValue%28body%3Astep%205%29%20%20uiCustomComp.uiTI.errorString%20Currency%20name%20is%20repeated%20or%20not%20correct.%20%21=%20%u8FD9%u662F%u4E2A%u4E2D%u6587%u7684%u9519%u8BEF%u6587%u672C%21%21%21 
     [java] 
     [java] 
     [java] =====================================================
     [java]     Passes: 6
     [java]     Fails: 1
     [java] =====================================================
     [java] 
     [java] 
     [java] Wrote summary to results.txt
     [java] Wrote failures to failures.txt

BUILD FAILED
C:\jenkins_slave\workspace\flex-sdk_mustella\mustella\build.xml:1538: The following error occurred while executing this line:
C:\jenkins_slave\workspace\flex-sdk_mustella\mustella\build.xml:1656: Java returned: 1

Total time: 438 minutes 25 seconds



============ JENKINS MUSTELLA RUN REPORT ============

Date and time: 01-23-2014 22:14

Settings:
player.version = 12.0
air.version = 4
FLASHPLAYER_DEBUGGER = C:\ApacheFlex\dependencies\FlashPlayer_Debug\flashplayer12-0_debugsa_win_32.exe
AIR_HOME = C:\ApacheFlex\dependencies\AdobeAIRSDK\4

Build: 
  type = main
  command = -timeout=60000
  set = -all

Log:
- Made Cygwin ignore carriage returns
- Cleaned up 'local.properties' files from previous runs
- Set FLASH_VERSION to '12.0' and AIR_VERSION to '4'
- Set AIR_HOME to 'C:\ApacheFlex\dependencies\AdobeAIRSDK\4'
- Set FLASHPLAYER_DEBUGGER to 'C:\ApacheFlex\dependencies\FlashPlayer_Debug\flashplayer12-0_debugsa_win_32.exe'
- Ran 'clean', 'main' and 'other.locales' ant targets to prepare the SDK for testing
- Ran Mustella on the SDK with these parameters: '-timeout=60000 -all'
- Some tests failed: running '-failures'
- Some of tests failed, even after running '-failures'...


=====================================================



Build step 'Execute shell' marked build as failure
Email was triggered for: Always
Sending email for trigger: Always