You are viewing a plain text version of this content. The canonical link for it is here.
Posted to dev@zookeeper.apache.org by Apache Jenkins Server <je...@builds.apache.org> on 2013/10/12 10:06:30 UTC

ZooKeeper_branch34_solaris - Build # 676 - Failure

See https://builds.apache.org/job/ZooKeeper_branch34_solaris/676/

###################################################################################
########################## LAST 60 LINES OF THE CONSOLE ###########################
[...truncated 135659 lines...]
    [junit] 2013-10-12 08:05:45,925 [myid:] - INFO  [main:JMXEnv@105] - expect:InMemoryDataTree
    [junit] 2013-10-12 08:05:45,925 [myid:] - INFO  [main:JMXEnv@108] - found:InMemoryDataTree org.apache.ZooKeeperService:name0=StandaloneServer_port-1,name1=InMemoryDataTree
    [junit] 2013-10-12 08:05:45,925 [myid:] - INFO  [main:JMXEnv@105] - expect:StandaloneServer_port
    [junit] 2013-10-12 08:05:45,925 [myid:] - INFO  [main:JMXEnv@108] - found:StandaloneServer_port org.apache.ZooKeeperService:name0=StandaloneServer_port-1
    [junit] 2013-10-12 08:05:45,925 [myid:] - INFO  [main:ClientBase@421] - STOPPING server
    [junit] 2013-10-12 08:05:45,927 [myid:] - INFO  [main:ZooKeeperServer@443] - shutting down
    [junit] 2013-10-12 08:05:45,927 [myid:] - INFO  [main:SessionTrackerImpl@225] - Shutting down
    [junit] 2013-10-12 08:05:45,927 [myid:] - INFO  [main:PrepRequestProcessor@761] - Shutting down
    [junit] 2013-10-12 08:05:45,927 [myid:] - INFO  [main:SyncRequestProcessor@190] - Shutting down
    [junit] 2013-10-12 08:05:45,927 [myid:] - INFO  [ProcessThread(sid:0 cport:-1)::PrepRequestProcessor@143] - PrepRequestProcessor exited loop!
    [junit] 2013-10-12 08:05:45,927 [myid:] - INFO  [SyncThread:0:SyncRequestProcessor@168] - SyncRequestProcessor exited!
    [junit] 2013-10-12 08:05:45,928 [myid:] - INFO  [main:FinalRequestProcessor@415] - shutdown of request processor complete
    [junit] 2013-10-12 08:05:45,928 [myid:] - INFO  [main:FourLetterWordMain@43] - connecting to 127.0.0.1 11221
    [junit] 2013-10-12 08:05:45,929 [myid:] - INFO  [main:JMXEnv@133] - ensureOnly:[]
    [junit] 2013-10-12 08:05:45,930 [myid:] - INFO  [main:ClientBase@414] - STARTING server
    [junit] 2013-10-12 08:05:45,930 [myid:] - INFO  [main:ZooKeeperServer@162] - Created server with tickTime 3000 minSessionTimeout 6000 maxSessionTimeout 60000 datadir /zonestorage/hudson_solaris/home/hudson/hudson-slave/workspace/ZooKeeper_branch34_solaris/trunk/build/test/tmp/test3024143634662573243.junit.dir/version-2 snapdir /zonestorage/hudson_solaris/home/hudson/hudson-slave/workspace/ZooKeeper_branch34_solaris/trunk/build/test/tmp/test3024143634662573243.junit.dir/version-2
    [junit] 2013-10-12 08:05:45,931 [myid:] - INFO  [main:NIOServerCnxnFactory@94] - binding to port 0.0.0.0/0.0.0.0:11221
    [junit] 2013-10-12 08:05:45,932 [myid:] - INFO  [main:FileSnap@83] - Reading snapshot /zonestorage/hudson_solaris/home/hudson/hudson-slave/workspace/ZooKeeper_branch34_solaris/trunk/build/test/tmp/test3024143634662573243.junit.dir/version-2/snapshot.b
    [junit] 2013-10-12 08:05:45,934 [myid:] - INFO  [main:FileTxnSnapLog@240] - Snapshotting: 0xb to /zonestorage/hudson_solaris/home/hudson/hudson-slave/workspace/ZooKeeper_branch34_solaris/trunk/build/test/tmp/test3024143634662573243.junit.dir/version-2/snapshot.b
    [junit] 2013-10-12 08:05:45,936 [myid:] - INFO  [main:FourLetterWordMain@43] - connecting to 127.0.0.1 11221
    [junit] 2013-10-12 08:05:45,936 [myid:] - INFO  [NIOServerCxn.Factory:0.0.0.0/0.0.0.0:11221:NIOServerCnxnFactory@197] - Accepted socket connection from /127.0.0.1:64940
    [junit] 2013-10-12 08:05:45,936 [myid:] - INFO  [NIOServerCxn.Factory:0.0.0.0/0.0.0.0:11221:NIOServerCnxn@817] - Processing stat command from /127.0.0.1:64940
    [junit] 2013-10-12 08:05:45,937 [myid:] - INFO  [Thread-5:NIOServerCnxn$StatCommand@653] - Stat command output
    [junit] 2013-10-12 08:05:45,938 [myid:] - INFO  [Thread-5:NIOServerCnxn@997] - Closed socket connection for client /127.0.0.1:64940 (no session established for client)
    [junit] 2013-10-12 08:05:45,938 [myid:] - INFO  [main:JMXEnv@133] - ensureOnly:[InMemoryDataTree, StandaloneServer_port]
    [junit] 2013-10-12 08:05:45,939 [myid:] - INFO  [main:JMXEnv@105] - expect:InMemoryDataTree
    [junit] 2013-10-12 08:05:45,939 [myid:] - INFO  [main:JMXEnv@108] - found:InMemoryDataTree org.apache.ZooKeeperService:name0=StandaloneServer_port-1,name1=InMemoryDataTree
    [junit] 2013-10-12 08:05:45,939 [myid:] - INFO  [main:JMXEnv@105] - expect:StandaloneServer_port
    [junit] 2013-10-12 08:05:45,939 [myid:] - INFO  [main:JMXEnv@108] - found:StandaloneServer_port org.apache.ZooKeeperService:name0=StandaloneServer_port-1
    [junit] 2013-10-12 08:05:45,940 [myid:] - INFO  [main:JUnit4ZKTestRunner$LoggedInvokeMethod@57] - FINISHED TEST METHOD testQuota
    [junit] 2013-10-12 08:05:45,940 [myid:] - INFO  [main:ClientBase@451] - tearDown starting
    [junit] 2013-10-12 08:05:46,013 [myid:] - INFO  [main:ZooKeeper@684] - Session: 0x141abb31b520000 closed
    [junit] 2013-10-12 08:05:46,013 [myid:] - INFO  [main:ClientBase@421] - STOPPING server
    [junit] 2013-10-12 08:05:46,013 [myid:] - INFO  [main-EventThread:ClientCnxn$EventThread@509] - EventThread shut down
    [junit] 2013-10-12 08:05:46,015 [myid:] - INFO  [main:ZooKeeperServer@443] - shutting down
    [junit] 2013-10-12 08:05:46,015 [myid:] - INFO  [main:SessionTrackerImpl@225] - Shutting down
    [junit] 2013-10-12 08:05:46,015 [myid:] - INFO  [main:PrepRequestProcessor@761] - Shutting down
    [junit] 2013-10-12 08:05:46,015 [myid:] - INFO  [main:SyncRequestProcessor@190] - Shutting down
    [junit] 2013-10-12 08:05:46,015 [myid:] - INFO  [ProcessThread(sid:0 cport:-1)::PrepRequestProcessor@143] - PrepRequestProcessor exited loop!
    [junit] 2013-10-12 08:05:46,015 [myid:] - INFO  [SyncThread:0:SyncRequestProcessor@168] - SyncRequestProcessor exited!
    [junit] 2013-10-12 08:05:46,016 [myid:] - INFO  [main:FinalRequestProcessor@415] - shutdown of request processor complete
    [junit] 2013-10-12 08:05:46,016 [myid:] - INFO  [main:FourLetterWordMain@43] - connecting to 127.0.0.1 11221
    [junit] 2013-10-12 08:05:46,017 [myid:] - INFO  [main:JMXEnv@133] - ensureOnly:[]
    [junit] 2013-10-12 08:05:46,021 [myid:] - INFO  [main:ClientBase@476] - fdcount after test is: 42 at start it was 28
    [junit] 2013-10-12 08:05:46,021 [myid:] - INFO  [main:ClientBase@478] - sleeping for 20 secs
    [junit] 2013-10-12 08:05:46,022 [myid:] - INFO  [main:ZKTestCase$1@60] - SUCCEEDED testQuota
    [junit] 2013-10-12 08:05:46,022 [myid:] - INFO  [main:ZKTestCase$1@55] - FINISHED testQuota
    [junit] Tests run: 1, Failures: 0, Errors: 0, Time elapsed: 8.647 sec

BUILD FAILED
/zonestorage/hudson_solaris/home/hudson/hudson-slave/workspace/ZooKeeper_branch34_solaris/trunk/build.xml:1251: Tests failed!

Total time: 29 minutes 12 seconds
Build step 'Invoke Ant' marked build as failure
[locks-and-latches] Releasing all the locks
[locks-and-latches] All the locks released
Recording test results
Email was triggered for: Failure
Sending email for trigger: Failure



###################################################################################
############################## FAILED TESTS (if any) ##############################
2 tests failed.
REGRESSION:  org.apache.zookeeper.test.QuorumTest.testLeaderShutdown

Error Message:
Forked Java VM exited abnormally. Please note the time in the report does not reflect the time until the VM exit.

Stack Trace:
junit.framework.AssertionFailedError: Forked Java VM exited abnormally. Please note the time in the report does not reflect the time until the VM exit.


REGRESSION:  org.apache.zookeeper.test.QuorumZxidSyncTest.testBehindLeader

Error Message:
KeeperErrorCode = ConnectionLoss for /0

Stack Trace:
org.apache.zookeeper.KeeperException$ConnectionLossException: KeeperErrorCode = ConnectionLoss for /0
	at org.apache.zookeeper.KeeperException.create(KeeperException.java:99)
	at org.apache.zookeeper.KeeperException.create(KeeperException.java:51)
	at org.apache.zookeeper.ZooKeeper.create(ZooKeeper.java:783)
	at org.apache.zookeeper.test.QuorumZxidSyncTest.testBehindLeader(QuorumZxidSyncTest.java:53)
	at org.apache.zookeeper.JUnit4ZKTestRunner$LoggedInvokeMethod.evaluate(JUnit4ZKTestRunner.java:52)