You are viewing a plain text version of this content. The canonical link for it is here.
Posted to dev@lucene.apache.org by Policeman Jenkins Server <je...@thetaphi.de> on 2013/01/24 12:20:34 UTC
[JENKINS] Lucene-Solr-trunk-MacOSX (64bit/jdk1.7.0) - Build # 128 -
Failure!
Build: http://jenkins.thetaphi.de/job/Lucene-Solr-trunk-MacOSX/128/
Java: 64bit/jdk1.7.0 -XX:+UseConcMarkSweepGC
1 tests failed.
REGRESSION: org.apache.solr.cloud.BasicDistributedZkTest.testDistribSearch
Error Message:
There are still nodes recoverying - waited for 230 seconds
Stack Trace:
java.lang.AssertionError: There are still nodes recoverying - waited for 230 seconds
at __randomizedtesting.SeedInfo.seed([F541BBCA2A81500D:74A735D25DDE3031]:0)
at org.junit.Assert.fail(Assert.java:93)
at org.apache.solr.cloud.AbstractDistribZkTestBase.waitForRecoveriesToFinish(AbstractDistribZkTestBase.java:168)
at org.apache.solr.cloud.AbstractDistribZkTestBase.waitForRecoveriesToFinish(AbstractDistribZkTestBase.java:126)
at org.apache.solr.cloud.AbstractDistribZkTestBase.waitForRecoveriesToFinish(AbstractDistribZkTestBase.java:121)
at org.apache.solr.cloud.BasicDistributedZkTest.testCoreUnloadAndLeaders(BasicDistributedZkTest.java:586)
at org.apache.solr.cloud.BasicDistributedZkTest.doTest(BasicDistributedZkTest.java:337)
at org.apache.solr.BaseDistributedSearchTestCase.testDistribSearch(BaseDistributedSearchTestCase.java:794)
at sun.reflect.NativeMethodAccessorImpl.invoke0(Native Method)
at sun.reflect.NativeMethodAccessorImpl.invoke(NativeMethodAccessorImpl.java:57)
at sun.reflect.DelegatingMethodAccessorImpl.invoke(DelegatingMethodAccessorImpl.java:43)
at java.lang.reflect.Method.invoke(Method.java:601)
at com.carrotsearch.randomizedtesting.RandomizedRunner.invoke(RandomizedRunner.java:1559)
at com.carrotsearch.randomizedtesting.RandomizedRunner.access$600(RandomizedRunner.java:79)
at com.carrotsearch.randomizedtesting.RandomizedRunner$6.evaluate(RandomizedRunner.java:737)
at com.carrotsearch.randomizedtesting.RandomizedRunner$7.evaluate(RandomizedRunner.java:773)
at com.carrotsearch.randomizedtesting.RandomizedRunner$8.evaluate(RandomizedRunner.java:787)
at com.carrotsearch.randomizedtesting.rules.SystemPropertiesRestoreRule$1.evaluate(SystemPropertiesRestoreRule.java:53)
at org.apache.lucene.util.TestRuleSetupTeardownChained$1.evaluate(TestRuleSetupTeardownChained.java:50)
at org.apache.lucene.util.TestRuleFieldCacheSanity$1.evaluate(TestRuleFieldCacheSanity.java:51)
at org.apache.lucene.util.AbstractBeforeAfterRule$1.evaluate(AbstractBeforeAfterRule.java:46)
at com.carrotsearch.randomizedtesting.rules.SystemPropertiesInvariantRule$1.evaluate(SystemPropertiesInvariantRule.java:55)
at org.apache.lucene.util.TestRuleThreadAndTestName$1.evaluate(TestRuleThreadAndTestName.java:49)
at org.apache.lucene.util.TestRuleIgnoreAfterMaxFailures$1.evaluate(TestRuleIgnoreAfterMaxFailures.java:70)
at org.apache.lucene.util.TestRuleMarkFailure$1.evaluate(TestRuleMarkFailure.java:48)
at com.carrotsearch.randomizedtesting.rules.StatementAdapter.evaluate(StatementAdapter.java:36)
at com.carrotsearch.randomizedtesting.ThreadLeakControl$StatementRunner.run(ThreadLeakControl.java:358)
at com.carrotsearch.randomizedtesting.ThreadLeakControl.forkTimeoutingTask(ThreadLeakControl.java:782)
at com.carrotsearch.randomizedtesting.ThreadLeakControl$3.evaluate(ThreadLeakControl.java:442)
at com.carrotsearch.randomizedtesting.RandomizedRunner.runSingleTest(RandomizedRunner.java:746)
at com.carrotsearch.randomizedtesting.RandomizedRunner$3.evaluate(RandomizedRunner.java:648)
at com.carrotsearch.randomizedtesting.RandomizedRunner$4.evaluate(RandomizedRunner.java:682)
at com.carrotsearch.randomizedtesting.RandomizedRunner$5.evaluate(RandomizedRunner.java:693)
at com.carrotsearch.randomizedtesting.rules.StatementAdapter.evaluate(StatementAdapter.java:36)
at com.carrotsearch.randomizedtesting.rules.SystemPropertiesRestoreRule$1.evaluate(SystemPropertiesRestoreRule.java:53)
at org.apache.lucene.util.AbstractBeforeAfterRule$1.evaluate(AbstractBeforeAfterRule.java:46)
at org.apache.lucene.util.TestRuleStoreClassName$1.evaluate(TestRuleStoreClassName.java:42)
at com.carrotsearch.randomizedtesting.rules.SystemPropertiesInvariantRule$1.evaluate(SystemPropertiesInvariantRule.java:55)
at com.carrotsearch.randomizedtesting.rules.NoShadowingOrOverridesOnMethodsRule$1.evaluate(NoShadowingOrOverridesOnMethodsRule.java:39)
at com.carrotsearch.randomizedtesting.rules.NoShadowingOrOverridesOnMethodsRule$1.evaluate(NoShadowingOrOverridesOnMethodsRule.java:39)
at com.carrotsearch.randomizedtesting.rules.StatementAdapter.evaluate(StatementAdapter.java:36)
at org.apache.lucene.util.TestRuleAssertionsRequired$1.evaluate(TestRuleAssertionsRequired.java:43)
at org.apache.lucene.util.TestRuleMarkFailure$1.evaluate(TestRuleMarkFailure.java:48)
at org.apache.lucene.util.TestRuleIgnoreAfterMaxFailures$1.evaluate(TestRuleIgnoreAfterMaxFailures.java:70)
at org.apache.lucene.util.TestRuleIgnoreTestSuites$1.evaluate(TestRuleIgnoreTestSuites.java:55)
at com.carrotsearch.randomizedtesting.rules.StatementAdapter.evaluate(StatementAdapter.java:36)
at com.carrotsearch.randomizedtesting.ThreadLeakControl$StatementRunner.run(ThreadLeakControl.java:358)
at java.lang.Thread.run(Thread.java:722)
Build Log:
[...truncated 8892 lines...]
[junit4:junit4] Suite: org.apache.solr.cloud.BasicDistributedZkTest
[junit4:junit4] 2> 0 T2030 oas.BaseDistributedSearchTestCase.initHostContext Setting hostContext system property: /
[junit4:junit4] 2> 8 T2030 oas.SolrTestCaseJ4.setUp ###Starting testDistribSearch
[junit4:junit4] 2> Creating dataDir: /Users/jenkins/jenkins-slave/workspace/Lucene-Solr-trunk-MacOSX/solr/build/solr-core/test/J0/./solrtest-BasicDistributedZkTest-1359025192910
[junit4:junit4] 2> 10 T2030 oasc.ZkTestServer.run STARTING ZK TEST SERVER
[junit4:junit4] 2> 11 T2031 oasc.ZkTestServer$ZKServerMain.runFromConfig Starting server
[junit4:junit4] 2> 14 T2031 oazs.ZooKeeperServer.setTickTime tickTime set to 1000
[junit4:junit4] 2> 14 T2031 oazs.ZooKeeperServer.setMinSessionTimeout minSessionTimeout set to -1
[junit4:junit4] 2> 14 T2031 oazs.ZooKeeperServer.setMaxSessionTimeout maxSessionTimeout set to -1
[junit4:junit4] 2> 15 T2031 oazs.NIOServerCnxnFactory.configure binding to port 0.0.0.0/0.0.0.0:0
[junit4:junit4] 2> 16 T2031 oazsp.FileTxnSnapLog.save Snapshotting: 0x0 to /Users/jenkins/jenkins-slave/workspace/Lucene-Solr-trunk-MacOSX/solr/build/solr-core/test/J0/./org.apache.solr.cloud.BasicDistributedZkTest-1359025192910/zookeeper/server1/data/version-2/snapshot.0
[junit4:junit4] 2> 112 T2030 oasc.ZkTestServer.run start zk server on port:49986
[junit4:junit4] 2> 115 T2030 oaz.ZooKeeper.<init> Initiating client connection, connectString=127.0.0.1:49986 sessionTimeout=10000 watcher=org.apache.solr.common.cloud.ConnectionManager@69420cf8
[junit4:junit4] 2> 123 T2030 oascc.ConnectionManager.waitForConnected Waiting for client to connect to ZooKeeper
[junit4:junit4] 2> 123 T2036 oaz.ClientCnxn$SendThread.logStartConnect Opening socket connection to server localhost/127.0.0.1:49986. Will not attempt to authenticate using SASL (access denied ("javax.security.auth.AuthPermission" "getLoginConfiguration"))
[junit4:junit4] 2> 124 T2036 oaz.ClientCnxn$SendThread.primeConnection Socket connection established to localhost/127.0.0.1:49986, initiating session
[junit4:junit4] 2> 125 T2032 oazs.NIOServerCnxnFactory.run Accepted socket connection from /127.0.0.1:49987
[junit4:junit4] 2> 126 T2032 oazs.ZooKeeperServer.processConnectRequest Client attempting to establish new session at /127.0.0.1:49987
[junit4:junit4] 2> 126 T2034 oazsp.FileTxnLog.append Creating new log file: log.1
[junit4:junit4] 2> 130 T2034 oazs.ZooKeeperServer.finishSessionInit Established session 0x13c6c36bfd60000 with negotiated timeout 10000 for client /127.0.0.1:49987
[junit4:junit4] 2> 130 T2036 oaz.ClientCnxn$SendThread.onConnected Session establishment complete on server localhost/127.0.0.1:49986, sessionid = 0x13c6c36bfd60000, negotiated timeout = 10000
[junit4:junit4] 2> 131 T2037 oascc.ConnectionManager.process Watcher org.apache.solr.common.cloud.ConnectionManager@69420cf8 name:ZooKeeperConnection Watcher:127.0.0.1:49986 got event WatchedEvent state:SyncConnected type:None path:null path:null type:None
[junit4:junit4] 2> 132 T2030 oascc.ConnectionManager.waitForConnected Client is connected to ZooKeeper
[junit4:junit4] 2> 132 T2030 oascc.SolrZkClient.makePath makePath: /solr
[junit4:junit4] 2> 139 T2035 oazs.PrepRequestProcessor.pRequest2Txn Processed session termination for sessionid: 0x13c6c36bfd60000
[junit4:junit4] 2> 141 T2030 oaz.ZooKeeper.close Session: 0x13c6c36bfd60000 closed
[junit4:junit4] 2> 142 T2030 oaz.ZooKeeper.<init> Initiating client connection, connectString=127.0.0.1:49986/solr sessionTimeout=10000 watcher=org.apache.solr.common.cloud.ConnectionManager@5d505de
[junit4:junit4] 2> 143 T2037 oaz.ClientCnxn$EventThread.run EventThread shut down
[junit4:junit4] 2> 144 T2030 oascc.ConnectionManager.waitForConnected Waiting for client to connect to ZooKeeper
[junit4:junit4] 2> 145 T2032 oazs.NIOServerCnxn.closeSock Closed socket connection for client /127.0.0.1:49987 which had sessionid 0x13c6c36bfd60000
[junit4:junit4] 2> 146 T2038 oaz.ClientCnxn$SendThread.logStartConnect Opening socket connection to server localhost/127.0.0.1:49986. Will not attempt to authenticate using SASL (access denied ("javax.security.auth.AuthPermission" "getLoginConfiguration"))
[junit4:junit4] 2> 147 T2032 oazs.NIOServerCnxnFactory.run Accepted socket connection from /127.0.0.1:49988
[junit4:junit4] 2> 148 T2038 oaz.ClientCnxn$SendThread.primeConnection Socket connection established to localhost/127.0.0.1:49986, initiating session
[junit4:junit4] 2> 148 T2032 oazs.ZooKeeperServer.processConnectRequest Client attempting to establish new session at /127.0.0.1:49988
[junit4:junit4] 2> 150 T2034 oazs.ZooKeeperServer.finishSessionInit Established session 0x13c6c36bfd60001 with negotiated timeout 10000 for client /127.0.0.1:49988
[junit4:junit4] 2> 150 T2038 oaz.ClientCnxn$SendThread.onConnected Session establishment complete on server localhost/127.0.0.1:49986, sessionid = 0x13c6c36bfd60001, negotiated timeout = 10000
[junit4:junit4] 2> 151 T2039 oascc.ConnectionManager.process Watcher org.apache.solr.common.cloud.ConnectionManager@5d505de name:ZooKeeperConnection Watcher:127.0.0.1:49986/solr got event WatchedEvent state:SyncConnected type:None path:null path:null type:None
[junit4:junit4] 2> 151 T2030 oascc.ConnectionManager.waitForConnected Client is connected to ZooKeeper
[junit4:junit4] 2> 152 T2030 oascc.SolrZkClient.makePath makePath: /collections/collection1
[junit4:junit4] 2> 159 T2030 oascc.SolrZkClient.makePath makePath: /collections/collection1/shards
[junit4:junit4] 2> 165 T2030 oascc.SolrZkClient.makePath makePath: /collections/control_collection
[junit4:junit4] 2> 170 T2030 oascc.SolrZkClient.makePath makePath: /collections/control_collection/shards
[junit4:junit4] 2> 176 T2030 oasc.AbstractZkTestCase.putConfig put /Users/jenkins/jenkins-slave/workspace/Lucene-Solr-trunk-MacOSX/solr/build/solr-core/test-files/solr/collection1/conf/solrconfig.xml to /configs/conf1/solrconfig.xml
[junit4:junit4] 2> 178 T2030 oascc.SolrZkClient.makePath makePath: /configs/conf1/solrconfig.xml
[junit4:junit4] 2> 187 T2030 oasc.AbstractZkTestCase.putConfig put /Users/jenkins/jenkins-slave/workspace/Lucene-Solr-trunk-MacOSX/solr/build/solr-core/test-files/solr/collection1/conf/schema.xml to /configs/conf1/schema.xml
[junit4:junit4] 2> 188 T2030 oascc.SolrZkClient.makePath makePath: /configs/conf1/schema.xml
[junit4:junit4] 2> 201 T2030 oasc.AbstractZkTestCase.putConfig put /Users/jenkins/jenkins-slave/workspace/Lucene-Solr-trunk-MacOSX/solr/build/solr-core/test-files/solr/collection1/conf/stopwords.txt to /configs/conf1/stopwords.txt
[junit4:junit4] 2> 202 T2030 oascc.SolrZkClient.makePath makePath: /configs/conf1/stopwords.txt
[junit4:junit4] 2> 208 T2030 oasc.AbstractZkTestCase.putConfig put /Users/jenkins/jenkins-slave/workspace/Lucene-Solr-trunk-MacOSX/solr/build/solr-core/test-files/solr/collection1/conf/protwords.txt to /configs/conf1/protwords.txt
[junit4:junit4] 2> 209 T2030 oascc.SolrZkClient.makePath makePath: /configs/conf1/protwords.txt
[junit4:junit4] 2> 215 T2030 oasc.AbstractZkTestCase.putConfig put /Users/jenkins/jenkins-slave/workspace/Lucene-Solr-trunk-MacOSX/solr/build/solr-core/test-files/solr/collection1/conf/currency.xml to /configs/conf1/currency.xml
[junit4:junit4] 2> 217 T2030 oascc.SolrZkClient.makePath makePath: /configs/conf1/currency.xml
[junit4:junit4] 2> 222 T2030 oasc.AbstractZkTestCase.putConfig put /Users/jenkins/jenkins-slave/workspace/Lucene-Solr-trunk-MacOSX/solr/build/solr-core/test-files/solr/collection1/conf/open-exchange-rates.json to /configs/conf1/open-exchange-rates.json
[junit4:junit4] 2> 223 T2030 oascc.SolrZkClient.makePath makePath: /configs/conf1/open-exchange-rates.json
[junit4:junit4] 2> 229 T2030 oasc.AbstractZkTestCase.putConfig put /Users/jenkins/jenkins-slave/workspace/Lucene-Solr-trunk-MacOSX/solr/build/solr-core/test-files/solr/collection1/conf/mapping-ISOLatin1Accent.txt to /configs/conf1/mapping-ISOLatin1Accent.txt
[junit4:junit4] 2> 232 T2030 oascc.SolrZkClient.makePath makePath: /configs/conf1/mapping-ISOLatin1Accent.txt
[junit4:junit4] 2> 238 T2030 oasc.AbstractZkTestCase.putConfig put /Users/jenkins/jenkins-slave/workspace/Lucene-Solr-trunk-MacOSX/solr/build/solr-core/test-files/solr/collection1/conf/old_synonyms.txt to /configs/conf1/old_synonyms.txt
[junit4:junit4] 2> 239 T2030 oascc.SolrZkClient.makePath makePath: /configs/conf1/old_synonyms.txt
[junit4:junit4] 2> 248 T2030 oasc.AbstractZkTestCase.putConfig put /Users/jenkins/jenkins-slave/workspace/Lucene-Solr-trunk-MacOSX/solr/build/solr-core/test-files/solr/collection1/conf/synonyms.txt to /configs/conf1/synonyms.txt
[junit4:junit4] 2> 249 T2030 oascc.SolrZkClient.makePath makePath: /configs/conf1/synonyms.txt
[junit4:junit4] 2> 256 T2035 oazs.PrepRequestProcessor.pRequest2Txn Processed session termination for sessionid: 0x13c6c36bfd60001
[junit4:junit4] 2> 257 T2032 oazs.NIOServerCnxn.closeSock Closed socket connection for client /127.0.0.1:49988 which had sessionid 0x13c6c36bfd60001
[junit4:junit4] 2> 258 T2039 oaz.ClientCnxn$EventThread.run EventThread shut down
[junit4:junit4] 2> 259 T2030 oaz.ZooKeeper.close Session: 0x13c6c36bfd60001 closed
[junit4:junit4] 2> 519 T2030 oejs.Server.doStart jetty-8.1.8.v20121106
[junit4:junit4] 2> 548 T2030 oejs.AbstractConnector.doStart Started SelectChannelConnector@127.0.0.1:49989
[junit4:junit4] 2> 549 T2030 oass.SolrDispatchFilter.init SolrDispatchFilter.init()
[junit4:junit4] 2> 549 T2030 oasc.SolrResourceLoader.locateSolrHome JNDI not configured for solr (NoInitialContextEx)
[junit4:junit4] 2> 549 T2030 oasc.SolrResourceLoader.locateSolrHome using system property solr.solr.home: /Users/jenkins/jenkins-slave/workspace/Lucene-Solr-trunk-MacOSX/solr/build/solr-core/test/J0/./org.apache.solr.cloud.BasicDistributedZkTest-controljetty-1359025193161
[junit4:junit4] 2> 550 T2030 oasc.CoreContainer$Initializer.initialize looking for solr.xml: /Users/jenkins/jenkins-slave/workspace/Lucene-Solr-trunk-MacOSX/solr/build/solr-core/test/J0/./org.apache.solr.cloud.BasicDistributedZkTest-controljetty-1359025193161/solr.xml
[junit4:junit4] 2> 550 T2030 oasc.CoreContainer.<init> New CoreContainer 1360367085
[junit4:junit4] 2> 550 T2030 oasc.CoreContainer.load Loading CoreContainer using Solr Home: '/Users/jenkins/jenkins-slave/workspace/Lucene-Solr-trunk-MacOSX/solr/build/solr-core/test/J0/./org.apache.solr.cloud.BasicDistributedZkTest-controljetty-1359025193161/'
[junit4:junit4] 2> 551 T2030 oasc.SolrResourceLoader.<init> new SolrResourceLoader for directory: '/Users/jenkins/jenkins-slave/workspace/Lucene-Solr-trunk-MacOSX/solr/build/solr-core/test/J0/./org.apache.solr.cloud.BasicDistributedZkTest-controljetty-1359025193161/'
[junit4:junit4] 2> 578 T2030 oashc.HttpShardHandlerFactory.getParameter Setting socketTimeout to: 60000
[junit4:junit4] 2> 578 T2030 oashc.HttpShardHandlerFactory.getParameter Setting urlScheme to: http://
[junit4:junit4] 2> 579 T2030 oashc.HttpShardHandlerFactory.getParameter Setting connTimeout to: 15000
[junit4:junit4] 2> 579 T2030 oashc.HttpShardHandlerFactory.getParameter Setting maxConnectionsPerHost to: 20
[junit4:junit4] 2> 580 T2030 oashc.HttpShardHandlerFactory.getParameter Setting corePoolSize to: 0
[junit4:junit4] 2> 580 T2030 oashc.HttpShardHandlerFactory.getParameter Setting maximumPoolSize to: 2147483647
[junit4:junit4] 2> 581 T2030 oashc.HttpShardHandlerFactory.getParameter Setting maxThreadIdleTime to: 5
[junit4:junit4] 2> 581 T2030 oashc.HttpShardHandlerFactory.getParameter Setting sizeOfQueue to: -1
[junit4:junit4] 2> 581 T2030 oashc.HttpShardHandlerFactory.getParameter Setting fairnessPolicy to: false
[junit4:junit4] 2> 582 T2030 oascsi.HttpClientUtil.createClient Creating new http client, config:maxConnectionsPerHost=20&maxConnections=10000&socketTimeout=60000&connTimeout=15000&retry=false
[junit4:junit4] 2> 603 T2030 oasc.CoreContainer.load Registering Log Listener
[junit4:junit4] 2> 644 T2030 oasc.CoreContainer.initZooKeeper Zookeeper client=127.0.0.1:49986/solr
[junit4:junit4] 2> 645 T2030 oasc.ZkController.checkChrootPath zkHost includes chroot
[junit4:junit4] 2> 645 T2030 oaz.ZooKeeper.<init> Initiating client connection, connectString=127.0.0.1:49986 sessionTimeout=60000 watcher=org.apache.solr.common.cloud.ConnectionManager@14959127
[junit4:junit4] 2> 647 T2049 oaz.ClientCnxn$SendThread.logStartConnect Opening socket connection to server localhost/127.0.0.1:49986. Will not attempt to authenticate using SASL (access denied ("javax.security.auth.AuthPermission" "getLoginConfiguration"))
[junit4:junit4] 2> 648 T2049 oaz.ClientCnxn$SendThread.primeConnection Socket connection established to localhost/127.0.0.1:49986, initiating session
[junit4:junit4] 2> 649 T2030 oascc.ConnectionManager.waitForConnected Waiting for client to connect to ZooKeeper
[junit4:junit4] 2> 652 T2032 oazs.NIOServerCnxnFactory.run Accepted socket connection from /127.0.0.1:49990
[junit4:junit4] 2> 655 T2032 oazs.ZooKeeperServer.processConnectRequest Client attempting to establish new session at /127.0.0.1:49990
[junit4:junit4] 2> 658 T2034 oazs.ZooKeeperServer.finishSessionInit Established session 0x13c6c36bfd60002 with negotiated timeout 20000 for client /127.0.0.1:49990
[junit4:junit4] 2> 658 T2049 oaz.ClientCnxn$SendThread.onConnected Session establishment complete on server localhost/127.0.0.1:49986, sessionid = 0x13c6c36bfd60002, negotiated timeout = 20000
[junit4:junit4] 2> 659 T2050 oascc.ConnectionManager.process Watcher org.apache.solr.common.cloud.ConnectionManager@14959127 name:ZooKeeperConnection Watcher:127.0.0.1:49986 got event WatchedEvent state:SyncConnected type:None path:null path:null type:None
[junit4:junit4] 2> 659 T2030 oascc.ConnectionManager.waitForConnected Client is connected to ZooKeeper
[junit4:junit4] 2> 662 T2035 oazs.PrepRequestProcessor.pRequest2Txn Processed session termination for sessionid: 0x13c6c36bfd60002
[junit4:junit4] 2> 663 T2032 oazs.NIOServerCnxn.closeSock Closed socket connection for client /127.0.0.1:49990 which had sessionid 0x13c6c36bfd60002
[junit4:junit4] 2> 664 T2050 oaz.ClientCnxn$EventThread.run EventThread shut down
[junit4:junit4] 2> 664 T2030 oaz.ZooKeeper.close Session: 0x13c6c36bfd60002 closed
[junit4:junit4] 2> 665 T2030 oascsi.HttpClientUtil.createClient Creating new http client, config:maxConnections=500&maxConnectionsPerHost=16&socketTimeout=60000&connTimeout=15000
[junit4:junit4] 2> 669 T2030 oaz.ZooKeeper.<init> Initiating client connection, connectString=127.0.0.1:49986/solr sessionTimeout=30000 watcher=org.apache.solr.common.cloud.ConnectionManager@7860af85
[junit4:junit4] 2> 671 T2030 oascc.ConnectionManager.waitForConnected Waiting for client to connect to ZooKeeper
[junit4:junit4] 2> 671 T2051 oaz.ClientCnxn$SendThread.logStartConnect Opening socket connection to server localhost/127.0.0.1:49986. Will not attempt to authenticate using SASL (access denied ("javax.security.auth.AuthPermission" "getLoginConfiguration"))
[junit4:junit4] 2> 672 T2051 oaz.ClientCnxn$SendThread.primeConnection Socket connection established to localhost/127.0.0.1:49986, initiating session
[junit4:junit4] 2> 673 T2032 oazs.NIOServerCnxnFactory.run Accepted socket connection from /127.0.0.1:49991
[junit4:junit4] 2> 673 T2032 oazs.ZooKeeperServer.processConnectRequest Client attempting to establish new session at /127.0.0.1:49991
[junit4:junit4] 2> 675 T2034 oazs.ZooKeeperServer.finishSessionInit Established session 0x13c6c36bfd60003 with negotiated timeout 20000 for client /127.0.0.1:49991
[junit4:junit4] 2> 675 T2051 oaz.ClientCnxn$SendThread.onConnected Session establishment complete on server localhost/127.0.0.1:49986, sessionid = 0x13c6c36bfd60003, negotiated timeout = 20000
[junit4:junit4] 2> 676 T2052 oascc.ConnectionManager.process Watcher org.apache.solr.common.cloud.ConnectionManager@7860af85 name:ZooKeeperConnection Watcher:127.0.0.1:49986/solr got event WatchedEvent state:SyncConnected type:None path:null path:null type:None
[junit4:junit4] 2> 676 T2030 oascc.ConnectionManager.waitForConnected Client is connected to ZooKeeper
[junit4:junit4] 2> 679 T2035 oazs.PrepRequestProcessor.pRequest Got user-level KeeperException when processing sessionid:0x13c6c36bfd60003 type:create cxid:0x2 zxid:0x1a txntype:-1 reqpath:n/a Error Path:/solr/overseer Error:KeeperErrorCode = NodeExists for /solr/overseer
[junit4:junit4] 2> 681 T2030 oascc.SolrZkClient.makePath makePath: /live_nodes
[junit4:junit4] 2> 686 T2030 oasc.ZkController.createEphemeralLiveNode Register node as live in ZooKeeper:/live_nodes/127.0.0.1:49989_
[junit4:junit4] 2> 687 T2035 oazs.PrepRequestProcessor.pRequest Got user-level KeeperException when processing sessionid:0x13c6c36bfd60003 type:delete cxid:0x7 zxid:0x1c txntype:-1 reqpath:n/a Error Path:/solr/live_nodes/127.0.0.1:49989_ Error:KeeperErrorCode = NoNode for /solr/live_nodes/127.0.0.1:49989_
[junit4:junit4] 2> 688 T2030 oascc.SolrZkClient.makePath makePath: /live_nodes/127.0.0.1:49989_
[junit4:junit4] 2> 694 T2030 oascc.SolrZkClient.makePath makePath: /overseer_elect/election
[junit4:junit4] 2> 702 T2035 oazs.PrepRequestProcessor.pRequest Got user-level KeeperException when processing sessionid:0x13c6c36bfd60003 type:delete cxid:0x15 zxid:0x21 txntype:-1 reqpath:n/a Error Path:/solr/overseer_elect/leader Error:KeeperErrorCode = NoNode for /solr/overseer_elect/leader
[junit4:junit4] 2> 703 T2030 oascc.SolrZkClient.makePath makePath: /overseer_elect/leader
[junit4:junit4] 2> 708 T2030 oasc.Overseer.start Overseer (id=89065075043074051-127.0.0.1:49989_-n_0000000000) starting
[junit4:junit4] 2> 708 T2035 oazs.PrepRequestProcessor.pRequest Got user-level KeeperException when processing sessionid:0x13c6c36bfd60003 type:create cxid:0x1a zxid:0x23 txntype:-1 reqpath:n/a Error Path:/solr/overseer Error:KeeperErrorCode = NodeExists for /solr/overseer
[junit4:junit4] 2> 710 T2035 oazs.PrepRequestProcessor.pRequest Got user-level KeeperException when processing sessionid:0x13c6c36bfd60003 type:create cxid:0x1b zxid:0x24 txntype:-1 reqpath:n/a Error Path:/solr/overseer Error:KeeperErrorCode = NodeExists for /solr/overseer
[junit4:junit4] 2> 711 T2035 oazs.PrepRequestProcessor.pRequest Got user-level KeeperException when processing sessionid:0x13c6c36bfd60003 type:create cxid:0x1c zxid:0x25 txntype:-1 reqpath:n/a Error Path:/solr/overseer Error:KeeperErrorCode = NodeExists for /solr/overseer
[junit4:junit4] 2> 713 T2035 oazs.PrepRequestProcessor.pRequest Got user-level KeeperException when processing sessionid:0x13c6c36bfd60003 type:create cxid:0x1d zxid:0x26 txntype:-1 reqpath:n/a Error Path:/solr/overseer Error:KeeperErrorCode = NodeExists for /solr/overseer
[junit4:junit4] 2> 718 T2054 oasc.OverseerCollectionProcessor.run Process current queue of collection messages
[junit4:junit4] 2> 724 T2030 oascc.SolrZkClient.makePath makePath: /clusterstate.json
[junit4:junit4] 2> 729 T2030 oascc.ZkStateReader.createClusterStateWatchersAndUpdate Updating cluster state from ZooKeeper...
[junit4:junit4] 2> 733 T2053 oasc.Overseer$ClusterStateUpdater.run Starting to work on the main queue
[junit4:junit4] 2> 738 T2055 oasc.CoreContainer.create Creating SolrCore 'collection1' using instanceDir: /Users/jenkins/jenkins-slave/workspace/Lucene-Solr-trunk-MacOSX/solr/build/solr-core/test/J0/./org.apache.solr.cloud.BasicDistributedZkTest-controljetty-1359025193161/collection1
[junit4:junit4] 2> 739 T2055 oasc.ZkController.createCollectionZkNode Check for collection zkNode:control_collection
[junit4:junit4] 2> 740 T2055 oasc.ZkController.createCollectionZkNode Collection zkNode exists
[junit4:junit4] 2> 740 T2055 oasc.ZkController.readConfigName Load collection config from:/collections/control_collection
[junit4:junit4] 2> 742 T2055 oasc.SolrResourceLoader.<init> new SolrResourceLoader for directory: '/Users/jenkins/jenkins-slave/workspace/Lucene-Solr-trunk-MacOSX/solr/build/solr-core/test/J0/./org.apache.solr.cloud.BasicDistributedZkTest-controljetty-1359025193161/collection1/'
[junit4:junit4] 2> 743 T2055 oasc.SolrResourceLoader.replaceClassLoader Adding 'file:/Users/jenkins/jenkins-slave/workspace/Lucene-Solr-trunk-MacOSX/solr/build/solr-core/test/J0/org.apache.solr.cloud.BasicDistributedZkTest-controljetty-1359025193161/collection1/lib/classes/' to classloader
[junit4:junit4] 2> 744 T2055 oasc.SolrResourceLoader.replaceClassLoader Adding 'file:/Users/jenkins/jenkins-slave/workspace/Lucene-Solr-trunk-MacOSX/solr/build/solr-core/test/J0/org.apache.solr.cloud.BasicDistributedZkTest-controljetty-1359025193161/collection1/lib/README' to classloader
[junit4:junit4] 2> 799 T2055 oasc.SolrConfig.<init> Using Lucene MatchVersion: LUCENE_50
[junit4:junit4] 2> 897 T2055 oasc.SolrConfig.<init> Loaded SolrConfig: solrconfig.xml
[junit4:junit4] 2> 899 T2055 oass.IndexSchema.readSchema Reading Solr Schema
[junit4:junit4] 2> 904 T2055 oass.IndexSchema.readSchema Schema name=test
[junit4:junit4] 2> 1797 T2055 oass.OpenExchangeRatesOrgProvider.init Initialized with rates=open-exchange-rates.json, refreshInterval=1440.
[junit4:junit4] 2> 1808 T2055 oass.IndexSchema.readSchema default search field in schema is text
[junit4:junit4] 2> 1812 T2055 oass.IndexSchema.readSchema unique key field: id
[junit4:junit4] 2> 1834 T2055 oass.FileExchangeRateProvider.reload Reloading exchange rates from file currency.xml
[junit4:junit4] 2> 1840 T2055 oass.FileExchangeRateProvider.reload Reloading exchange rates from file currency.xml
[junit4:junit4] 2> 1860 T2055 oass.OpenExchangeRatesOrgProvider.reload Reloading exchange rates from open-exchange-rates.json
[junit4:junit4] 2> 1862 T2055 oass.OpenExchangeRatesOrgProvider.reload Reloading exchange rates from open-exchange-rates.json
[junit4:junit4] 2> 1868 T2055 oasc.SolrCore.<init> [collection1] Opening new SolrCore at /Users/jenkins/jenkins-slave/workspace/Lucene-Solr-trunk-MacOSX/solr/build/solr-core/test/J0/./org.apache.solr.cloud.BasicDistributedZkTest-controljetty-1359025193161/collection1/, dataDir=./org.apache.solr.cloud.BasicDistributedZkTest-1359025192910/control/data/
[junit4:junit4] 2> 1868 T2055 oasc.JmxMonitoredMap.<init> JMX monitoring is enabled. Adding Solr mbeans to JMX Server: com.sun.jmx.mbeanserver.JmxMBeanServer@7affa511
[junit4:junit4] 2> 1869 T2055 oasc.SolrCore.initDirectoryFactory solr.NRTCachingDirectoryFactory
[junit4:junit4] 2> 1870 T2055 oasc.CachingDirectoryFactory.get return new directory for /Users/jenkins/jenkins-slave/workspace/Lucene-Solr-trunk-MacOSX/solr/build/solr-core/test/J0/./org.apache.solr.cloud.BasicDistributedZkTest-1359025192910/control/data forceNew:false
[junit4:junit4] 2> 1870 T2055 oasc.CachingDirectoryFactory.close Releasing directory:/Users/jenkins/jenkins-slave/workspace/Lucene-Solr-trunk-MacOSX/solr/build/solr-core/test/J0/./org.apache.solr.cloud.BasicDistributedZkTest-1359025192910/control/data
[junit4:junit4] 2> 1870 T2055 oasc.SolrCore.getNewIndexDir New index directory detected: old=null new=./org.apache.solr.cloud.BasicDistributedZkTest-1359025192910/control/data/index/
[junit4:junit4] 2> 1871 T2055 oasc.SolrCore.initIndex WARNING [collection1] Solr index directory './org.apache.solr.cloud.BasicDistributedZkTest-1359025192910/control/data/index' doesn't exist. Creating new index...
[junit4:junit4] 2> 1871 T2055 oasc.CachingDirectoryFactory.get return new directory for /Users/jenkins/jenkins-slave/workspace/Lucene-Solr-trunk-MacOSX/solr/build/solr-core/test/J0/./org.apache.solr.cloud.BasicDistributedZkTest-1359025192910/control/data/index forceNew:false
[junit4:junit4] 2> 1877 T2055 oasc.SolrDeletionPolicy.onCommit SolrDeletionPolicy.onCommit: commits:num=1
[junit4:junit4] 2> commit{dir=RateLimitedDirectoryWrapper(NRTCachingDirectory(org.apache.lucene.store.NIOFSDirectory@/Users/jenkins/jenkins-slave/workspace/Lucene-Solr-trunk-MacOSX/solr/build/solr-core/test/J0/org.apache.solr.cloud.BasicDistributedZkTest-1359025192910/control/data/index lockFactory=org.apache.lucene.store.NativeFSLockFactory@37e41851; maxCacheMB=48.0 maxMergeSizeMB=4.0)),segFN=segments_1,generation=1,filenames=[segments_1]
[junit4:junit4] 2> 1878 T2055 oasc.SolrDeletionPolicy.updateCommits newest commit = 1[segments_1]
[junit4:junit4] 2> 1878 T2055 oasc.CachingDirectoryFactory.close Releasing directory:/Users/jenkins/jenkins-slave/workspace/Lucene-Solr-trunk-MacOSX/solr/build/solr-core/test/J0/./org.apache.solr.cloud.BasicDistributedZkTest-1359025192910/control/data/index
[junit4:junit4] 2> 1879 T2055 oasc.SolrCore.initWriters created xml: solr.XMLResponseWriter
[junit4:junit4] 2> 1881 T2055 oasup.UpdateRequestProcessorChain.init inserting DistributedUpdateProcessorFactory into updateRequestProcessorChain "dedupe"
[junit4:junit4] 2> 1882 T2055 oasup.UpdateRequestProcessorChain.init inserting DistributedUpdateProcessorFactory into updateRequestProcessorChain "dedupe-allfields"
[junit4:junit4] 2> 1882 T2055 oasup.UpdateRequestProcessorChain.init inserting DistributedUpdateProcessorFactory into updateRequestProcessorChain "stored_sig"
[junit4:junit4] 2> 1882 T2055 oasup.UpdateRequestProcessorChain.init inserting DistributedUpdateProcessorFactory into updateRequestProcessorChain "uniq-fields"
[junit4:junit4] 2> 1884 T2055 oasup.UpdateRequestProcessorChain.init inserting DistributedUpdateProcessorFactory into updateRequestProcessorChain "distrib-dup-test-chain-implicit"
[junit4:junit4] 2> 1884 T2055 oasc.RequestHandlers.initHandlersFromConfig adding lazy requestHandler: solr.ReplicationHandler
[junit4:junit4] 2> 1884 T2055 oasc.RequestHandlers.initHandlersFromConfig created /replication: solr.ReplicationHandler
[junit4:junit4] 2> 1885 T2055 oasc.RequestHandlers.initHandlersFromConfig created standard: solr.StandardRequestHandler
[junit4:junit4] 2> 1885 T2055 oasc.RequestHandlers.initHandlersFromConfig created /get: solr.RealTimeGetHandler
[junit4:junit4] 2> 1887 T2055 oasc.RequestHandlers.initHandlersFromConfig created dismax: solr.SearchHandler
[junit4:junit4] 2> 1887 T2055 oasc.RequestHandlers.initHandlersFromConfig created mock: org.apache.solr.core.MockQuerySenderListenerReqHandler
[junit4:junit4] 2> 1888 T2055 oasc.RequestHandlers.initHandlersFromConfig created /admin/: org.apache.solr.handler.admin.AdminHandlers
[junit4:junit4] 2> 1888 T2055 oasc.RequestHandlers.initHandlersFromConfig created defaults: solr.StandardRequestHandler
[junit4:junit4] 2> 1889 T2055 oasc.RequestHandlers.initHandlersFromConfig adding lazy requestHandler: solr.StandardRequestHandler
[junit4:junit4] 2> 1889 T2055 oasc.RequestHandlers.initHandlersFromConfig created lazy: solr.StandardRequestHandler
[junit4:junit4] 2> 1890 T2055 oasc.RequestHandlers.initHandlersFromConfig created /update: solr.UpdateRequestHandler
[junit4:junit4] 2> 1890 T2055 oasc.RequestHandlers.initHandlersFromConfig created /terms: org.apache.solr.handler.component.SearchHandler
[junit4:junit4] 2> 1891 T2055 oasc.RequestHandlers.initHandlersFromConfig created spellCheckCompRH: org.apache.solr.handler.component.SearchHandler
[junit4:junit4] 2> 1891 T2055 oasc.RequestHandlers.initHandlersFromConfig created spellCheckCompRH_Direct: org.apache.solr.handler.component.SearchHandler
[junit4:junit4] 2> 1892 T2055 oasc.RequestHandlers.initHandlersFromConfig created spellCheckWithWordbreak: org.apache.solr.handler.component.SearchHandler
[junit4:junit4] 2> 1892 T2055 oasc.RequestHandlers.initHandlersFromConfig created spellCheckWithWordbreak_Direct: org.apache.solr.handler.component.SearchHandler
[junit4:junit4] 2> 1893 T2055 oasc.RequestHandlers.initHandlersFromConfig created spellCheckCompRH1: org.apache.solr.handler.component.SearchHandler
[junit4:junit4] 2> 1893 T2055 oasc.RequestHandlers.initHandlersFromConfig created mltrh: org.apache.solr.handler.component.SearchHandler
[junit4:junit4] 2> 1894 T2055 oasc.RequestHandlers.initHandlersFromConfig created tvrh: org.apache.solr.handler.component.SearchHandler
[junit4:junit4] 2> 1894 T2055 oasc.RequestHandlers.initHandlersFromConfig created /mlt: solr.MoreLikeThisHandler
[junit4:junit4] 2> 1895 T2055 oasc.RequestHandlers.initHandlersFromConfig created /debug/dump: solr.DumpRequestHandler
[junit4:junit4] 2> 1901 T2055 oashl.XMLLoader.init xsltCacheLifetimeSeconds=60
[junit4:junit4] 2> 1905 T2055 oasc.SolrCore.initDeprecatedSupport WARNING solrconfig.xml uses deprecated <admin/gettableFiles>, Please update your config to use the ShowFileRequestHandler.
[junit4:junit4] 2> 1906 T2055 oasc.SolrCore.initDeprecatedSupport WARNING adding ShowFileRequestHandler with hidden files: [SCHEMA.XML, OLD_SYNONYMS.TXT, STOPWORDS.TXT, PROTWORDS.TXT, OPEN-EXCHANGE-RATES.JSON, SYNONYMS.TXT, CURRENCY.XML, MAPPING-ISOLATIN1ACCENT.TXT]
[junit4:junit4] 2> 1909 T2055 oasc.CachingDirectoryFactory.close Releasing directory:/Users/jenkins/jenkins-slave/workspace/Lucene-Solr-trunk-MacOSX/solr/build/solr-core/test/J0/./org.apache.solr.cloud.BasicDistributedZkTest-1359025192910/control/data
[junit4:junit4] 2> 1910 T2055 oass.SolrIndexSearcher.<init> Opening Searcher@30fd282 main
[junit4:junit4] 2> 1911 T2055 oasu.CommitTracker.<init> Hard AutoCommit: disabled
[junit4:junit4] 2> 1912 T2055 oasu.CommitTracker.<init> Soft AutoCommit: disabled
[junit4:junit4] 2> 1914 T2055 oashc.SpellCheckComponent.inform Initializing spell checkers
[junit4:junit4] 2> 1923 T2055 oass.DirectSolrSpellChecker.init init: {name=direct,classname=DirectSolrSpellChecker,field=lowerfilt,minQueryLength=3}
[junit4:junit4] 2> 1959 T2056 oasc.SolrCore.registerSearcher [collection1] Registered new searcher Searcher@30fd282 main{StandardDirectoryReader(segments_1:1)}
[junit4:junit4] 2> 1967 T2055 oasc.ZkController.publish publishing core=collection1 state=down
[junit4:junit4] 2> 1967 T2055 oasc.ZkController.publish numShards not found on descriptor - reading it from system property
[junit4:junit4] 2> 1968 T2035 oazs.PrepRequestProcessor.pRequest Got user-level KeeperException when processing sessionid:0x13c6c36bfd60003 type:create cxid:0x50 zxid:0x29 txntype:-1 reqpath:n/a Error Path:/solr/overseer/queue Error:KeeperErrorCode = NoNode for /solr/overseer/queue
[junit4:junit4] 2> 2239 T2053 oascc.ZkStateReader.updateClusterState Updating cloud state from ZooKeeper...
[junit4:junit4] 2> 2240 T2053 oasc.Overseer$ClusterStateUpdater.updateState Update state numShards=1 message={
[junit4:junit4] 2> "operation":"state",
[junit4:junit4] 2> "numShards":"1",
[junit4:junit4] 2> "shard":null,
[junit4:junit4] 2> "roles":null,
[junit4:junit4] 2> "state":"down",
[junit4:junit4] 2> "core":"collection1",
[junit4:junit4] 2> "collection":"control_collection",
[junit4:junit4] 2> "node_name":"127.0.0.1:49989_",
[junit4:junit4] 2> "base_url":"http://127.0.0.1:49989"}
[junit4:junit4] 2> 2240 T2053 oasc.Overseer$ClusterStateUpdater.createCollection Create collection control_collection with numShards 1
[junit4:junit4] 2> 2240 T2053 oasc.Overseer$ClusterStateUpdater.updateState Assigning new node to shard shard=shard1
[junit4:junit4] 2> 2241 T2035 oazs.PrepRequestProcessor.pRequest Got user-level KeeperException when processing sessionid:0x13c6c36bfd60003 type:create cxid:0x58 zxid:0x2c txntype:-1 reqpath:n/a Error Path:/solr/overseer/queue-work Error:KeeperErrorCode = NoNode for /solr/overseer/queue-work
[junit4:junit4] 2> 2255 T2052 oascc.ZkStateReader$2.process A cluster state change: WatchedEvent state:SyncConnected type:NodeDataChanged path:/clusterstate.json, has occurred - updating... (live nodes size: 1)
[junit4:junit4] 2> 2973 T2055 oasc.CoreContainer.registerCore registering core: collection1
[junit4:junit4] 2> 2973 T2055 oasc.ZkController.register Register replica - core:collection1 address:http://127.0.0.1:49989 collection:control_collection shard:shard1
[junit4:junit4] 2> 2982 T2055 oascc.SolrZkClient.makePath makePath: /collections/control_collection/leader_elect/shard1/election
[junit4:junit4] 2> 2992 T2035 oazs.PrepRequestProcessor.pRequest Got user-level KeeperException when processing sessionid:0x13c6c36bfd60003 type:delete cxid:0x72 zxid:0x36 txntype:-1 reqpath:n/a Error Path:/solr/collections/control_collection/leaders Error:KeeperErrorCode = NoNode for /solr/collections/control_collection/leaders
[junit4:junit4] 2> 2993 T2055 oasc.ShardLeaderElectionContext.runLeaderProcess Running the leader process.
[junit4:junit4] 2> 2994 T2035 oazs.PrepRequestProcessor.pRequest Got user-level KeeperException when processing sessionid:0x13c6c36bfd60003 type:create cxid:0x73 zxid:0x37 txntype:-1 reqpath:n/a Error Path:/solr/overseer Error:KeeperErrorCode = NodeExists for /solr/overseer
[junit4:junit4] 2> 2996 T2055 oasc.ShardLeaderElectionContext.waitForReplicasToComeUp Enough replicas found to continue.
[junit4:junit4] 2> 2996 T2055 oasc.ShardLeaderElectionContext.runLeaderProcess I may be the new leader - try and sync
[junit4:junit4] 2> 2996 T2055 oasc.SyncStrategy.sync Sync replicas to http://127.0.0.1:49989/collection1/
[junit4:junit4] 2> 2997 T2055 oasc.SyncStrategy.syncReplicas Sync Success - now sync replicas to me
[junit4:junit4] 2> 2997 T2055 oasc.SyncStrategy.syncToMe http://127.0.0.1:49989/collection1/ has no replicas
[junit4:junit4] 2> 2997 T2055 oasc.ShardLeaderElectionContext.runLeaderProcess I am the new leader: http://127.0.0.1:49989/collection1/
[junit4:junit4] 2> 2997 T2055 oascc.SolrZkClient.makePath makePath: /collections/control_collection/leaders/shard1
[junit4:junit4] 2> 3004 T2035 oazs.PrepRequestProcessor.pRequest Got user-level KeeperException when processing sessionid:0x13c6c36bfd60003 type:create cxid:0x7d zxid:0x3b txntype:-1 reqpath:n/a Error Path:/solr/overseer Error:KeeperErrorCode = NodeExists for /solr/overseer
[junit4:junit4] 2> 3763 T2053 oascc.ZkStateReader.updateClusterState Updating cloud state from ZooKeeper...
[junit4:junit4] 2> 3777 T2052 oascc.ZkStateReader$2.process A cluster state change: WatchedEvent state:SyncConnected type:NodeDataChanged path:/clusterstate.json, has occurred - updating... (live nodes size: 1)
[junit4:junit4] 2> 3813 T2055 oasc.ZkController.register We are http://127.0.0.1:49989/collection1/ and leader is http://127.0.0.1:49989/collection1/
[junit4:junit4] 2> 3817 T2055 oasc.ZkController.register No LogReplay needed for core=collection1 baseURL=http://127.0.0.1:49989
[junit4:junit4] 2> 3818 T2055 oasc.ZkController.checkRecovery I am the leader, no recovery necessary
[junit4:junit4] 2> 3818 T2055 oasc.ZkController.publish publishing core=collection1 state=active
[junit4:junit4] 2> 3818 T2055 oasc.ZkController.publish numShards not found on descriptor - reading it from system property
[junit4:junit4] 2> 3823 T2055 oascc.ZkStateReader.updateClusterState Updating cloud state from ZooKeeper...
[junit4:junit4] 2> 3824 T2030 oass.SolrDispatchFilter.init user.dir=/Users/jenkins/jenkins-slave/workspace/Lucene-Solr-trunk-MacOSX/solr/build/solr-core/test/J0
[junit4:junit4] 2> 3825 T2030 oass.SolrDispatchFilter.init SolrDispatchFilter.init() done
[junit4:junit4] 2> 3825 T2030 oascsi.HttpClientUtil.createClient Creating new http client, config:maxConnections=128&maxConnectionsPerHost=32&followRedirects=false
[junit4:junit4] 2> 3831 T2030 oascsi.HttpClientUtil.createClient Creating new http client, config:
[junit4:junit4] 2> 3835 T2030 oaz.ZooKeeper.<init> Initiating client connection, connectString=127.0.0.1:49986/solr sessionTimeout=10000 watcher=org.apache.solr.common.cloud.ConnectionManager@7542ff45
[junit4:junit4] 2> 3836 T2030 oascc.ConnectionManager.waitForConnected Waiting for client to connect to ZooKeeper
[junit4:junit4] 2> 3837 T2057 oaz.ClientCnxn$SendThread.logStartConnect Opening socket connection to server localhost/127.0.0.1:49986. Will not attempt to authenticate using SASL (access denied ("javax.security.auth.AuthPermission" "getLoginConfiguration"))
[junit4:junit4] 2> 3838 T2057 oaz.ClientCnxn$SendThread.primeConnection Socket connection established to localhost/127.0.0.1:49986, initiating session
[junit4:junit4] 2> 3838 T2032 oazs.NIOServerCnxnFactory.run Accepted socket connection from /127.0.0.1:49992
[junit4:junit4] 2> 3838 T2032 oazs.ZooKeeperServer.processConnectRequest Client attempting to establish new session at /127.0.0.1:49992
[junit4:junit4] 2> 3840 T2034 oazs.ZooKeeperServer.finishSessionInit Established session 0x13c6c36bfd60004 with negotiated timeout 10000 for client /127.0.0.1:49992
[junit4:junit4] 2> 3840 T2057 oaz.ClientCnxn$SendThread.onConnected Session establishment complete on server localhost/127.0.0.1:49986, sessionid = 0x13c6c36bfd60004, negotiated timeout = 10000
[junit4:junit4] 2> 3840 T2058 oascc.ConnectionManager.process Watcher org.apache.solr.common.cloud.ConnectionManager@7542ff45 name:ZooKeeperConnection Watcher:127.0.0.1:49986/solr got event WatchedEvent state:SyncConnected type:None path:null path:null type:None
[junit4:junit4] 2> 3841 T2030 oascc.ConnectionManager.waitForConnected Client is connected to ZooKeeper
[junit4:junit4] 2> 3843 T2030 oascc.ZkStateReader.createClusterStateWatchersAndUpdate Updating cluster state from ZooKeeper...
[junit4:junit4] 2> 3845 T2030 oasc.ChaosMonkey.monkeyLog monkey: init - expire sessions:true cause connection loss:true
[junit4:junit4] 2> 4038 T2030 oejs.Server.doStart jetty-8.1.8.v20121106
[junit4:junit4] 2> 4042 T2030 oejs.AbstractConnector.doStart Started SelectChannelConnector@127.0.0.1:49993
[junit4:junit4] 2> 4043 T2030 oass.SolrDispatchFilter.init SolrDispatchFilter.init()
[junit4:junit4] 2> 4043 T2030 oasc.SolrResourceLoader.locateSolrHome JNDI not configured for solr (NoInitialContextEx)
[junit4:junit4] 2> 4044 T2030 oasc.SolrResourceLoader.locateSolrHome using system property solr.solr.home: /Users/jenkins/jenkins-slave/workspace/Lucene-Solr-trunk-MacOSX/solr/build/solr-core/test/J0/./org.apache.solr.cloud.BasicDistributedZkTest-jetty1-1359025196746
[junit4:junit4] 2> 4044 T2030 oasc.CoreContainer$Initializer.initialize looking for solr.xml: /Users/jenkins/jenkins-slave/workspace/Lucene-Solr-trunk-MacOSX/solr/build/solr-core/test/J0/./org.apache.solr.cloud.BasicDistributedZkTest-jetty1-1359025196746/solr.xml
[junit4:junit4] 2> 4045 T2030 oasc.CoreContainer.<init> New CoreContainer 711413395
[junit4:junit4] 2> 4046 T2030 oasc.CoreContainer.load Loading CoreContainer using Solr Home: '/Users/jenkins/jenkins-slave/workspace/Lucene-Solr-trunk-MacOSX/solr/build/solr-core/test/J0/./org.apache.solr.cloud.BasicDistributedZkTest-jetty1-1359025196746/'
[junit4:junit4] 2> 4046 T2030 oasc.SolrResourceLoader.<init> new SolrResourceLoader for directory: '/Users/jenkins/jenkins-slave/workspace/Lucene-Solr-trunk-MacOSX/solr/build/solr-core/test/J0/./org.apache.solr.cloud.BasicDistributedZkTest-jetty1-1359025196746/'
[junit4:junit4] 2> 4087 T2030 oashc.HttpShardHandlerFactory.getParameter Setting socketTimeout to: 60000
[junit4:junit4] 2> 4087 T2030 oashc.HttpShardHandlerFactory.getParameter Setting urlScheme to: http://
[junit4:junit4] 2> 4088 T2030 oashc.HttpShardHandlerFactory.getParameter Setting connTimeout to: 15000
[junit4:junit4] 2> 4088 T2030 oashc.HttpShardHandlerFactory.getParameter Setting maxConnectionsPerHost to: 20
[junit4:junit4] 2> 4089 T2030 oashc.HttpShardHandlerFactory.getParameter Setting corePoolSize to: 0
[junit4:junit4] 2> 4089 T2030 oashc.HttpShardHandlerFactory.getParameter Setting maximumPoolSize to: 2147483647
[junit4:junit4] 2> 4090 T2030 oashc.HttpShardHandlerFactory.getParameter Setting maxThreadIdleTime to: 5
[junit4:junit4] 2> 4090 T2030 oashc.HttpShardHandlerFactory.getParameter Setting sizeOfQueue to: -1
[junit4:junit4] 2> 4091 T2030 oashc.HttpShardHandlerFactory.getParameter Setting fairnessPolicy to: false
[junit4:junit4] 2> 4092 T2030 oascsi.HttpClientUtil.createClient Creating new http client, config:maxConnectionsPerHost=20&maxConnections=10000&socketTimeout=60000&connTimeout=15000&retry=false
[junit4:junit4] 2> 4105 T2030 oasc.CoreContainer.load Registering Log Listener
[junit4:junit4] 2> 4158 T2030 oasc.CoreContainer.initZooKeeper Zookeeper client=127.0.0.1:49986/solr
[junit4:junit4] 2> 4159 T2030 oasc.ZkController.checkChrootPath zkHost includes chroot
[junit4:junit4] 2> 4160 T2030 oaz.ZooKeeper.<init> Initiating client connection, connectString=127.0.0.1:49986 sessionTimeout=60000 watcher=org.apache.solr.common.cloud.ConnectionManager@fad4b0b
[junit4:junit4] 2> 4161 T2030 oascc.ConnectionManager.waitForConnected Waiting for client to connect to ZooKeeper
[junit4:junit4] 2> 4162 T2068 oaz.ClientCnxn$SendThread.logStartConnect Opening socket connection to server localhost/127.0.0.1:49986. Will not attempt to authenticate using SASL (access denied ("javax.security.auth.AuthPermission" "getLoginConfiguration"))
[junit4:junit4] 2> 4163 T2068 oaz.ClientCnxn$SendThread.primeConnection Socket connection established to localhost/127.0.0.1:49986, initiating session
[junit4:junit4] 2> 4163 T2032 oazs.NIOServerCnxnFactory.run Accepted socket connection from /127.0.0.1:49994
[junit4:junit4] 2> 4164 T2032 oazs.ZooKeeperServer.processConnectRequest Client attempting to establish new session at /127.0.0.1:49994
[junit4:junit4] 2> 4165 T2034 oazs.ZooKeeperServer.finishSessionInit Established session 0x13c6c36bfd60005 with negotiated timeout 20000 for client /127.0.0.1:49994
[junit4:junit4] 2> 4165 T2068 oaz.ClientCnxn$SendThread.onConnected Session establishment complete on server localhost/127.0.0.1:49986, sessionid = 0x13c6c36bfd60005, negotiated timeout = 20000
[junit4:junit4] 2> 4165 T2069 oascc.ConnectionManager.process Watcher org.apache.solr.common.cloud.ConnectionManager@fad4b0b name:ZooKeeperConnection Watcher:127.0.0.1:49986 got event WatchedEvent state:SyncConnected type:None path:null path:null type:None
[junit4:junit4] 2> 4166 T2030 oascc.ConnectionManager.waitForConnected Client is connected to ZooKeeper
[junit4:junit4] 2> 4168 T2035 oazs.PrepRequestProcessor.pRequest2Txn Processed session termination for sessionid: 0x13c6c36bfd60005
[junit4:junit4] 2> 4169 T2032 oazs.NIOServerCnxn.closeSock Closed socket connection for client /127.0.0.1:49994 which had sessionid 0x13c6c36bfd60005
[junit4:junit4] 2> 4169 T2069 oaz.ClientCnxn$EventThread.run EventThread shut down
[junit4:junit4] 2> 4169 T2030 oaz.ZooKeeper.close Session: 0x13c6c36bfd60005 closed
[junit4:junit4] 2> 4175 T2030 oascsi.HttpClientUtil.createClient Creating new http client, config:maxConnections=500&maxConnectionsPerHost=16&socketTimeout=60000&connTimeout=15000
[junit4:junit4] 2> 4179 T2030 oaz.ZooKeeper.<init> Initiating client connection, connectString=127.0.0.1:49986/solr sessionTimeout=30000 watcher=org.apache.solr.common.cloud.ConnectionManager@6b5d6833
[junit4:junit4] 2> 4181 T2070 oaz.ClientCnxn$SendThread.logStartConnect Opening socket connection to server localhost/127.0.0.1:49986. Will not attempt to authenticate using SASL (access denied ("javax.security.auth.AuthPermission" "getLoginConfiguration"))
[junit4:junit4] 2> 4182 T2032 oazs.NIOServerCnxnFactory.run Accepted socket connection from /127.0.0.1:49995
[junit4:junit4] 2> 4183 T2070 oaz.ClientCnxn$SendThread.primeConnection Socket connection established to localhost/127.0.0.1:49986, initiating session
[junit4:junit4] 2> 4183 T2030 oascc.ConnectionManager.waitForConnected Waiting for client to connect to ZooKeeper
[junit4:junit4] 2> 4184 T2032 oazs.ZooKeeperServer.processConnectRequest Client attempting to establish new session at /127.0.0.1:49995
[junit4:junit4] 2> 4185 T2034 oazs.ZooKeeperServer.finishSessionInit Established session 0x13c6c36bfd60006 with negotiated timeout 20000 for client /127.0.0.1:49995
[junit4:junit4] 2> 4186 T2070 oaz.ClientCnxn$SendThread.onConnected Session establishment complete on server localhost/127.0.0.1:49986, sessionid = 0x13c6c36bfd60006, negotiated timeout = 20000
[junit4:junit4] 2> 4186 T2071 oascc.ConnectionManager.process Watcher org.apache.solr.common.cloud.ConnectionManager@6b5d6833 name:ZooKeeperConnection Watcher:127.0.0.1:49986/solr got event WatchedEvent state:SyncConnected type:None path:null path:null type:None
[junit4:junit4] 2> 4186 T2030 oascc.ConnectionManager.waitForConnected Client is connected to ZooKeeper
[junit4:junit4] 2> 4188 T2035 oazs.PrepRequestProcessor.pRequest Got user-level KeeperException when processing sessionid:0x13c6c36bfd60006 type:create cxid:0x1 zxid:0x49 txntype:-1 reqpath:n/a Error Path:/solr/overseer Error:KeeperErrorCode = NodeExists for /solr/overseer
[junit4:junit4] 2> 4189 T2035 oazs.PrepRequestProcessor.pRequest Got user-level KeeperException when processing sessionid:0x13c6c36bfd60006 type:create cxid:0x2 zxid:0x4a txntype:-1 reqpath:n/a Error Path:/solr/overseer Error:KeeperErrorCode = NodeExists for /solr/overseer
[junit4:junit4] 2> 4191 T2030 oasc.ZkController.createEphemeralLiveNode Register node as live in ZooKeeper:/live_nodes/127.0.0.1:49993_
[junit4:junit4] 2> 4192 T2035 oazs.PrepRequestProcessor.pRequest Got user-level KeeperException when processing sessionid:0x13c6c36bfd60006 type:delete cxid:0x4 zxid:0x4b txntype:-1 reqpath:n/a Error Path:/solr/live_nodes/127.0.0.1:49993_ Error:KeeperErrorCode = NoNode for /solr/live_nodes/127.0.0.1:49993_
[junit4:junit4] 2> 4192 T2030 oascc.SolrZkClient.makePath makePath: /live_nodes/127.0.0.1:49993_
[junit4:junit4] 2> 4198 T2052 oascc.ZkStateReader$3.process Updating live nodes... (2)
[junit4:junit4] 2> 4198 T2052 oascc.ZkStateReader$2.process A cluster state change: WatchedEvent state:SyncConnected type:NodeChildrenChanged path:/live_nodes, has occurred - updating... (live nodes size: 2)
[junit4:junit4] 2> 4199 T2058 oascc.ZkStateReader$3.process Updating live nodes... (2)
[junit4:junit4] 2> 4206 T2030 oascc.ZkStateReader.createClusterStateWatchersAndUpdate Updating cluster state from ZooKeeper...
[junit4:junit4] 2> 4213 T2072 oasc.CoreContainer.create Creating SolrCore 'collection1' using instanceDir: /Users/jenkins/jenkins-slave/workspace/Lucene-Solr-trunk-MacOSX/solr/build/solr-core/test/J0/./org.apache.solr.cloud.BasicDistributedZkTest-jetty1-1359025196746/collection1
[junit4:junit4] 2> 4213 T2072 oasc.ZkController.createCollectionZkNode Check for collection zkNode:collection1
[junit4:junit4] 2> 4214 T2072 oasc.ZkController.createCollectionZkNode Collection zkNode exists
[junit4:junit4] 2> 4214 T2072 oasc.ZkController.readConfigName Load collection config from:/collections/collection1
[junit4:junit4] 2> 4216 T2072 oasc.SolrResourceLoader.<init> new SolrResourceLoader for directory: '/Users/jenkins/jenkins-slave/workspace/Lucene-Solr-trunk-MacOSX/solr/build/solr-core/test/J0/./org.apache.solr.cloud.BasicDistributedZkTest-jetty1-1359025196746/collection1/'
[junit4:junit4] 2> 4217 T2072 oasc.SolrResourceLoader.replaceClassLoader Adding 'file:/Users/jenkins/jenkins-slave/workspace/Lucene-Solr-trunk-MacOSX/solr/build/solr-core/test/J0/org.apache.solr.cloud.BasicDistributedZkTest-jetty1-1359025196746/collection1/lib/classes/' to classloader
[junit4:junit4] 2> 4217 T2072 oasc.SolrResourceLoader.replaceClassLoader Adding 'file:/Users/jenkins/jenkins-slave/workspace/Lucene-Solr-trunk-MacOSX/solr/build/solr-core/test/J0/org.apache.solr.cloud.BasicDistributedZkTest-jetty1-1359025196746/collection1/lib/README' to classloader
[junit4:junit4] 2> 4266 T2072 oasc.SolrConfig.<init> Using Lucene MatchVersion: LUCENE_50
[junit4:junit4] 2> 4338 T2072 oasc.SolrConfig.<init> Loaded SolrConfig: solrconfig.xml
[junit4:junit4] 2> 4339 T2072 oass.IndexSchema.readSchema Reading Solr Schema
[junit4:junit4] 2> 4344 T2072 oass.IndexSchema.readSchema Schema name=test
[junit4:junit4] 2> 5067 T2072 oass.OpenExchangeRatesOrgProvider.init Initialized with rates=open-exchange-rates.json, refreshInterval=1440.
[junit4:junit4] 2> 5074 T2072 oass.IndexSchema.readSchema default search field in schema is text
[junit4:junit4] 2> 5082 T2072 oass.IndexSchema.readSchema unique key field: id
[junit4:junit4] 2> 5106 T2072 oass.FileExchangeRateProvider.reload Reloading exchange rates from file currency.xml
[junit4:junit4] 2> 5111 T2072 oass.FileExchangeRateProvider.reload Reloading exchange rates from file currency.xml
[junit4:junit4] 2> 5117 T2072 oass.OpenExchangeRatesOrgProvider.reload Reloading exchange rates from open-exchange-rates.json
[junit4:junit4] 2> 5119 T2072 oass.OpenExchangeRatesOrgProvider.reload Reloading exchange rates from open-exchange-rates.json
[junit4:junit4] 2> 5121 T2072 oasc.SolrCore.<init> [collection1] Opening new SolrCore at /Users/jenkins/jenkins-slave/workspace/Lucene-Solr-trunk-MacOSX/solr/build/solr-core/test/J0/./org.apache.solr.cloud.BasicDistributedZkTest-jetty1-1359025196746/collection1/, dataDir=./org.apache.solr.cloud.BasicDistributedZkTest-1359025192910/jetty1/
[junit4:junit4] 2> 5121 T2072 oasc.JmxMonitoredMap.<init> JMX monitoring is enabled. Adding Solr mbeans to JMX Server: com.sun.jmx.mbeanserver.JmxMBeanServer@7affa511
[junit4:junit4] 2> 5122 T2072 oasc.SolrCore.initDirectoryFactory solr.NRTCachingDirectoryFactory
[junit4:junit4] 2> 5123 T2072 oasc.CachingDirectoryFactory.get return new directory for /Users/jenkins/jenkins-slave/workspace/Lucene-Solr-trunk-MacOSX/solr/build/solr-core/test/J0/./org.apache.solr.cloud.BasicDistributedZkTest-1359025192910/jetty1 forceNew:false
[junit4:junit4] 2> 5123 T2072 oasc.CachingDirectoryFactory.close Releasing directory:/Users/jenkins/jenkins-slave/workspace/Lucene-Solr-trunk-MacOSX/solr/build/solr-core/test/J0/./org.apache.solr.cloud.BasicDistributedZkTest-1359025192910/jetty1
[junit4:junit4] 2> 5123 T2072 oasc.SolrCore.getNewIndexDir New index directory detected: old=null new=./org.apache.solr.cloud.BasicDistributedZkTest-1359025192910/jetty1/index/
[junit4:junit4] 2> 5124 T2072 oasc.SolrCore.initIndex WARNING [collection1] Solr index directory './org.apache.solr.cloud.BasicDistributedZkTest-1359025192910/jetty1/index' doesn't exist. Creating new index...
[junit4:junit4] 2> 5125 T2072 oasc.CachingDirectoryFactory.get return new directory for /Users/jenkins/jenkins-slave/workspace/Lucene-Solr-trunk-MacOSX/solr/build/solr-core/test/J0/./org.apache.solr.cloud.BasicDistributedZkTest-1359025192910/jetty1/index forceNew:false
[junit4:junit4] 2> 5129 T2072 oasc.SolrDeletionPolicy.onCommit SolrDeletionPolicy.onCommit: commits:num=1
[junit4:junit4] 2> commit{dir=RateLimitedDirectoryWrapper(NRTCachingDirectory(org.apache.lucene.store.NIOFSDirectory@/Users/jenkins/jenkins-slave/workspace/Lucene-Solr-trunk-MacOSX/solr/build/solr-core/test/J0/org.apache.solr.cloud.BasicDistributedZkTest-1359025192910/jetty1/index lockFactory=org.apache.lucene.store.NativeFSLockFactory@6d2ece4b; maxCacheMB=48.0 maxMergeSizeMB=4.0)),segFN=segments_1,generation=1,filenames=[segments_1]
[junit4:junit4] 2> 5130 T2072 oasc.SolrDeletionPolicy.updateCommits newest commit = 1[segments_1]
[junit4:junit4] 2> 5130 T2072 oasc.CachingDirectoryFactory.close Releasing directory:/Users/jenkins/jenkins-slave/workspace/Lucene-Solr-trunk-MacOSX/solr/build/solr-core/test/J0/./org.apache.solr.cloud.BasicDistributedZkTest-1359025192910/jetty1/index
[junit4:junit4] 2> 5131 T2072 oasc.SolrCore.initWriters created xml: solr.XMLResponseWriter
[junit4:junit4] 2> 5133 T2072 oasup.UpdateRequestProcessorChain.init inserting DistributedUpdateProcessorFactory into updateRequestProcessorChain "dedupe"
[junit4:junit4] 2> 5134 T2072 oasup.UpdateRequestProcessorChain.init inserting DistributedUpdateProcessorFactory into updateRequestProcessorChain "dedupe-allfields"
[junit4:junit4] 2> 5134 T2072 oasup.UpdateRequestProcessorChain.init inserting DistributedUpdateProcessorFactory into updateRequestProcessorChain "stored_sig"
[junit4:junit4] 2> 5134 T2072 oasup.UpdateRequestProcessorChain.init inserting DistributedUpdateProcessorFactory into updateRequestProcessorChain "uniq-fields"
[junit4:junit4] 2> 5135 T2072 oasup.UpdateRequestProcessorChain.init inserting DistributedUpdateProcessorFactory into updateRequestProcessorChain "distrib-dup-test-chain-implicit"
[junit4:junit4] 2> 5135 T2072 oasc.RequestHandlers.initHandlersFromConfig adding lazy requestHandler: solr.ReplicationHandler
[junit4:junit4] 2> 5136 T2072 oasc.RequestHandlers.initHandlersFromConfig created /replication: solr.ReplicationHandler
[junit4:junit4] 2> 5136 T2072 oasc.RequestHandlers.initHandlersFromConfig created standard: solr.StandardRequestHandler
[junit4:junit4] 2> 5138 T2072 oasc.RequestHandlers.initHandlersFromConfig created /get: solr.RealTimeGetHandler
[junit4:junit4] 2> 5139 T2072 oasc.RequestHandlers.initHandlersFromConfig created dismax: solr.SearchHandler
[junit4:junit4] 2> 5139 T2072 oasc.RequestHandlers.initHandlersFromConfig created mock: org.apache.solr.core.MockQuerySenderListenerReqHandler
[junit4:junit4] 2> 5140 T2072 oasc.RequestHandlers.initHandlersFromConfig created /admin/: org.apache.solr.handler.admin.AdminHandlers
[junit4:junit4] 2> 5140 T2072 oasc.RequestHandlers.initHandlersFromConfig created defaults: solr.StandardRequestHandler
[junit4:junit4] 2> 5140 T2072 oasc.RequestHandlers.initHandlersFromConfig adding lazy requestHandler: solr.StandardRequestHandler
[junit4:junit4] 2> 5141 T2072 oasc.RequestHandlers.initHandlersFromConfig created lazy: solr.StandardRequestHandler
[junit4:junit4] 2> 5142 T2072 oasc.RequestHandlers.initHandlersFromConfig created /update: solr.UpdateRequestHandler
[junit4:junit4] 2> 5142 T2072 oasc.RequestHandlers.initHandlersFromConfig created /terms: org.apache.solr.handler.component.SearchHandler
[junit4:junit4] 2> 5143 T2072 oasc.RequestHandlers.initHandlersFromConfig created spellCheckCompRH: org.apache.solr.handler.component.SearchHandler
[junit4:junit4] 2> 5143 T2072 oasc.RequestHandlers.initHandlersFromConfig created spellCheckCompRH_Direct: org.apache.solr.handler.component.SearchHandler
[junit4:junit4] 2> 5144 T2072 oasc.RequestHandlers.initHandlersFromConfig created spellCheckWithWordbreak: org.apache.solr.handler.component.SearchHandler
[junit4:junit4] 2> 5149 T2072 oasc.RequestHandlers.initHandlersFromConfig created spellCheckWithWordbreak_Direct: org.apache.solr.handler.component.SearchHandler
[junit4:junit4] 2> 5151 T2072 oasc.RequestHandlers.initHandlersFromConfig created spellCheckCompRH1: org.apache.solr.handler.component.SearchHandler
[junit4:junit4] 2> 5151 T2072 oasc.RequestHandlers.initHandlersFromConfig created mltrh: org.apache.solr.handler.component.SearchHandler
[junit4:junit4] 2> 5152 T2072 oasc.RequestHandlers.initHandlersFromConfig created tvrh: org.apache.solr.handler.component.SearchHandler
[junit4:junit4] 2> 5153 T2072 oasc.RequestHandlers.initHandlersFromConfig created /mlt: solr.MoreLikeThisHandler
[junit4:junit4] 2> 5153 T2072 oasc.RequestHandlers.initHandlersFromConfig created /debug/dump: solr.DumpRequestHandler
[junit4:junit4] 2> 5159 T2072 oashl.XMLLoader.init xsltCacheLifetimeSeconds=60
[junit4:junit4] 2> 5169 T2072 oasc.SolrCore.initDeprecatedSupport WARNING solrconfig.xml uses deprecated <admin/gettableFiles>, Please update your config to use the ShowFileRequestHandler.
[junit4:junit4] 2> 5171 T2072 oasc.SolrCore.initDeprecatedSupport WARNING adding ShowFileRequestHandler with hidden files: [SCHEMA.XML, OLD_SYNONYMS.TXT, STOPWORDS.TXT, PROTWORDS.TXT, OPEN-EXCHANGE-RATES.JSON, SYNONYMS.TXT, CURRENCY.XML, MAPPING-ISOLATIN1ACCENT.TXT]
[junit4:junit4] 2> 5174 T2072 oasc.CachingDirectoryFactory.close Releasing directory:/Users/jenkins/jenkins-slave/workspace/Lucene-Solr-trunk-MacOSX/solr/build/solr-core/test/J0/./org.apache.solr.cloud.BasicDistributedZkTest-1359025192910/jetty1
[junit4:junit4] 2> 5175 T2072 oass.SolrIndexSearcher.<init> Opening Searcher@507b018d main
[junit4:junit4] 2> 5176 T2072 oasu.CommitTracker.<init> Hard AutoCommit: disabled
[junit4:junit4] 2> 5176 T2072 oasu.CommitTracker.<init> Soft AutoCommit: disabled
[junit4:junit4] 2> 5177 T2072 oashc.SpellCheckComponent.inform Initializing spell checkers
[junit4:junit4] 2> 5182 T2072 oass.DirectSolrSpellChecker.init init: {name=direct,classname=DirectSolrSpellChecker,field=lowerfilt,minQueryLength=3}
[junit4:junit4] 2> 5216 T2073 oasc.SolrCore.registerSearcher [collection1] Registered new searcher Searcher@507b018d main{StandardDirectoryReader(segments_1:1)}
[junit4:junit4] 2> 5225 T2072 oasc.ZkController.publish publishing core=collection1 state=down
[junit4:junit4] 2> 5225 T2072 oasc.ZkController.publish numShards not found on descriptor - reading it from system property
[junit4:junit4] 2> 5294 T2053 oascc.ZkStateReader.updateClusterState Updating cloud state from ZooKeeper...
[junit4:junit4] 2> 5295 T2053 oasc.Overseer$ClusterStateUpdater.updateState Update state numShards=1 message={
[junit4:junit4] 2> "operation":"state",
[junit4:junit4] 2> "numShards":"1",
[junit4:junit4] 2> "shard":"shard1",
[junit4:junit4] 2> "roles":null,
[junit4:junit4] 2> "state":"active",
[junit4:junit4] 2> "core":"collection1",
[junit4:junit4] 2> "collection":"control_collection",
[junit4:junit4] 2> "node_name":"127.0.0.1:49989_",
[junit4:junit4] 2> "base_url":"http://127.0.0.1:49989"}
[junit4:junit4] 2> 5302 T2053 oasc.Overseer$ClusterStateUpdater.updateState Update state numShards=2 message={
[junit4:junit4] 2> "operation":"state",
[junit4:junit4] 2> "numShards":"2",
[junit4:junit4] 2> "shard":null,
[junit4:junit4] 2> "roles":null,
[junit4:junit4] 2> "state":"down",
[junit4:junit4] 2> "core":"collection1",
[junit4:junit4] 2> "collection":"collection1",
[junit4:junit4] 2> "node_name":"127.0.0.1:49993_",
[junit4:junit4] 2> "base_url":"http://127.0.0.1:49993"}
[junit4:junit4] 2> 5302 T2053 oasc.Overseer$ClusterStateUpdater.createCollection Create collection collection1 with numShards 2
[junit4:junit4] 2> 5303 T2053 oasc.Overseer$ClusterStateUpdater.updateState Assigning new node to shard shard=shard1
[junit4:junit4] 2> 5309 T2058 oascc.ZkStateReader$2.process A cluster state change: WatchedEvent state:SyncConnected type:NodeDataChanged path:/clusterstate.json, has occurred - updating... (live nodes size: 2)
[junit4:junit4] 2> 5311 T2052 oascc.ZkStateReader$2.process A cluster state change: WatchedEvent state:SyncConnected type:NodeDataChanged path:/clusterstate.json, has occurred - updating... (live nodes size: 2)
[junit4:junit4] 2> 5313 T2071 oascc.ZkStateReader$2.process A cluster state change: WatchedEvent state:SyncConnected type:NodeDataChanged path:/clusterstate.json, has occurred - updating... (live nodes size: 2)
[junit4:junit4] 2> 6230 T2072 oasc.CoreContainer.registerCore registering core: collection1
[junit4:junit4] 2> 6230 T2072 oasc.ZkController.register Register replica - core:collection1 address:http://127.0.0.1:49993 collection:collection1 shard:shard1
[junit4:junit4] 2> 6232 T2072 oascc.SolrZkClient.makePath makePath: /collections/collection1/leader_elect/shard1/election
[junit4:junit4] 2> 6247 T2035 oazs.PrepRequestProcessor.pRequest Got user-level KeeperException when processing sessionid:0x13c6c36bfd60006 type:delete cxid:0x43 zxid:0x5a txntype:-1 reqpath:n/a Error Path:/solr/collections/collection1/leaders Error:KeeperErrorCode = NoNode for /solr/collections/collection1/leaders
[junit4:junit4] 2> 6248 T2072 oasc.ShardLeaderElectionContext.runLeaderProcess Running the leader process.
[junit4:junit4] 2> 6248 T2035 oazs.PrepRequestProcessor.pRequest Got user-level KeeperException when processing sessionid:0x13c6c36bfd60006 type:create cxid:0x44 zxid:0x5b txntype:-1 reqpath:n/a Error Path:/solr/overseer Error:KeeperErrorCode = NodeExists for /solr/overseer
[junit4:junit4] 2> 6251 T2072 oasc.ShardLeaderElectionContext.waitForReplicasToComeUp Enough replicas found to continue.
[junit4:junit4] 2> 6251 T2072 oasc.ShardLeaderElectionContext.runLeaderProcess I may be the new leader - try and sync
[junit4:junit4] 2> 6251 T2072 oasc.SyncStrategy.sync Sync replicas to http://127.0.0.1:49993/collection1/
[junit4:junit4] 2> 6252 T2072 oasc.SyncStrategy.syncReplicas Sync Success - now sync replicas to me
[junit4:junit4] 2> 6252 T2072 oasc.SyncStrategy.syncToMe http://127.0.0.1:49993/collection1/ has no replicas
[junit4:junit4] 2> 6252 T2072 oasc.ShardLeaderElectionContext.runLeaderProcess I am the new leader: http://127.0.0.1:49993/collection1/
[junit4:junit4] 2> 6253 T2072 oascc.SolrZkClient.makePath makePath: /collections/collection1/leaders/shard1
[junit4:junit4] 2> 6258 T2035 oazs.PrepRequestProcessor.pRequest Got user-level KeeperException when processing sessionid:0x13c6c36bfd60006 type:create cxid:0x4e zxid:0x5f txntype:-1 reqpath:n/a Error Path:/solr/overseer Error:KeeperErrorCode = NodeExists for /solr/overseer
[junit4:junit4] 2> 6825 T2053 oascc.ZkStateReader.updateClusterState Updating cloud state from ZooKeeper...
[junit4:junit4] 2> 6842 T2071 oascc.ZkStateReader$2.process A cluster state change: WatchedEvent state:SyncConnected type:NodeDataChanged path:/clusterstate.json, has occurred - updating... (live nodes size: 2)
[junit4:junit4] 2> 6843 T2058 oascc.ZkStateReader$2.process A cluster state change: WatchedEvent state:SyncConnected type:NodeDataChanged path:/clusterstate.json, has occurred - updating... (live nodes size: 2)
[junit4:junit4] 2> 6843 T2052 oascc.ZkStateReader$2.process A cluster state change: WatchedEvent state:SyncConnected type:NodeDataChanged path:/clusterstate.json, has occurred - updating... (live nodes size: 2)
[junit4:junit4] 2> 6876 T2072 oasc.ZkController.register We are http://127.0.0.1:49993/collection1/ and leader is http://127.0.0.1:49993/collection1/
[junit4:junit4] 2> 6876 T2072 oasc.ZkController.register No LogReplay needed for core=collection1 baseURL=http://127.0.0.1:49993
[junit4:junit4] 2> 6877 T2072 oasc.ZkController.checkRecovery I am the leader, no recovery necessary
[junit4:junit4] 2> 6877 T2072 oasc.ZkController.publish publishing core=collection1 state=active
[junit4:junit4] 2> 6877 T2072 oasc.ZkController.publish numShards not found on descriptor - reading it from system property
[junit4:junit4] 2> 6882 T2072 oascc.ZkStateReader.updateClusterState Updating cloud state from ZooKeeper...
[junit4:junit4] 2> 6884 T2030 oass.SolrDispatchFilter.init user.dir=/Users/jenkins/jenkins-slave/workspace/Lucene-Solr-trunk-MacOSX/solr/build/solr-core/test/J0
[junit4:junit4] 2> 6884 T2030 oass.SolrDispatchFilter.init SolrDispatchFilter.init() done
[junit4:junit4] 2> 6884 T2030 oascsi.HttpClientUtil.createClient Creating new http client, config:maxConnections=128&maxConnectionsPerHost=32&followRedirects=false
[junit4:junit4] 2> 7086 T2030 oejs.Server.doStart jetty-8.1.8.v20121106
[junit4:junit4] 2> 7093 T2030 oejs.AbstractConnector.doStart Started SelectChannelConnector@127.0.0.1:49996
[junit4:junit4] 2> 7094 T2030 oass.SolrDispatchFilter.init SolrDispatchFilter.init()
[junit4:junit4] 2> 7094 T2030 oasc.SolrResourceLoader.locateSolrHome JNDI not configured for solr (NoInitialContextEx)
[junit4:junit4] 2> 7095 T2030 oasc.SolrResourceLoader.locateSolrHome using system property solr.solr.home: /Users/jenkins/jenkins-slave/workspace/Lucene-Solr-trunk-MacOSX/solr/build/solr-core/test/J0/./org.apache.solr.cloud.BasicDistributedZkTest-jetty2-1359025199790
[junit4:junit4] 2> 7095 T2030 oasc.CoreContainer$Initializer.initialize looking for solr.xml: /Users/jenkins/jenkins-slave/workspace/Lucene-Solr-trunk-MacOSX/solr/build/solr-core/test/J0/./org.apache.solr.cloud.BasicDistributedZkTest-jetty2-1359025199790/solr.xml
[junit4:junit4] 2> 7096 T2030 oasc.CoreContainer.<init> New CoreContainer 242931786
[junit4:junit4] 2> 7096 T2030 oasc.CoreContainer.load Loading CoreContainer using Solr Home: '/Users/jenkins/jenkins-slave/workspace/Lucene-Solr-trunk-MacOSX/solr/build/solr-core/test/J0/./org.apache.solr.cloud.BasicDistributedZkTest-jetty2-1359025199790/'
[junit4:junit4] 2> 7097 T2030 oasc.SolrResourceLoader.<init> new SolrResourceLoader for directory: '/Users/jenkins/jenkins-slave/workspace/Lucene-Solr-trunk-MacOSX/solr/build/solr-core/test/J0/./org.apache.solr.cloud.BasicDistributedZkTest-jetty2-1359025199790/'
[junit4:junit4] 2> 7136 T2030 oashc.HttpShardHandlerFactory.getParameter Setting socketTimeout to: 60000
[junit4:junit4] 2> 7136 T2030 oashc.HttpShardHandlerFactory.getParameter Setting urlScheme to: http://
[junit4:junit4] 2> 7137 T2030 oashc.HttpShardHandlerFactory.getParameter Setting connTimeout to: 15000
[junit4:junit4] 2> 7137 T2030 oashc.HttpShardHandlerFactory.getParameter Setting maxConnectionsPerHost to: 20
[junit4:junit4] 2> 7138 T2030 oashc.HttpShardHandlerFactory.getParameter Setting corePoolSize to: 0
[junit4:junit4] 2> 7139 T2030 oashc.HttpShardHandlerFactory.getParameter Setting maximumPoolSize to: 2147483647
[junit4:junit4] 2> 7139 T2030 oashc.HttpShardHandlerFactory.getParameter Setting maxThreadIdleTime to: 5
[junit4:junit4] 2> 7140 T2030 oashc.HttpShardHandlerFactory.getParameter Setting sizeOfQueue to: -1
[junit4:junit4] 2> 7140 T2030 oashc.HttpShardHandlerFactory.getParameter Setting fairnessPolicy to: false
[junit4:junit4] 2> 7141 T2030 oascsi.HttpClientUtil.createClient Creating new http client, config:maxConnectionsPerHost=20&maxConnections=10000&socketTimeout=60000&connTimeout=15000&retry=false
[junit4:junit4] 2> 7160 T2030 oasc.CoreContainer.load Registering Log Listener
[junit4:junit4] 2> 7178 T2030 oasc.CoreContainer.initZooKeeper Zookeeper client=127.0.0.1:49986/solr
[junit4:junit4] 2> 7178 T2030 oasc.ZkController.checkChrootPath zkHost includes chroot
[junit4:junit4] 2> 7179 T2030 oaz.ZooKeeper.<init> Initiating client connection, connectString=127.0.0.1:49986 sessionTimeout=60000 watcher=org.apache.solr.common.cloud.ConnectionManager@1007b020
[junit4:junit4] 2> 7181 T2083 oaz.ClientCnxn$SendThread.logStartConnect Opening socket connection to server localhost/127.0.0.1:49986. Will not attempt to authenticate using SASL (access denied ("javax.security.auth.AuthPermission" "getLoginConfiguration"))
[junit4:junit4] 2> 7181 T2030 oascc.ConnectionManager.waitForConnected Waiting for client to connect to ZooKeeper
[junit4:junit4] 2> 7183 T2083 oaz.ClientCnxn$SendThread.primeConnection Socket connection established to localhost/127.0.0.1:49986, initiating session
[junit4:junit4] 2> 7184 T2032 oazs.NIOServerCnxnFactory.run Accepted socket connection from /127.0.0.1:49997
[junit4:junit4] 2> 7185 T2032 oazs.ZooKeeperServer.processConnectRequest Client attempting to establish new session at /127.0.0.1:49997
[junit4:junit4] 2> 7676 T2034 oazs.ZooKeeperServer.finishSessionInit Established session 0x13c6c36bfd60007 with negotiated timeout 20000 for client /127.0.0.1:49997
[junit4:junit4] 2> 7676 T2083 oaz.ClientCnxn$SendThread.onConnected Session establishment complete on server localhost/127.0.0.1:49986, sessionid = 0x13c6c36bfd60007, negotiated timeout = 20000
[junit4:junit4] 2> 7677 T2084 oascc.ConnectionManager.process Watcher org.apache.solr.common.cloud.ConnectionManager@1007b020 name:ZooKeeperConnection Watcher:127.0.0.1:49986 got event WatchedEvent state:SyncConnected type:None path:null path:null type:None
[junit4:junit4] 2> 7677 T2030 oascc.ConnectionManager.waitForConnected Client is connected to ZooKeeper
[junit4:junit4] 2> 7681 T2035 oazs.PrepRequestProcessor.pRequest2Txn Processed session termination for sessionid: 0x13c6c36bfd60007
[junit4:junit4] 2> 7682 T2032 oazs.NIOServerCnxn.closeSock Closed socket connection for client /127.0.0.1:49997 which had sessionid 0x13c6c36bfd60007
[junit4:junit4] 2> 7682 T2084 oaz.ClientCnxn$EventThread.run EventThread shut down
[junit4:junit4] 2> 7682 T2030 oaz.ZooKeeper.close Session: 0x13c6c36bfd60007 closed
[junit4:junit4] 2> 7684 T2030 oascsi.HttpClientUtil.createClient Creating new http client, config:maxConnections=500&maxConnectionsPerHost=16&socketTimeout=60000&connTimeout=15000
[junit4:junit4] 2> 7687 T2030 oaz.ZooKeeper.<init> Initiating client connection, connectString=127.0.0.1:49986/solr sessionTimeout=30000 watcher=org.apache.solr.common.cloud.ConnectionManager@882bbc7
[junit4:junit4] 2> 7700 T2030 oascc.ConnectionManager.waitForConnected Waiting for client to connect to ZooKeeper
[junit4:junit4] 2> 7701 T2085 oaz.ClientCnxn$SendThread.logStartConnect Opening socket connection to server localhost/127.0.0.1:49986. Will not attempt to authenticate using SASL (access denied ("javax.security.auth.AuthPermission" "getLoginConfiguration"))
[junit4:junit4] 2> 7702 T2085 oaz.ClientCnxn$SendThread.primeConnection Socket connection established to localhost/127.0.0.1:49986, initiating session
[junit4:junit4] 2> 7702 T2032 oazs.NIOServerCnxnFactory.run Accepted socket connection from /127.0.0.1:49998
[junit4:junit4] 2> 7703 T2032 oazs.ZooKeeperServer.processConnectRequest Client attempting to establish new session at /127.0.0.1:49998
[junit4:junit4] 2> 7705 T2034 oazs.ZooKeeperServer.finishSessionInit Established session 0x13c6c36bfd60008 with negotiated timeout 20000 for client /127.0.0.1:49998
[junit4:junit4] 2> 7705 T2085 oaz.ClientCnxn$SendThread.onConnected Session establishment complete on server localhost/127.0.0.1:49986, sessionid = 0x13c6c36bfd60008, negotiated timeout = 20000
[junit4:junit4] 2> 7706 T2086 oascc.ConnectionManager.process Watcher org.apache.solr.common.cloud.ConnectionManager@882bbc7 name:ZooKeeperConnection Watcher:127.0.0.1:49986/solr got event WatchedEvent state:SyncConnected type:None path:null path:null type:None
[junit4:junit4] 2> 7706 T2030 oascc.ConnectionManager.waitForConnected Client is connected to ZooKeeper
[junit4:junit4] 2> 7708 T2035 oazs.PrepRequestProcessor.pRequest Got user-level KeeperException when processing sessionid:0x13c6c36bfd60008 type:create cxid:0x1 zxid:0x6c txntype:-1 reqpath:n/a Error Path:/solr/overseer Error:KeeperErrorCode = NodeExists for /solr/overseer
[junit4:junit4] 2> 7710 T2035 oazs.PrepRequestProcessor.pRequest Got user-level KeeperException when processing sessionid:0x13c6c36bfd60008 type:create cxid:0x2 zxid:0x6d txntype:-1 reqpath:n/a Error Path:/solr/overseer Error:KeeperErrorCode = NodeExists for /solr/overseer
[junit4:junit4] 2> 7712 T2030 oasc.ZkController.createEphemeralLiveNode Register node as live in ZooKeeper:/live_nodes/127.0.0.1:49996_
[junit4:junit4] 2> 7713 T2035 oazs.PrepRequestProcessor.pRequest Got user-level KeeperException when processing sessionid:0x13c6c36bfd60008 type:delete cxid:0x4 zxid:0x6e txntype:-1 reqpath:n/a Error Path:/solr/live_nodes/127.0.0.1:49996_ Error:KeeperErrorCode = NoNode for /solr/live_nodes/127.0.0.1:49996_
[junit4:junit4] 2> 7714 T2030 oascc.SolrZkClient.makePath makePath: /live_nodes/127.0.0.1:49996_
[junit4:junit4] 2> 7727 T2030 oascc.ZkStateReader.createClusterStateWatchersAndUpdate Updating cluster state from ZooKeeper...
[junit4:junit4] 2> 7738 T2087 oasc.CoreContainer.create Creating SolrCore 'collection1' using instanceDir: /Users/jenkins/jenkins-slave/workspace/Lucene-Solr-trunk-MacOSX/solr/build/solr-core/test/J0/./org.apache.solr.cloud.BasicDistributedZkTest-jetty2-1359025199790/collection1
[junit4:junit4] 2> 7739 T2087 oasc.ZkController.createCollectionZkNode Check for collection zkNode:collection1
[junit4:junit4] 2> 7740 T2071 oascc.ZkStateReader$2.process A cluster state change: WatchedEvent state:SyncConnected type:NodeChildrenChanged path:/live_nodes, has occurred - updating... (live nodes size: 2)
[junit4:junit4] 2> 7741 T2058 oascc.ZkStateReader$3.process Updating live nodes... (3)
[junit4:junit4] 2> 7741 T2058 oascc.ZkStateReader$2.process A cluster state change: WatchedEvent state:SyncConnected type:NodeChildrenChanged path:/live_nodes, has occurred - updating... (live nodes size: 3)
[junit4:junit4] 2> 7752 T2052 oascc.ZkStateReader$3.process Updating live nodes... (3)
[junit4:junit4] 2> 7753 T2052 oascc.ZkStateReader$2.process A cluster state change: WatchedEvent state:SyncConnected type:NodeChildrenChanged path:/live_nodes, has occurred - updating... (live nodes size: 3)
[junit4:junit4] 2> 7754 T2087 oasc.ZkController.createCollectionZkNode Collection zkNode exists
[junit4:junit4] 2> 7754 T2087 oasc.ZkController.readConfigName Load collection config from:/collections/collection1
[junit4:junit4] 2> 7755 T2071 oascc.ZkStateReader$3.process Updating live nodes... (3)
[junit4:junit4] 2> 7759 T2087 oasc.SolrResourceLoader.<init> new SolrResourceLoader for directory: '/Users/jenkins/jenkins-slave/workspace/Lucene-Solr-trunk-MacOSX/solr/build/solr-core/test/J0/./org.apache.solr.cloud.BasicDistributedZkTest-jetty2-1359025199790/collection1/'
[junit4:junit4] 2> 7760 T2087 oasc.SolrResourceLoader.replaceClassLoader Adding 'file:/Users/jenkins/jenkins-slave/workspace/Lucene-Solr-trunk-MacOSX/solr/build/solr-core/test/J0/org.apache.solr.cloud.BasicDistributedZkTest-jetty2-1359025199790/collection1/lib/classes/' to classloader
[junit4:junit4] 2> 7760 T2087 oasc.SolrResourceLoader.replaceClassLoader Adding 'file:/Users/jenkins/jenkins-slave/workspace/Lucene-Solr-trunk-MacOSX/solr/build/solr-core/test/J0/org.apache.solr.cloud.BasicDistributedZkTest-jetty2-1359025199790/collection1/lib/README' to classloader
[junit4:junit4] 2> 7812 T2087 oasc.SolrConfig.<init> Using Lucene MatchVersion: LUCENE_50
[junit4:junit4] 2> 7910 T2087 oasc.SolrConfig.<init> Loaded SolrConfig: solrconfig.xml
[junit4:junit4] 2> 7911 T2087 oass.IndexSchema.readSchema Reading Solr Schema
[junit4:junit4] 2> 7917 T2087 oass.IndexSchema.readSchema Schema name=test
[junit4:junit4] 2> 8358 T2053 oascc.ZkStateReader.updateClusterState Updating cloud state from ZooKeeper...
[junit4:junit4] 2> 8359 T2053 oasc.Overseer$ClusterStateUpdater.updateState Update state numShards=2 message={
[junit4:junit4] 2> "operation":"state",
[junit4:junit4] 2> "numShards":"2",
[junit4:junit4] 2> "shard":"shard1",
[junit4:junit4] 2> "roles":null,
[junit4:junit4] 2> "state":"active",
[junit4:junit4] 2> "core":"collection1",
[junit4:junit4] 2> "collection":"collection1",
[junit4:junit4] 2> "node_name":"127.0.0.1:49993_",
[junit4:junit4] 2> "base_url":"http://127.0.0.1:49993"}
[junit4:junit4] 2> 8369 T2086 oascc.ZkStateReader$2.process A cluster state change: WatchedEvent state:SyncConnected type:NodeDataChanged path:/clusterstate.json, has occurred - updating... (live nodes size: 3)
[junit4:junit4] 2> 8370 T2071 oascc.ZkStateReader$2.process A cluster state change: WatchedEvent state:SyncConnected type:NodeDataChanged path:/clusterstate.json, has occurred - updating... (live nodes size: 3)
[junit4:junit4] 2> 8370 T2052 oascc.ZkStateReader$2.process A cluster state change: WatchedEvent state:SyncConnected type:NodeDataChanged path:/clusterstate.json, has occurred - updating... (live nodes size: 3)
[junit4:junit4] 2> 8370 T2058 oascc.ZkStateReader$2.process A cluster state change: WatchedEvent state:SyncConnected type:NodeDataChanged path:/clusterstate.json, has occurred - updating... (live nodes size: 3)
[junit4:junit4] 2> 8756 T2087 oass.OpenExchangeRatesOrgProvider.init Initialized with rates=open-exchange-rates.json, refreshInterval=1440.
[junit4:junit4] 2> 8765 T2087 oass.IndexSchema.readSchema default search field in schema is text
[junit4:junit4] 2> 8768 T2087 oass.IndexSchema.readSchema unique key field: id
[junit4:junit4] 2> 8789 T2087 oass.FileExchangeRateProvider.reload Reloading exchange rates from file currency.xml
[junit4:junit4] 2> 8794 T2087 oass.FileExchangeRateProvider.reload Reloading exchange rates from file currency.xml
[junit4:junit4] 2> 8802 T2087 oass.OpenExchangeRatesOrgProvider.reload Reloading exchange rates from open-exchange-rates.json
[junit4:junit4] 2> 8807 T2087 oass.OpenExchangeRatesOrgProvider.reload Reloading exchange rates from open-exchange-rates.json
[junit4:junit4] 2> 8811 T2087 oasc.SolrCore.<init> [collection1] Opening new SolrCore at /Users/jenkins/jenkins-slave/workspace/Lucene-Solr-trunk-MacOSX/solr/build/solr-core/test/J0/./org.apache.solr.cloud.BasicDistributedZkTest-jetty2-1359025199790/collection1/, dataDir=./org.apache.solr.cloud.BasicDistributedZkTest-1359025192910/jetty2/
[junit4:junit4] 2> 8811 T2087 oasc.JmxMonitoredMap.<init> JMX monitoring is enabled. Adding Solr mbeans to JMX Server: com.sun.jmx.mbeanserver.JmxMBeanServer@7affa511
[junit4:junit4] 2> 8812 T2087 oasc.SolrCore.initDirectoryFactory solr.NRTCachingDirectoryFactory
[junit4:junit4] 2> 8813 T2087 oasc.CachingDirectoryFactory.get return new directory for /Users/jenkins/jenkins-slave/workspace/Lucene-Solr-trunk-MacOSX/solr/build/solr-core/test/J0/./org.apache.solr.cloud.BasicDistributedZkTest-1359025192910/jetty2 forceNew:false
[junit4:junit4] 2> 8813 T2087 oasc.CachingDirectoryFactory.close Releasing directory:/Users/jenkins/jenkins-slave/workspace/Lucene-Solr-trunk-MacOSX/solr/build/solr-core/test/J0/./org.apache.solr.cloud.BasicDistributedZkTest-1359025192910/jetty2
[junit4:junit4] 2> 8813 T2087 oasc.SolrCore.getNewIndexDir New index directory detected: old=null new=./org.apache.solr.cloud.BasicDistributedZkTest-1359025192910/jetty2/index/
[junit4:junit4] 2> 8814 T2087 oasc.SolrCore.initIndex WARNING [collection1] Solr index directory './org.apache.solr.cloud.BasicDistributedZkTest-1359025192910/jetty2/index' doesn't exist. Creating new index...
[junit4:junit4] 2> 8815 T2087 oasc.CachingDirectoryFactory.get return new directory for /Users/jenkins/jenkins-slave/workspace/Lucene-Solr-trunk-MacOSX/solr/build/solr-core/test/J0/./org.apache.solr.cloud.BasicDistributedZkTest-1359025192910/jetty2/index forceNew:false
[junit4:junit4] 2> 9381 T2087 oasc.SolrDeletionPolicy.onCommit SolrDeletionPolicy.onCommit: commits:num=1
[junit4:junit4] 2> commit{dir=RateLimitedDirectoryWrapper(NRTCachingDirectory(org.apache.lucene.store.NIOFSDirectory@/Users/jenkins/jenkins-slave/workspace/Lucene-Solr-trunk-MacOSX/solr/build/solr-core/test/J0/org.apache.solr.cloud.BasicDistributedZkTest-1359025192910/jetty2/index lockFactory=org.apache.lucene.store.NativeFSLockFactory@4274ff2b; maxCacheMB=48.0 maxMergeSizeMB=4.0)),segFN=segments_1,generation=1,filenames=[segments_1]
[junit4:junit4] 2> 9382 T2087 oasc.SolrDeletionPolicy.updateCommits newest commit = 1[segments_1]
[junit4:junit4] 2> 9382 T2087 oasc.CachingDirectoryFactory.close Releasing directory:/Users/jenkins/jenkins-slave/workspace/Lucene-Solr-trunk-MacOSX/solr/build/solr-core/test/J0/./org.apache.solr.cloud.BasicDistributedZkTest-1359025192910/jetty2/index
[junit4:junit4] 2> 9383 T2087 oasc.SolrCore.initWriters created xml: solr.XMLResponseWriter
[junit4:junit4] 2> 9385 T2087 oasup.UpdateRequestProcessorChain.init inserting DistributedUpdateProcessorFactory into updateRequestProcessorChain "dedupe"
[junit4:junit4] 2> 9386 T2087 oasup.UpdateRequestProcessorChain.init inserting DistributedUpdateProcessorFactory into updateRequestProcessorChain "dedupe-allfields"
[junit4:junit4] 2> 9386 T2087 oasup.UpdateRequestProcessorChain.init inserting DistributedUpdateProcessorFactory into updateRequestProcessorChain "stored_sig"
[junit4:junit4] 2> 9387 T2087 oasup.UpdateRequestProcessorChain.init inserting DistributedUpdateProcessorFactory into updateRequestProcessorChain "uniq-fields"
[junit4:junit4] 2> 9387 T2087 oasup.UpdateRequestProcessorChain.init inserting DistributedUpdateProcessorFactory into updateRequestProcessorChain "distrib-dup-test-chain-implicit"
[junit4:junit4] 2> 9388 T2087 oasc.RequestHandlers.initHandlersFromConfig adding lazy requestHandler: solr.ReplicationHandler
[junit4:junit4] 2> 9388 T2087 oasc.RequestHandlers.initHandlersFromConfig created /replication: solr.ReplicationHandler
[junit4:junit4] 2> 9389 T2087 oasc.RequestHandlers.initHandlersFromConfig created standard: solr.StandardRequestHandler
[junit4:junit4] 2> 9390 T2087 oasc.RequestHandlers.initHandlersFromConfig created /get: solr.RealTimeGetHandler
[junit4:junit4] 2> 9391 T2087 oasc.RequestHandlers.initHandlersFromConfig created dismax: solr.SearchHandler
[junit4:junit4] 2> 9392 T2087 oasc.RequestHandlers.initHandlersFromConfig created mock: org.apache.solr.core.MockQuerySenderListenerReqHandler
[junit4:junit4] 2> 9392 T2087 oasc.RequestHandlers.initHandlersFromConfig created /admin/: org.apache.solr.handler.admin.AdminHandlers
[junit4:junit4] 2> 9393 T2087 oasc.RequestHandlers.initHandlersFromConfig created defaults: solr.StandardRequestHandler
[junit4:junit4] 2> 9393 T2087 oasc.RequestHandlers.initHandlersFromConfig adding lazy requestHandler: solr.StandardRequestHandler
[junit4:junit4] 2> 9393 T2087 oasc.RequestHandlers.initHandlersFromConfig created lazy: solr.StandardRequestHandler
[junit4:junit4] 2> 9394 T2087 oasc.RequestHandlers.initHandlersFromConfig created /update: solr.UpdateRequestHandler
[junit4:junit4] 2> 9395 T2087 oasc.RequestHandlers.initHandlersFromConfig created /terms: org.apache.solr.handler.component.SearchHandler
[junit4:junit4] 2> 9395 T2087 oasc.RequestHandlers.initHandlersFromConfig created spellCheckCompRH: org.apache.solr.handler.component.SearchHandler
[junit4:junit4] 2> 9397 T2087 oasc.RequestHandlers.initHandlersFromConfig created spellCheckCompRH_Direct: org.apache.solr.handler.component.SearchHandler
[junit4:junit4] 2> 9401 T2087 oasc.RequestHandlers.initHandlersFromConfig created spellCheckWithWordbreak: org.apache.solr.handler.component.SearchHandler
[junit4:junit4] 2> 9402 T2087 oasc.RequestHandlers.initHandlersFromConfig created spellCheckWithWordbreak_Direct: org.apache.solr.handler.component.SearchHandler
[junit4:junit4] 2> 9403 T2087 oasc.RequestHandlers.initHandlersFromConfig created spellCheckCompRH1: org.apache.solr.handler.component.SearchHandler
[junit4:junit4] 2> 9405 T2087 oasc.RequestHandlers.initHandlersFromConfig created mltrh: org.apache.solr.handler.component.SearchHandler
[junit4:junit4] 2> 9405 T2087 oasc.RequestHandlers.initHandlersFromConfig created tvrh: org.apache.solr.handler.component.SearchHandler
[junit4:junit4] 2> 9406 T2087 oasc.RequestHandlers.initHandlersFromConfig created /mlt: solr.MoreLikeThisHandler
[junit4:junit4] 2> 9406 T2087 oasc.RequestHandlers.initHandlersFromConfig created /debug/dump: solr.DumpRequestHandler
[junit4:junit4] 2> 9414 T2087 oashl.XMLLoader.init xsltCacheLifetimeSeconds=60
[junit4:junit4] 2> 9418 T2087 oasc.SolrCore.initDeprecatedSupport WARNING solrconfig.xml uses deprecated <admin/gettableFiles>, Please update your config to use the ShowFileRequestHandler.
[junit4:junit4] 2> 9420 T2087 oasc.SolrCore.initDeprecatedSupport WARNING adding ShowFileRequestHandler with hidden files: [SCHEMA.XML, OLD_SYNONYMS.TXT, STOPWORDS.TXT, PROTWORDS.TXT, OPEN-EXCHANGE-RATES.JSON, SYNONYMS.TXT, CURRENCY.XML, MAPPING-ISOLATIN1ACCENT.TXT]
[junit4:junit4] 2> 9422 T2087 oasc.CachingDirectoryFactory.close Releasing directory:/Users/jenkins/jenkins-slave/workspace/Lucene-Solr-trunk-MacOSX/solr/build/solr-core/test/J0/./org.apache.solr.cloud.BasicDistributedZkTest-1359025192910/jetty2
[junit4:junit4] 2> 9423 T2087 oass.SolrIndexSearcher.<init> Opening Searcher@76aeeb28 main
[junit4:junit4] 2> 9424 T2087 oasu.CommitTracker.<init> Hard AutoCommit: disabled
[junit4:junit4] 2> 9425 T2087 oasu.CommitTracker.<init> Soft AutoCommit: disabled
[junit4:junit4] 2> 9426 T2087 oashc.SpellCheckComponent.inform Initializing spell checkers
[junit4:junit4] 2> 9431 T2087 oass.DirectSolrSpellChecker.init init: {name=direct,classname=DirectSolrSpellChecker,field=lowerfilt,minQueryLength=3}
[junit4:junit4] 2> 9498 T2088 oasc.SolrCore.registerSearcher [collection1] Registered new searcher Searcher@76aeeb28 main{StandardDirectoryReader(segments_1:1)}
[junit4:junit4] 2> 9512 T2087 oasc.ZkController.publish publishing core=collection1 state=down
[junit4:junit4] 2> 9512 T2087 oasc.ZkController.publish numShards not found on descriptor - reading it from system property
[junit4:junit4] 2> 9928 T2053 oascc.ZkStateReader.updateClusterState Updating cloud state from ZooKeeper...
[junit4:junit4] 2> 9931 T2053 oasc.Overseer$ClusterStateUpdater.updateState Update state numShards=2 message={
[junit4:junit4] 2> "operation":"state",
[junit4:junit4] 2> "numShards":"2",
[junit4:junit4] 2> "shard":null,
[junit4:junit4] 2> "roles":null,
[junit4:junit4] 2> "state":"down",
[junit4:junit4] 2> "core":"collection1",
[junit4:junit4] 2> "collection":"collection1",
[junit4:junit4] 2> "node_name":"127.0.0.1:49996_",
[junit4:junit4] 2> "base_url":"http://127.0.0.1:49996"}
[junit4:junit4] 2> 9932 T2053 oasc.Overseer$ClusterStateUpdater.updateState Collection already exists with numShards=2
[junit4:junit4] 2> 9932 T2053 oasc.Overseer$ClusterStateUpdater.updateState Assigning new node to shard shard=shard2
[junit4:junit4] 2> 9949 T2071 oascc.ZkStateReader$2.process A cluster state change: WatchedEvent state:SyncConnected type:NodeDataChanged path:/clusterstate.json, has occurred - updating... (live nodes size: 3)
[junit4:junit4] 2> 9964 T2052 oascc.ZkStateReader$2.process A cluster state change: WatchedEvent state:SyncConnected type:NodeDataChanged path:/clusterstate.json, has occurred - updating... (live nodes size: 3)
[junit4:junit4] 2> 9965 T2086 oascc.ZkStateReader$2.process A cluster state change: WatchedEvent state:SyncConnected type:NodeDataChanged path:/clusterstate.json, has occurred - updating... (live nodes size: 3)
[junit4:junit4] 2> 9965 T2058 oascc.ZkStateReader$2.process A cluster state change: WatchedEvent state:SyncConnected type:NodeDataChanged path:/clusterstate.json, has occurred - updating... (live nodes size: 3)
[junit4:junit4] 2> 10521 T2087 oasc.CoreContainer.registerCore registering core: collection1
[junit4:junit4] 2> 10522 T2087 oasc.ZkController.register Register replica - core:collection1 address:http://127.0.0.1:49996 collection:collection1 shard:shard2
[junit4:junit4] 2> 10524 T2087 oascc.SolrZkClient.makePath makePath: /collections/collection1/leader_elect/shard2/election
[junit4:junit4] 2> 10537 T2035 oazs.PrepRequestProcessor.pRequest Got user-level KeeperException when processing sessionid:0x13c6c36bfd60008 type:delete cxid:0x44 zxid:0x7d txntype:-1 reqpath:n/a Error Path:/solr/collections/collection1/leaders/shard2 Error:KeeperErrorCode = NoNode for /solr/collections/collection1/leaders/shard2
[junit4:junit4] 2> 10538 T2087 oasc.ShardLeaderElectionContext.runLeaderProcess Running the leader process.
[junit4:junit4] 2> 10539 T2035 oazs.PrepRequestProcessor.pRequest Got user-level KeeperException when processing sessionid:0x13c6c36bfd60008 type:create cxid:0x45 zxid:0x7e txntype:-1 reqpath:n/a Error Path:/solr/overseer Error:KeeperErrorCode = NodeExists for /solr/overseer
[junit4:junit4] 2> 10543 T2087 oasc.ShardLeaderElectionContext.waitForReplicasToComeUp Enough replicas found to continue.
[junit4:junit4] 2> 10544 T2087 oasc.ShardLeaderElectionContext.runLeaderProcess I may be the new leader - try and sync
[junit4:junit4] 2> 10544 T2087 oasc.SyncStrategy.sync Sync replicas to http://127.0.0.1:49996/collection1/
[junit4:junit4] 2> 10545 T2087 oasc.SyncStrategy.syncReplicas Sync Success - now sync replicas to me
[junit4:junit4] 2> 10545 T2087 oasc.SyncStrategy.syncToMe http://127.0.0.1:49996/collection1/ has no replicas
[junit4:junit4] 2> 10546 T2087 oasc.ShardLeaderElectionContext.runLeaderProcess I am the new leader: http://127.0.0.1:49996/collection1/
[junit4:junit4] 2> 10546 T2087 oascc.SolrZkClient.makePath makePath: /collections/collection1/leaders/shard2
[junit4:junit4] 2> 10552 T2035 oazs.PrepRequestProcessor.pRequest Got user-level KeeperException when processing sessionid:0x13c6c36bfd60008 type:create cxid:0x4e zxid:0x81 txntype:-1 reqpath:n/a Error Path:/solr/overseer Error:KeeperErrorCode = NodeExists for /solr/overseer
[junit4:junit4] 2> 11473 T2053 oascc.ZkStateReader.updateClusterState Updating cloud state from ZooKeeper...
[junit4:junit4] 2> 11485 T2086 oascc.ZkStateReader$2.process A cluster state change: WatchedEvent state:SyncConnected type:NodeDataChanged path:/clusterstate.json, has occurred - updating... (live nodes size: 3)
[junit4:junit4] 2> 11485 T2052 oascc.ZkStateReader$2.process A cluster state change: WatchedEvent state:SyncConnected type:NodeDataChanged path:/clusterstate.json, has occurred - updating... (live nodes size: 3)
[junit4:junit4] 2> 11486 T2071 oascc.ZkStateReader$2.process A cluster state change: WatchedEvent state:SyncConnected type:NodeDataChanged path:/clusterstate.json, has occurred - updating... (live nodes size: 3)
[junit4:junit4] 2> 11487 T2058 oascc.ZkStateReader$2.process A cluster state change: WatchedEvent state:SyncConnected type:NodeDataChanged path:/clusterstate.json, has occurred - updating... (live nodes size: 3)
[junit4:junit4] 2> 11549 T2087 oasc.ZkController.register We are http://127.0.0.1:49996/collection1/ and leader is http://127.0.0.1:49996/collection1/
[junit4:junit4] 2> 11549 T2087 oasc.ZkController.register No LogReplay needed for core=collection1 baseURL=http://127.0.0.1:49996
[junit4:junit4] 2> 11550 T2087 oasc.ZkController.checkRecovery I am the leader, no recovery necessary
[junit4:junit4] 2> 11550 T2087 oasc.ZkController.publish publishing core=collection1 state=active
[junit4:junit4] 2> 11550 T2087 oasc.ZkController.publish numShards not found on descriptor - reading it from system property
[junit4:junit4] 2> 11553 T2087 oascc.ZkStateReader.updateClusterState Updating cloud state from ZooKeeper...
[junit4:junit4] 2> 11554 T2030 oass.SolrDispatchFilter.init user.dir=/Users/jenkins/jenkins-slave/workspace/Lucene-Solr-trunk-MacOSX/solr/build/solr-core/test/J0
[junit4:junit4] 2> 11555 T2030 oass.SolrDispatchFilter.init SolrDispatchFilter.init() done
[junit4:junit4] 2> 11555 T2030 oascsi.HttpClientUtil.createClient Creating new http client, config:maxConnections=128&maxConnectionsPerHost=32&followRedirects=false
[junit4:junit4] 2> 11768 T2030 oejs.Server.doStart jetty-8.1.8.v20121106
[junit4:junit4] 2> 11773 T2030 oejs.AbstractConnector.doStart Started SelectChannelConnector@127.0.0.1:49999
[junit4:junit4] 2> 11774 T2030 oass.SolrDispatchFilter.init SolrDispatchFilter.init()
[junit4:junit4] 2> 11776 T2030 oasc.SolrResourceLoader.locateSolrHome JNDI not configured for solr (NoInitialContextEx)
[junit4:junit4] 2> 11779 T2030 oasc.SolrResourceLoader.locateSolrHome using system property solr.solr.home: /Users/jenkins/jenkins-slave/workspace/Lucene-Solr-trunk-MacOSX/solr/build/solr-core/test/J0/./org.apache.solr.cloud.BasicDistributedZkTest-jetty3-1359025204463
[junit4:junit4] 2> 11781 T2030 oasc.CoreContainer$Initializer.initialize looking for solr.xml: /Users/jenkins/jenkins-slave/workspace/Lucene-Solr-trunk-MacOSX/solr/build/solr-core/test/J0/./org.apache.solr.cloud.BasicDistributedZkTest-jetty3-1359025204463/solr.xml
[junit4:junit4] 2> 11782 T2030 oasc.CoreContainer.<init> New CoreContainer 121585237
[junit4:junit4] 2> 11782 T2030 oasc.CoreContainer.load Loading CoreContainer using Solr Home: '/Users/jenkins/jenkins-slave/workspace/Lucene-Solr-trunk-MacOSX/solr/build/solr-core/test/J0/./org.apache.solr.cloud.BasicDistributedZkTest-jetty3-1359025204463/'
[junit4:junit4] 2> 11783 T2030 oasc.SolrResourceLoader.<init> new SolrResourceLoader for directory: '/Users/jenkins/jenkins-slave/workspace/Lucene-Solr-trunk-MacOSX/solr/build/solr-core/test/J0/./org.apache.solr.cloud.BasicDistributedZkTest-jetty3-1359025204463/'
[junit4:junit4] 2> 11826 T2030 oashc.HttpShardHandlerFactory.getParameter Setting socketTimeout to: 60000
[junit4:junit4] 2> 11827 T2030 oashc.HttpShardHandlerFactory.getParameter Setting urlScheme to: http://
[junit4:junit4] 2> 11827 T2030 oashc.HttpShardHandlerFactory.getParameter Setting connTimeout to: 15000
[junit4:junit4] 2> 11828 T2030 oashc.HttpShardHandlerFactory.getParameter Setting maxConnectionsPerHost to: 20
[junit4:junit4] 2> 11828 T2030 oashc.HttpShardHandlerFactory.getParameter Setting corePoolSize to: 0
[junit4:junit4] 2> 11828 T2030 oashc.HttpShardHandlerFactory.getParameter Setting maximumPoolSize to: 2147483647
[junit4:junit4] 2> 11829 T2030 oashc.HttpShardHandlerFactory.getParameter Setting maxThreadIdleTime to: 5
[junit4:junit4] 2> 11829 T2030 oashc.HttpShardHandlerFactory.getParameter Setting sizeOfQueue to: -1
[junit4:junit4] 2> 11830 T2030 oashc.HttpShardHandlerFactory.getParameter Setting fairnessPolicy to: false
[junit4:junit4] 2> 11830 T2030 oascsi.HttpClientUtil.createClient Creating new http client, config:maxConnectionsPerHost=20&maxConnections=10000&socketTimeout=60000&connTimeout=15000&retry=false
[junit4:junit4] 2> 11848 T2030 oasc.CoreContainer.load Registering Log Listener
[junit4:junit4] 2> 11870 T2030 oasc.CoreContainer.initZooKeeper Zookeeper client=127.0.0.1:49986/solr
[junit4:junit4] 2> 11870 T2030 oasc.ZkController.checkChrootPath zkHost includes chroot
[junit4:junit4] 2> 11871 T2030 oaz.ZooKeeper.<init> Initiating client connection, connectString=127.0.0.1:49986 sessionTimeout=60000 watcher=org.apache.solr.common.cloud.ConnectionManager@65c100d6
[junit4:junit4] 2> 11873 T2030 oascc.ConnectionManager.waitForConnected Waiting for client to connect to ZooKeeper
[junit4:junit4] 2> 11873 T2098 oaz.ClientCnxn$SendThread.logStartConnect Opening socket connection to server localhost/127.0.0.1:49986. Will not attempt to authenticate using SASL (access denied ("javax.security.auth.AuthPermission" "getLoginConfiguration"))
[junit4:junit4] 2> 11874 T2032 oazs.NIOServerCnxnFactory.run Accepted socket connection from /127.0.0.1:50000
[junit4:junit4] 2> 11875 T2098 oaz.ClientCnxn$SendThread.primeConnection Socket connection established to localhost/127.0.0.1:49986, initiating session
[junit4:junit4] 2> 11876 T2032 oazs.ZooKeeperServer.processConnectRequest Client attempting to establish new session at /127.0.0.1:50000
[junit4:junit4] 2> 11877 T2034 oazs.ZooKeeperServer.finishSessionInit Established session 0x13c6c36bfd60009 with negotiated timeout 20000 for client /127.0.0.1:50000
[junit4:junit4] 2> 11877 T2098 oaz.ClientCnxn$SendThread.onConnected Session establishment complete on server localhost/127.0.0.1:49986, sessionid = 0x13c6c36bfd60009, negotiated timeout = 20000
[junit4:junit4] 2> 11877 T2099 oascc.ConnectionManager.process Watcher org.apache.solr.common.cloud.ConnectionManager@65c100d6 name:ZooKeeperConnection Watcher:127.0.0.1:49986 got event WatchedEvent state:SyncConnected type:None path:null path:null type:None
[junit4:junit4] 2> 11878 T2030 oascc.ConnectionManager.waitForConnected Client is connected to ZooKeeper
[junit4:junit4] 2> 11881 T2035 oazs.PrepRequestProcessor.pRequest2Txn Processed session termination for sessionid: 0x13c6c36bfd60009
[junit4:junit4] 2> 11882 T2032 oazs.NIOServerCnxn.closeSock Closed socket connection for client /127.0.0.1:50000 which had sessionid 0x13c6c36bfd60009
[junit4:junit4] 2> 11883 T2099 oaz.ClientCnxn$EventThread.run EventThread shut down
[junit4:junit4] 2> 11883 T2030 oaz.ZooKeeper.close Session: 0x13c6c36bfd60009 closed
[junit4:junit4] 2> 11884 T2030 oascsi.HttpClientUtil.createClient Creating new http client, config:maxConnections=500&maxConnectionsPerHost=16&socketTimeout=60000&connTimeout=15000
[junit4:junit4] 2> 11889 T2030 oaz.ZooKeeper.<init> Initiating client connection, connectString=127.0.0.1:49986/solr sessionTimeout=30000 watcher=org.apache.solr.common.cloud.ConnectionManager@75e752b2
[junit4:junit4] 2> 11890 T2100 oaz.ClientCnxn$SendThread.logStartConnect Opening socket connection to server localhost/127.0.0.1:49986. Will not attempt to authenticate using SASL (access denied ("javax.security.auth.AuthPermission" "getLoginConfiguration"))
[junit4:junit4] 2> 11891 T2032 oazs.NIOServerCnxnFactory.run Accepted socket connection from /127.0.0.1:50001
[junit4:junit4] 2> 11892 T2100 oaz.ClientCnxn$SendThread.primeConnection Socket connection established to localhost/127.0.0.1:49986, initiating session
[junit4:junit4] 2> 11893 T2032 oazs.ZooKeeperServer.processConnectRequest Client attempting to establish new session at /127.0.0.1:50001
[junit4:junit4] 2> 11893 T2030 oascc.ConnectionManager.waitForConnected Waiting for client to connect to ZooKeeper
[junit4:junit4] 2> 11895 T2034 oazs.ZooKeeperServer.finishSessionInit Established session 0x13c6c36bfd6000a with negotiated timeout 20000 for client /127.0.0.1:50001
[junit4:junit4] 2> 11895 T2100 oaz.ClientCnxn$SendThread.onConnected Session establishment complete on server localhost/127.0.0.1:49986, sessionid = 0x13c6c36bfd6000a, negotiated timeout = 20000
[junit4:junit4] 2> 11895 T2101 oascc.ConnectionManager.process Watcher org.apache.solr.common.cloud.ConnectionManager@75e752b2 name:ZooKeeperConnection Watcher:127.0.0.1:49986/solr got event WatchedEvent state:SyncConnected type:None path:null path:null type:None
[junit4:junit4] 2> 11896 T2030 oascc.ConnectionManager.waitForConnected Client is connected to ZooKeeper
[junit4:junit4] 2> 11897 T2035 oazs.PrepRequestProcessor.pRequest Got user-level KeeperException when processing sessionid:0x13c6c36bfd6000a type:create cxid:0x1 zxid:0x8e txntype:-1 reqpath:n/a Error Path:/solr/overseer Error:KeeperErrorCode = NodeExists for /solr/overseer
[junit4:junit4] 2> 11902 T2035 oazs.PrepRequestProcessor.pRequest Got user-level KeeperException when processing sessionid:0x13c6c36bfd6000a type:create cxid:0x2 zxid:0x8f txntype:-1 reqpath:n/a Error Path:/solr/overseer Error:KeeperErrorCode = NodeExists for /solr/overseer
[junit4:junit4] 2> 11908 T2030 oasc.ZkController.createEphemeralLiveNode Register node as live in ZooKeeper:/live_nodes/127.0.0.1:49999_
[junit4:junit4] 2> 11911 T2035 oazs.PrepRequestProcessor.pRequest Got user-level KeeperException when processing sessionid:0x13c6c36bfd6000a type:delete cxid:0x4 zxid:0x90 txntype:-1 reqpath:n/a Error Path:/solr/live_nodes/127.0.0.1:49999_ Error:KeeperErrorCode = NoNode for /solr/live_nodes/127.0.0.1:49999_
[junit4:junit4] 2> 11912 T2030 oascc.SolrZkClient.makePath makePath: /live_nodes/127.0.0.1:49999_
[junit4:junit4] 2> 11916 T2086 oascc.ZkStateReader$2.process A cluster state change: WatchedEvent state:SyncConnected type:NodeChildrenChanged path:/live_nodes, has occurred - updating... (live nodes size: 3)
[junit4:junit4] 2> 11916 T2071 oascc.ZkStateReader$2.process A cluster state change: WatchedEvent state:SyncConnected type:NodeChildrenChanged path:/live_nodes, has occurred - updating... (live nodes size: 3)
[junit4:junit4] 2> 11918 T2052 oascc.ZkStateReader$3.process Updating live nodes... (4)
[junit4:junit4] 2> 11918 T2052 oascc.ZkStateReader$2.process A cluster state change: WatchedEvent state:SyncConnected type:NodeChildrenChanged path:/live_nodes, has occurred - updating... (live nodes size: 4)
[junit4:junit4] 2> 11918 T2058 oascc.ZkStateReader$3.process Updating live nodes... (4)
[junit4:junit4] 2> 11918 T2058 oascc.ZkStateReader$2.process A cluster state change: WatchedEvent state:SyncConnected type:NodeChildrenChanged path:/live_nodes, has occurred - updating... (live nodes size: 4)
[junit4:junit4] 2> 11926 T2086 oascc.ZkStateReader$3.process Updating live nodes... (4)
[junit4:junit4] 2> 11926 T2071 oascc.ZkStateReader$3.process Updating live nodes... (4)
[junit4:junit4] 2> 11931 T2030 oascc.ZkStateReader.createClusterStateWatchersAndUpdate Updating cluster state from ZooKeeper...
[junit4:junit4] 2> 11977 T2102 oasc.CoreContainer.create Creating SolrCore 'collection1' using instanceDir: /Users/jenkins/jenkins-slave/workspace/Lucene-Solr-trunk-MacOSX/solr/build/solr-core/test/J0/./org.apache.solr.cloud.BasicDistributedZkTest-jetty3-1359025204463/collection1
[junit4:junit4] 2> 11977 T2102 oasc.ZkController.createCollectionZkNode Check for collection zkNode:collection1
[junit4:junit4] 2> 11988 T2102 oasc.ZkController.createCollectionZkNode Collection zkNode exists
[junit4:junit4] 2> 11989 T2102 oasc.ZkController.readConfigName Load collection config from:/collections/collection1
[junit4:junit4] 2> 11993 T2102 oasc.SolrResourceLoader.<init> new SolrResourceLoader for directory: '/Users/jenkins/jenkins-slave/workspace/Lucene-Solr-trunk-MacOSX/solr/build/solr-core/test/J0/./org.apache.solr.cloud.BasicDistributedZkTest-jetty3-1359025204463/collection1/'
[junit4:junit4] 2> 11996 T2102 oasc.SolrResourceLoader.replaceClassLoader Adding 'file:/Users/jenkins/jenkins-slave/workspace/Lucene-Solr-trunk-MacOSX/solr/build/solr-core/test/J0/org.apache.solr.cloud.BasicDistributedZkTest-jetty3-1359025204463/collection1/lib/classes/' to classloader
[junit4:junit4] 2> 11997 T2102 oasc.SolrResourceLoader.replaceClassLoader Adding 'file:/Users/jenkins/jenkins-slave/workspace/Lucene-Solr-trunk-MacOSX/solr/build/solr-core/test/J0/org.apache.solr.cloud.BasicDistributedZkTest-jetty3-1359025204463/collection1/lib/README' to classloader
[junit4:junit4] 2> 12061 T2102 oasc.SolrConfig.<init> Using Lucene MatchVersion: LUCENE_50
[junit4:junit4] 2> 12150 T2102 oasc.SolrConfig.<init> Loaded SolrConfig: solrconfig.xml
[junit4:junit4] 2> 12152 T2102 oass.IndexSchema.readSchema Reading Solr Schema
[junit4:junit4] 2> 12159 T2102 oass.IndexSchema.readSchema Schema name=test
[junit4:junit4] 2> 12972 T2102 oass.OpenExchangeRatesOrgProvider.init Initialized with rates=open-exchange-rates.json, refreshInterval=1440.
[junit4:junit4] 2> 12989 T2102 oass.IndexSchema.readSchema default search field in schema is text
[junit4:junit4] 2> 12993 T2102 oass.IndexSchema.readSchema unique key field: id
[junit4:junit4] 2> 13001 T2053 oascc.ZkStateReader.updateClusterState Updating cloud state from ZooKeeper...
[junit4:junit4] 2> 13002 T2053 oasc.Overseer$ClusterStateUpdater.updateState Update state numShards=2 message={
[junit4:junit4] 2> "operation":"state",
[junit4:junit4] 2> "numShards":"2",
[junit4:junit4] 2> "shard":"shard2",
[junit4:junit4] 2> "roles":null,
[junit4:junit4] 2> "state":"active",
[junit4:junit4] 2> "core":"collection1",
[junit4:junit4] 2> "collection":"collection1",
[junit4:junit4] 2> "node_name":"127.0.0.1:49996_",
[junit4:junit4] 2> "base_url":"http://127.0.0.1:49996"}
[junit4:junit4] 2> 13011 T2052 oascc.ZkStateReader$2.process A cluster state change: WatchedEvent state:SyncConnected type:NodeDataChanged path:/clusterstate.json, has occurred - updating... (live nodes size: 4)
[junit4:junit4] 2> 13013 T2086 oascc.ZkStateReader$2.process A cluster state change: WatchedEvent state:SyncConnected type:NodeDataChanged path:/clusterstate.json, has occurred - updating... (live nodes size: 4)
[junit4:junit4] 2> 13013 T2058 oascc.ZkStateReader$2.process A cluster state change: WatchedEvent state:SyncConnected type:NodeDataChanged path:/clusterstate.json, has occurred - updating... (live nodes size: 4)
[junit4:junit4] 2> 13013 T2071 oascc.ZkStateReader$2.process A cluster state change: WatchedEvent state:SyncConnected type:NodeDataChanged path:/clusterstate.json, has occurred - updating... (live nodes size: 4)
[junit4:junit4] 2> 13018 T2101 oascc.ZkStateReader$2.process A cluster state change: WatchedEvent state:SyncConnected type:NodeDataChanged path:/clusterstate.json, has occurred - updating... (live nodes size: 4)
[junit4:junit4] 2> 13035 T2102 oass.FileExchangeRateProvider.reload Reloading exchange rates from file currency.xml
[junit4:junit4] 2> 13046 T2102 oass.FileExchangeRateProvider.reload Reloading exchange rates from file currency.xml
[junit4:junit4] 2> 13055 T2102 oass.OpenExchangeRatesOrgProvider.reload Reloading exchange rates from open-exchange-rates.json
[junit4:junit4] 2> 13058 T2102 oass.OpenExchangeRatesOrgProvider.reload Reloading exchange rates from open-exchange-rates.json
[junit4:junit4] 2> 13060 T2102 oasc.SolrCore.<init> [collection1] Opening new SolrCore at /Users/jenkins/jenkins-slave/workspace/Lucene-Solr-trunk-MacOSX/solr/build/solr-core/test/J0/./org.apache.solr.cloud.BasicDistributedZkTest-jetty3-1359025204463/collection1/, dataDir=./org.apache.solr.cloud.BasicDistributedZkTest-1359025192910/jetty3/
[junit4:junit4] 2> 13060 T2102 oasc.JmxMonitoredMap.<init> JMX monitoring is enabled. Adding Solr mbeans to JMX Server: com.sun.jmx.mbeanserver.JmxMBeanServer@7affa511
[junit4:junit4] 2> 13061 T2102 oasc.SolrCore.initDirectoryFactory solr.NRTCachingDirectoryFactory
[junit4:junit4] 2> 13062 T2102 oasc.CachingDirectoryFactory.get return new directory for /Users/jenkins/jenkins-slave/workspace/Lucene-Solr-trunk-MacOSX/solr/build/solr-core/test/J0/./org.apache.solr.cloud.BasicDistributedZkTest-1359025192910/jetty3 forceNew:false
[junit4:junit4] 2> 13062 T2102 oasc.CachingDirectoryFactory.close Releasing directory:/Users/jenkins/jenkins-slave/workspace/Lucene-Solr-trunk-MacOSX/solr/build/solr-core/test/J0/./org.apache.solr.cloud.BasicDistributedZkTest-1359025192910/jetty3
[junit4:junit4] 2> 13062 T2102 oasc.SolrCore.getNewIndexDir New index directory detected: old=null new=./org.apache.solr.cloud.BasicDistributedZkTest-1359025192910/jetty3/index/
[junit4:junit4] 2> 13063 T2102 oasc.SolrCore.initIndex WARNING [collection1] Solr index directory './org.apache.solr.cloud.BasicDistributedZkTest-1359025192910/jetty3/index' doesn't exist. Creating new index...
[junit4:junit4] 2> 13064 T2102 oasc.CachingDirectoryFactory.get return new directory for /Users/jenkins/jenkins-slave/workspace/Lucene-Solr-trunk-MacOSX/solr/build/solr-core/test/J0/./org.apache.solr.cloud.BasicDistributedZkTest-1359025192910/jetty3/index forceNew:false
[junit4:junit4] 2> 13069 T2102 oasc.SolrDeletionPolicy.onCommit SolrDeletionPolicy.onCommit: commits:num=1
[junit4:junit4] 2> commit{dir=RateLimitedDirectoryWrapper(NRTCachingDirectory(org.apache.lucene.store.NIOFSDirectory@/Users/jenkins/jenkins-slave/workspace/Lucene-Solr-trunk-MacOSX/solr/build/solr-core/test/J0/org.apache.solr.cloud.BasicDistributedZkTest-1359025192910/jetty3/index lockFactory=org.apache.lucene.store.NativeFSLockFactory@75cd83d; maxCacheMB=48.0 maxMergeSizeMB=4.0)),segFN=segments_1,generation=1,filenames=[segments_1]
[junit4:junit4] 2> 13069 T2102 oasc.SolrDeletionPolicy.updateCommits newest commit = 1[segments_1]
[junit4:junit4] 2> 13070 T2102 oasc.CachingDirectoryFactory.close Releasing directory:/Users/jenkins/jenkins-slave/workspace/Lucene-Solr-trunk-MacOSX/solr/build/solr-core/test/J0/./org.apache.solr.cloud.BasicDistributedZkTest-1359025192910/jetty3/index
[junit4:junit4] 2> 13070 T2102 oasc.SolrCore.initWriters created xml: solr.XMLResponseWriter
[junit4:junit4] 2> 13073 T2102 oasup.UpdateRequestProcessorChain.init inserting DistributedUpdateProcessorFactory into updateRequestProcessorChain "dedupe"
[junit4:junit4] 2> 13074 T2102 oasup.UpdateRequestProcessorChain.init inserting DistributedUpdateProcessorFactory into updateRequestProcessorChain "dedupe-allfields"
[junit4:junit4] 2> 13074 T2102 oasup.UpdateRequestProcessorChain.init inserting DistributedUpdateProcessorFactory into updateRequestProcessorChain "stored_sig"
[junit4:junit4] 2> 13075 T2102 oasup.UpdateRequestProcessorChain.init inserting DistributedUpdateProcessorFactory into updateRequestProcessorChain "uniq-fields"
[junit4:junit4] 2> 13076 T2102 oasup.UpdateRequestProcessorChain.init inserting DistributedUpdateProcessorFactory into updateRequestProcessorChain "distrib-dup-test-chain-implicit"
[junit4:junit4] 2> 13076 T2102 oasc.RequestHandlers.initHandlersFromConfig adding lazy requestHandler: solr.ReplicationHandler
[junit4:junit4] 2> 13077 T2102 oasc.RequestHandlers.initHandlersFromConfig created /replication: solr.ReplicationHandler
[junit4:junit4] 2> 13078 T2102 oasc.RequestHandlers.initHandlersFromConfig created standard: solr.StandardRequestHandler
[junit4:junit4] 2> 13079 T2102 oasc.RequestHandlers.initHandlersFromConfig created /get: solr.RealTimeGetHandler
[junit4:junit4] 2> 13080 T2102 oasc.RequestHandlers.initHandlersFromConfig created dismax: solr.SearchHandler
[junit4:junit4] 2> 13081 T2102 oasc.RequestHandlers.initHandlersFromConfig created mock: org.apache.solr.core.MockQuerySenderListenerReqHandler
[junit4:junit4] 2> 13081 T2102 oasc.RequestHandlers.initHandlersFromConfig created /admin/: org.apache.solr.handler.admin.AdminHandlers
[junit4:junit4] 2> 13082 T2102 oasc.RequestHandlers.initHandlersFromConfig created defaults: solr.StandardRequestHandler
[junit4:junit4] 2> 13083 T2102 oasc.RequestHandlers.initHandlersFromConfig adding lazy requestHandler: solr.StandardRequestHandler
[junit4:junit4] 2> 13083 T2102 oasc.RequestHandlers.initHandlersFromConfig created lazy: solr.StandardRequestHandler
[junit4:junit4] 2> 13084 T2102 oasc.RequestHandlers.initHandlersFromConfig created /update: solr.UpdateRequestHandler
[junit4:junit4] 2> 13085 T2102 oasc.RequestHandlers.initHandlersFromConfig created /terms: org.apache.solr.handler.component.SearchHandler
[junit4:junit4] 2> 13086 T2102 oasc.RequestHandlers.initHandlersFromConfig created spellCheckCompRH: org.apache.solr.handler.component.SearchHandler
[junit4:junit4] 2> 13086 T2102 oasc.RequestHandlers.initHandlersFromConfig created spellCheckCompRH_Direct: org.apache.solr.handler.component.SearchHandler
[junit4:junit4] 2> 13087 T2102 oasc.RequestHandlers.initHandlersFromConfig created spellCheckWithWordbreak: org.apache.solr.handler.component.SearchHandler
[junit4:junit4] 2> 13087 T2102 oasc.RequestHandlers.initHandlersFromConfig created spellCheckWithWordbreak_Direct: org.apache.solr.handler.component.SearchHandler
[junit4:junit4] 2> 13088 T2102 oasc.RequestHandlers.initHandlersFromConfig created spellCheckCompRH1: org.apache.solr.handler.component.SearchHandler
[junit4:junit4] 2> 13089 T2102 oasc.RequestHandlers.initHandlersFromConfig created mltrh: org.apache.solr.handler.component.SearchHandler
[junit4:junit4] 2> 13089 T2102 oasc.RequestHandlers.initHandlersFromConfig created tvrh: org.apache.solr.handler.component.SearchHandler
[junit4:junit4] 2> 13090 T2102 oasc.RequestHandlers.initHandlersFromConfig created /mlt: solr.MoreLikeThisHandler
[junit4:junit4] 2> 13090 T2102 oasc.RequestHandlers.initHandlersFromConfig created /debug/dump: solr.DumpRequestHandler
[junit4:junit4] 2> 13097 T2102 oashl.XMLLoader.init xsltCacheLifetimeSeconds=60
[junit4:junit4] 2> 13101 T2102 oasc.SolrCore.initDeprecatedSupport WARNING solrconfig.xml uses deprecated <admin/gettableFiles>, Please update your config to use the ShowFileRequestHandler.
[junit4:junit4] 2> 13103 T2102 oasc.SolrCore.initDeprecatedSupport WARNING adding ShowFileRequestHandler with hidden files: [SCHEMA.XML, OLD_SYNONYMS.TXT, STOPWORDS.TXT, PROTWORDS.TXT, OPEN-EXCHANGE-RATES.JSON, SYNONYMS.TXT, CURRENCY.XML, MAPPING-ISOLATIN1ACCENT.TXT]
[junit4:junit4] 2> 13106 T2102 oasc.CachingDirectoryFactory.close Releasing directory:/Users/jenkins/jenkins-slave/workspace/Lucene-Solr-trunk-MacOSX/solr/build/solr-core/test/J0/./org.apache.solr.cloud.BasicDistributedZkTest-1359025192910/jetty3
[junit4:junit4] 2> 13107 T2102 oass.SolrIndexSearcher.<init> Opening Searcher@6363756a main
[junit4:junit4] 2> 13110 T2102 oasu.CommitTracker.<init> Hard AutoCommit: disabled
[junit4:junit4] 2> 13114 T2102 oasu.CommitTracker.<init> Soft AutoCommit: disabled
[junit4:junit4] 2> 13116 T2102 oashc.SpellCheckComponent.inform Initializing spell checkers
[junit4:junit4] 2> 13122 T2102 oass.DirectSolrSpellChecker.init init: {name=direct,classname=DirectSolrSpellChecker,field=lowerfilt,minQueryLength=3}
[junit4:junit4] 2> 13190 T2103 oasc.SolrCore.registerSearcher [collection1] Registered new searcher Searcher@6363756a main{StandardDirectoryReader(segments_1:1)}
[junit4:junit4] 2> 13209 T2102 oasc.ZkController.publish publishing core=collection1 state=down
[junit4:junit4] 2> 13209 T2102 oasc.ZkController.publish numShards not found on descriptor - reading it from system property
[junit4:junit4] 2> 14536 T2053 oascc.ZkStateReader.updateClusterState Updating cloud state from ZooKeeper...
[junit4:junit4] 2> 14537 T2053 oasc.Overseer$ClusterStateUpdater.updateState Update state numShards=2 message={
[junit4:junit4] 2> "operation":"state",
[junit4:junit4] 2> "numShards":"2",
[junit4:junit4] 2> "shard":null,
[junit4:junit4] 2> "roles":null,
[junit4:junit4] 2> "state":"down",
[junit4:junit4] 2> "core":"collection1",
[junit4:junit4] 2> "collection":"collection1",
[junit4:junit4] 2> "node_name":"127.0.0.1:49999_",
[junit4:junit4] 2> "base_url":"http://127.0.0.1:49999"}
[junit4:junit4] 2> 14537 T2053 oasc.Overseer$ClusterStateUpdater.updateState Collection already exists with numShards=2
[junit4:junit4] 2> 14538 T2053 oasc.Overseer$ClusterStateUpdater.updateState Assigning new node to shard shard=shard1
[junit4:junit4] 2> 14544 T2052 oascc.ZkStateReader$2.process A cluster state change: WatchedEvent state:SyncConnected type:NodeDataChanged path:/clusterstate.json, has occurred - updating... (live nodes size: 4)
[junit4:junit4] 2> 14545 T2071 oascc.ZkStateReader$2.process A cluster state change: WatchedEvent state:SyncConnected type:NodeDataChanged path:/clusterstate.json, has occurred - updating... (live nodes size: 4)
[junit4:junit4] 2> 14545 T2058 oascc.ZkStateReader$2.process A cluster state change: WatchedEvent state:SyncConnected type:NodeDataChanged path:/clusterstate.json, has occurred - updating... (live nodes size: 4)
[junit4:junit4] 2> 14546 T2086 oascc.ZkStateReader$2.process A cluster state change: WatchedEvent state:SyncConnected type:NodeDataChanged path:/clusterstate.json, has occurred - updating... (live nodes size: 4)
[junit4:junit4] 2> 14547 T2101 oascc.ZkStateReader$2.process A cluster state change: WatchedEvent state:SyncConnected type:NodeDataChanged path:/clusterstate.json, has occurred - updating... (live nodes size: 4)
[junit4:junit4] 2> 15241 T2102 oasc.CoreContainer.registerCore registering core: collection1
[junit4:junit4] 2> 15242 T2102 oasc.ZkController.register Register replica - core:collection1 address:http://127.0.0.1:49999 collection:collection1 shard:shard1
[junit4:junit4] 2> 15255 T2102 oasc.ZkController.register We are http://127.0.0.1:49999/collection1/ and leader is http://127.0.0.1:49993/collection1/
[junit4:junit4] 2> 15255 T2102 oasc.ZkController.register No LogReplay needed for core=collection1 baseURL=http://127.0.0.1:49999
[junit4:junit4] 2> 15255 T2102 oasc.ZkController.checkRecovery Core needs to recover:collection1
[junit4:junit4] 2> 15256 T2102 oasu.DefaultSolrCoreState.doRecovery Running recovery - first canceling any ongoing recovery
[junit4:junit4] 2> ASYNC NEW_CORE C155 name=collection1 org.apache.solr.core.SolrCore@5f93ad1 url=http://127.0.0.1:49999/collection1 node=127.0.0.1:49999_ C155_STATE=coll:collection1 core:collection1 props:{shard=null, roles=null, state=down, core=collection1, collection=collection1, node_name=127.0.0.1:49999_, base_url=http://127.0.0.1:49999}
[junit4:junit4] 2> 15256 T2104 C155 P49999 oasc.RecoveryStrategy.run Starting recovery process. core=collection1 recoveringAfterStartup=true
[junit4:junit4] 2> 15257 T2104 C155 P49999 oasc.RecoveryStrategy.doRecovery ###### startupVersions=[]
[junit4:junit4] 2> 15257 T2104 C155 P49999 oasc.ZkController.publish publishing core=collection1 state=recovering
[junit4:junit4] 2> 15257 T2102 oascc.ZkStateReader.updateClusterState Updating cloud state from ZooKeeper...
[junit4:junit4] 2> 15257 T2104 C155 P49999 oasc.ZkController.publish numShards not found on descriptor - reading it from system property
[junit4:junit4] 2> 15260 T2104 C155 P49999 oascsi.HttpClientUtil.createClient Creating new http client, config:maxConnections=128&maxConnectionsPerHost=32&followRedirects=false
[junit4:junit4] 2> 15260 T2030 oass.SolrDispatchFilter.init user.dir=/Users/jenkins/jenkins-slave/workspace/Lucene-Solr-trunk-MacOSX/solr/build/solr-core/test/J0
[junit4:junit4] 2> 15261 T2030 oass.SolrDispatchFilter.init SolrDispatchFilter.init() done
[junit4:junit4] 2> 15261 T2030 oascsi.HttpClientUtil.createClient Creating new http client, config:maxConnections=128&maxConnectionsPerHost=32&followRedirects=false
[junit4:junit4] 2> 15504 T2030 oejs.Server.doStart jetty-8.1.8.v20121106
[junit4:junit4] 2> 15516 T2030 oejs.AbstractConnector.doStart Started SelectChannelConnector@127.0.0.1:50003
[junit4:junit4] 2> 15517 T2030 oass.SolrDispatchFilter.init SolrDispatchFilter.init()
[junit4:junit4] 2> 15517 T2030 oasc.SolrResourceLoader.locateSolrHome JNDI not configured for solr (NoInitialContextEx)
[junit4:junit4] 2> 15518 T2030 oasc.SolrResourceLoader.locateSolrHome using system property solr.solr.home: /Users/jenkins/jenkins-slave/workspace/Lucene-Solr-trunk-MacOSX/solr/build/solr-core/test/J0/./org.apache.solr.cloud.BasicDistributedZkTest-jetty4-1359025208173
[junit4:junit4] 2> 15518 T2030 oasc.CoreContainer$Initializer.initialize looking for solr.xml: /Users/jenkins/jenkins-slave/workspace/Lucene-Solr-trunk-MacOSX/solr/build/solr-core/test/J0/./org.apache.solr.cloud.BasicDistributedZkTest-jetty4-1359025208173/solr.xml
[junit4:junit4] 2> 15528 T2030 oasc.CoreContainer.<init> New CoreContainer 781912045
[junit4:junit4] 2> 15529 T2030 oasc.CoreContainer.load Loading CoreContainer using Solr Home: '/Users/jenkins/jenkins-slave/workspace/Lucene-Solr-trunk-MacOSX/solr/build/solr-core/test/J0/./org.apache.solr.cloud.BasicDistributedZkTest-jetty4-1359025208173/'
[junit4:junit4] 2> 15529 T2030 oasc.SolrResourceLoader.<init> new SolrResourceLoader for directory: '/Users/jenkins/jenkins-slave/workspace/Lucene-Solr-trunk-MacOSX/solr/build/solr-core/test/J0/./org.apache.solr.cloud.BasicDistributedZkTest-jetty4-1359025208173/'
[junit4:junit4] 2> 15567 T2030 oashc.HttpShardHandlerFactory.getParameter Setting socketTimeout to: 60000
[junit4:junit4] 2> 15568 T2030 oashc.HttpShardHandlerFactory.getParameter Setting urlScheme to: http://
[junit4:junit4] 2> 15568 T2030 oashc.HttpShardHandlerFactory.getParameter Setting connTimeout to: 15000
[junit4:junit4] 2> 15569 T2030 oashc.HttpShardHandlerFactory.getParameter Setting maxConnectionsPerHost to: 20
[junit4:junit4] 2> 15569 T2030 oashc.HttpShardHandlerFactory.getParameter Setting corePoolSize to: 0
[junit4:junit4] 2> 15570 T2030 oashc.HttpShardHandlerFactory.getParameter Setting maximumPoolSize to: 2147483647
[junit4:junit4] 2> 15570 T2030 oashc.HttpShardHandlerFactory.getParameter Setting maxThreadIdleTime to: 5
[junit4:junit4] 2> 15571 T2030 oashc.HttpShardHandlerFactory.getParameter Setting sizeOfQueue to: -1
[junit4:junit4] 2> 15571 T2030 oashc.HttpShardHandlerFactory.getParameter Setting fairnessPolicy to: false
[junit4:junit4] 2> 15572 T2030 oascsi.HttpClientUtil.createClient Creating new http client, config:maxConnectionsPerHost=20&maxConnections=10000&socketTimeout=60000&connTimeout=15000&retry=false
[junit4:junit4] 2> 15593 T2030 oasc.CoreContainer.load Registering Log Listener
[junit4:junit4] 2> 15612 T2030 oasc.CoreContainer.initZooKeeper Zookeeper client=127.0.0.1:49986/solr
[junit4:junit4] 2> 15613 T2030 oasc.ZkController.checkChrootPath zkHost includes chroot
[junit4:junit4] 2> 15613 T2030 oaz.ZooKeeper.<init> Initiating client connection, connectString=127.0.0.1:49986 sessionTimeout=60000 watcher=org.apache.solr.common.cloud.ConnectionManager@42f68ca5
[junit4:junit4] 2> 15615 T2114 oaz.ClientCnxn$SendThread.logStartConnect Opening socket connection to server localhost/127.0.0.1:49986. Will not attempt to authenticate using SASL (access denied ("javax.security.auth.AuthPermission" "getLoginConfiguration"))
[junit4:junit4] 2> 15615 T2030 oascc.ConnectionManager.waitForConnected Waiting for client to connect to ZooKeeper
[junit4:junit4] 2> 15645 T2114 oaz.ClientCnxn$SendThread.primeConnection Socket connection established to localhost/127.0.0.1:49986, initiating session
[junit4:junit4] 2> 15646 T2032 oazs.NIOServerCnxnFactory.run Accepted socket connection from /127.0.0.1:50004
[junit4:junit4] 2> 15646 T2032 oazs.ZooKeeperServer.processConnectRequest Client attempting to establish new session at /127.0.0.1:50004
[junit4:junit4] 2> 15648 T2034 oazs.ZooKeeperServer.finishSessionInit Established session 0x13c6c36bfd6000b with negotiated timeout 20000 for client /127.0.0.1:50004
[junit4:junit4] 2> 15648 T2114 oaz.ClientCnxn$SendThread.onConnected Session establishment complete on server localhost/127.0.0.1:49986, sessionid = 0x13c6c36bfd6000b, negotiated timeout = 20000
[junit4:junit4] 2> 15648 T2115 oascc.ConnectionManager.process Watcher org.apache.solr.common.cloud.ConnectionManager@42f68ca5 name:ZooKeeperConnection Watcher:127.0.0.1:49986 got event WatchedEvent state:SyncConnected type:None path:null path:null type:None
[junit4:junit4] 2> 15649 T2030 oascc.ConnectionManager.waitForConnected Client is connected to ZooKeeper
[junit4:junit4] 2> 15655 T2035 oazs.PrepRequestProcessor.pRequest2Txn Processed session termination for sessionid: 0x13c6c36bfd6000b
[junit4:junit4] 2> 15656 T2032 oazs.NIOServerCnxn.closeSock Closed socket connection for client /127.0.0.1:50004 which had sessionid 0x13c6c36bfd6000b
[junit4:junit4] 2> 15656 T2030 oaz.ZooKeeper.close Session: 0x13c6c36bfd6000b closed
[junit4:junit4] 2> 15656 T2115 oaz.ClientCnxn$EventThread.run EventThread shut down
[junit4:junit4] 2> 15657 T2030 oascsi.HttpClientUtil.createClient Creating new http client, config:maxConnections=500&maxConnectionsPerHost=16&socketTimeout=60000&connTimeout=15000
[junit4:junit4] 2> 15662 T2030 oaz.ZooKeeper.<init> Initiating client connection, connectString=127.0.0.1:49986/solr sessionTimeout=30000 watcher=org.apache.solr.common.cloud.ConnectionManager@7f04735c
[junit4:junit4] 2> 15663 T2030 oascc.ConnectionManager.waitForConnected Waiting for client to connect to ZooKeeper
[junit4:junit4] 2> 15664 T2116 oaz.ClientCnxn$SendThread.logStartConnect Opening socket connection to server localhost/127.0.0.1:49986. Will not attempt to authenticate using SASL (access denied ("javax.security.auth.AuthPermission" "getLoginConfiguration"))
[junit4:junit4] 2> 15665 T2116 oaz.ClientCnxn$SendThread.primeConnection Socket connection established to localhost/127.0.0.1:49986, initiating session
[junit4:junit4] 2> 15665 T2032 oazs.NIOServerCnxnFactory.run Accepted socket connection from /127.0.0.1:50005
[junit4:junit4] 2> 15665 T2032 oazs.ZooKeeperServer.processConnectRequest Client attempting to establish new session at /127.0.0.1:50005
[junit4:junit4] 2> 15667 T2034 oazs.ZooKeeperServer.finishSessionInit Established session 0x13c6c36bfd6000c with negotiated timeout 20000 for client /127.0.0.1:50005
[junit4:junit4] 2> 15668 T2116 oaz.ClientCnxn$SendThread.onConnected Session establishment complete on server localhost/127.0.0.1:49986, sessionid = 0x13c6c36bfd6000c, negotiated timeout = 20000
[junit4:junit4] 2> 15668 T2117 oascc.ConnectionManager.process Watcher org.apache.solr.common.cloud.ConnectionManager@7f04735c name:ZooKeeperConnection Watcher:127.0.0.1:49986/solr got event WatchedEvent state:SyncConnected type:None path:null path:null type:None
[junit4:junit4] 2> 15669 T2030 oascc.ConnectionManager.waitForConnected Client is connected to ZooKeeper
[junit4:junit4] 2> 15670 T2035 oazs.PrepRequestProcessor.pRequest Got user-level KeeperException when processing sessionid:0x13c6c36bfd6000c type:create cxid:0x1 zxid:0xa1 txntype:-1 reqpath:n/a Error Path:/solr/overseer Error:KeeperErrorCode = NodeExists for /solr/overseer
[junit4:junit4] 2> 15672 T2035 oazs.PrepRequestProcessor.pRequest Got user-level KeeperException when processing sessionid:0x13c6c36bfd6000c type:create cxid:0x2 zxid:0xa2 txntype:-1 reqpath:n/a Error Path:/solr/overseer Error:KeeperErrorCode = NodeExists for /solr/overseer
[junit4:junit4] 2> 15674 T2030 oasc.ZkController.createEphemeralLiveNode Register node as live in ZooKeeper:/live_nodes/127.0.0.1:50003_
[junit4:junit4] 2> 15675 T2035 oazs.PrepRequestProcessor.pRequest Got user-level KeeperException when processing sessionid:0x13c6c36bfd6000c type:delete cxid:0x4 zxid:0xa3 txntype:-1 reqpath:n/a Error Path:/solr/live_nodes/127.0.0.1:50003_ Error:KeeperErrorCode = NoNode for /solr/live_nodes/127.0.0.1:50003_
[junit4:junit4] 2> 15676 T2030 oascc.SolrZkClient.makePath makePath: /live_nodes/127.0.0.1:50003_
[junit4:junit4] 2> 15679 T2071 oascc.ZkStateReader$2.process A cluster state change: WatchedEvent state:SyncConnected type:NodeChildrenChanged path:/live_nodes, has occurred - updating... (live nodes size: 4)
[junit4:junit4] 2> 15684 T2101 oascc.ZkStateReader$2.process A cluster state change: WatchedEvent state:SyncConnected type:NodeChildrenChanged path:/live_nodes, has occurred - updating... (live nodes size: 4)
[junit4:junit4] 2> 15685 T2052 oascc.ZkStateReader$3.process Updating live nodes... (5)
[junit4:junit4] 2> 15685 T2052 oascc.ZkStateReader$2.process A cluster state change: WatchedEvent state:SyncConnected type:NodeChildrenChanged path:/live_nodes, has occurred - updating... (live nodes size: 5)
[junit4:junit4] 2> 15687 T2071 oascc.ZkStateReader$3.process Updating live nodes... (5)
[junit4:junit4] 2> 15687 T2058 oascc.ZkStateReader$3.process Updating live nodes... (5)
[junit4:junit4] 2> 15688 T2058 oascc.ZkStateReader$2.process A cluster state change: WatchedEvent state:SyncConnected type:NodeChildrenChanged path:/live_nodes, has occurred - updating... (live nodes size: 5)
[junit4:junit4] 2> 15696 T2086 oascc.ZkStateReader$2.process A cluster state change: WatchedEvent state:SyncConnected type:NodeChildrenChanged path:/live_nodes, has occurred - updating... (live nodes size: 4)
[junit4:junit4] 2> 15698 T2086 oascc.ZkStateReader$3.process Updating live nodes... (5)
[junit4:junit4] 2> 15702 T2030 oascc.ZkStateReader.createClusterStateWatchersAndUpdate Updating cluster state from ZooKeeper...
[junit4:junit4] 2> 15719 T2118 oasc.CoreContainer.create Creating SolrCore 'collection1' using instanceDir: /Users/jenkins/jenkins-slave/workspace/Lucene-Solr-trunk-MacOSX/solr/build/solr-core/test/J0/./org.apache.solr.cloud.BasicDistributedZkTest-jetty4-1359025208173/collection1
[junit4:junit4] 2> 15720 T2101 oascc.ZkStateReader$3.process Updating live nodes... (5)
[junit4:junit4] 2> 15720 T2118 oasc.ZkController.createCollectionZkNode Check for collection zkNode:collection1
[junit4:junit4] 2> 15721 T2118 oasc.ZkController.createCollectionZkNode Collection zkNode exists
[junit4:junit4] 2> 15721 T2118 oasc.ZkController.readConfigName Load collection config from:/collections/collection1
[junit4:junit4] 2> 15724 T2118 oasc.SolrResourceLoader.<init> new SolrResourceLoader for directory: '/Users/jenkins/jenkins-slave/workspace/Lucene-Solr-trunk-MacOSX/solr/build/solr-core/test/J0/./org.apache.solr.cloud.BasicDistributedZkTest-jetty4-1359025208173/collection1/'
[junit4:junit4] 2> 15725 T2118 oasc.SolrResourceLoader.replaceClassLoader Adding 'file:/Users/jenkins/jenkins-slave/workspace/Lucene-Solr-trunk-MacOSX/solr/build/solr-core/test/J0/org.apache.solr.cloud.BasicDistributedZkTest-jetty4-1359025208173/collection1/lib/classes/' to classloader
[junit4:junit4] 2> 15725 T2118 oasc.SolrResourceLoader.replaceClassLoader Adding 'file:/Users/jenkins/jenkins-slave/workspace/Lucene-Solr-trunk-MacOSX/solr/build/solr-core/test/J0/org.apache.solr.cloud.BasicDistributedZkTest-jetty4-1359025208173/collection1/lib/README' to classloader
[junit4:junit4] 2> 15820 T2118 oasc.SolrConfig.<init> Using Lucene MatchVersion: LUCENE_50
[junit4:junit4] 2> 15939 T2118 oasc.SolrConfig.<init> Loaded SolrConfig: solrconfig.xml
[junit4:junit4] 2> 15941 T2118 oass.IndexSchema.readSchema Reading Solr Schema
[junit4:junit4] 2> 15946 T2118 oass.IndexSchema.readSchema Schema name=test
[junit4:junit4] 2> 16062 T2053 oascc.ZkStateReader.updateClusterState Updating cloud state from ZooKeeper...
[junit4:junit4] 2> 16063 T2053 oasc.Overseer$ClusterStateUpdater.updateState Update state numShards=2 message={
[junit4:junit4] 2> "operation":"state",
[junit4:junit4] 2> "numShards":"2",
[junit4:junit4] 2> "shard":"shard1",
[junit4:junit4] 2> "roles":null,
[junit4:junit4] 2> "state":"recovering",
[junit4:junit4] 2> "core":"collection1",
[junit4:junit4] 2> "collection":"collection1",
[junit4:junit4] 2> "node_name":"127.0.0.1:49999_",
[junit4:junit4] 2> "base_url":"http://127.0.0.1:49999"}
[junit4:junit4] 2> 16071 T2101 oascc.ZkStateReader$2.process A cluster state change: WatchedEvent state:SyncConnected type:NodeDataChanged path:/clusterstate.json, has occurred - updating... (live nodes size: 5)
[junit4:junit4] 2> 16071 T2071 oascc.ZkStateReader$2.process A cluster state change: WatchedEvent state:SyncConnected type:NodeDataChanged path:/clusterstate.json, has occurred - updating... (live nodes size: 5)
[junit4:junit4] 2> 16074 T2117 oascc.ZkStateReader$2.process A cluster state change: WatchedEvent state:SyncConnected type:NodeDataChanged path:/clusterstate.json, has occurred - updating... (live nodes size: 5)
[junit4:junit4] 2> 16074 T2086 oascc.ZkStateReader$2.process A cluster state change: WatchedEvent state:SyncConnected type:NodeDataChanged path:/clusterstate.json, has occurred - updating... (live nodes size: 5)
[junit4:junit4] 2> 16074 T2052 oascc.ZkStateReader$2.process A cluster state change: WatchedEvent state:SyncConnected type:NodeDataChanged path:/clusterstate.json, has occurred - updating... (live nodes size: 5)
[junit4:junit4] 2> 16075 T2058 oascc.ZkStateReader$2.process A cluster state change: WatchedEvent state:SyncConnected type:NodeDataChanged path:/clusterstate.json, has occurred - updating... (live nodes size: 5)
[junit4:junit4] 2> 16754 T2118 oass.OpenExchangeRatesOrgProvider.init Initialized with rates=open-exchange-rates.json, refreshInterval=1440.
[junit4:junit4] 2> 16763 T2118 oass.IndexSchema.readSchema default search field in schema is text
[junit4:junit4] 2> 16766 T2118 oass.IndexSchema.readSchema unique key field: id
[junit4:junit4] 2> 16798 T2118 oass.FileExchangeRateProvider.reload Reloading exchange rates from file currency.xml
[junit4:junit4] 2> 16804 T2118 oass.FileExchangeRateProvider.reload Reloading exchange rates from file currency.xml
[junit4:junit4] 2> 16810 T2118 oass.OpenExchangeRatesOrgProvider.reload Reloading exchange rates from open-exchange-rates.json
[junit4:junit4] 2> 16812 T2118 oass.OpenExchangeRatesOrgProvider.reload Reloading exchange rates from open-exchange-rates.json
[junit4:junit4] 2> 16814 T2118 oasc.SolrCore.<init> [collection1] Opening new SolrCore at /Users/jenkins/jenkins-slave/workspace/Lucene-Solr-trunk-MacOSX/solr/build/solr-core/test/J0/./org.apache.solr.cloud.BasicDistributedZkTest-jetty4-1359025208173/collection1/, dataDir=./org.apache.solr.cloud.BasicDistributedZkTest-1359025192910/jetty4/
[junit4:junit4] 2> 16814 T2118 oasc.JmxMonitoredMap.<init> JMX monitoring is enabled. Adding Solr mbeans to JMX Server: com.sun.jmx.mbeanserver.JmxMBeanServer@7affa511
[junit4:junit4] 2> 16815 T2118 oasc.SolrCore.initDirectoryFactory solr.NRTCachingDirectoryFactory
[junit4:junit4] 2> 16816 T2118 oasc.CachingDirectoryFactory.get return new directory for /Users/jenkins/jenkins-slave/workspace/Lucene-Solr-trunk-MacOSX/solr/build/solr-core/test/J0/./org.apache.solr.cloud.BasicDistributedZkTest-1359025192910/jetty4 forceNew:false
[junit4:junit4] 2> 16817 T2118 oasc.CachingDirectoryFactory.close Releasing directory:/Users/jenkins/jenkins-slave/workspace/Lucene-Solr-trunk-MacOSX/solr/build/solr-core/test/J0/./org.apache.solr.cloud.BasicDistributedZkTest-1359025192910/jetty4
[junit4:junit4] 2> 16817 T2118 oasc.SolrCore.getNewIndexDir New index directory detected: old=null new=./org.apache.solr.cloud.BasicDistributedZkTest-1359025192910/jetty4/index/
[junit4:junit4] 2> 16818 T2118 oasc.SolrCore.initIndex WARNING [collection1] Solr index directory './org.apache.solr.cloud.BasicDistributedZkTest-1359025192910/jetty4/index' doesn't exist. Creating new index...
[junit4:junit4] 2> 16821 T2118 oasc.CachingDirectoryFactory.get return new directory for /Users/jenkins/jenkins-slave/workspace/Lucene-Solr-trunk-MacOSX/solr/build/solr-core/test/J0/./org.apache.solr.cloud.BasicDistributedZkTest-1359025192910/jetty4/index forceNew:false
[junit4:junit4] 2> 16827 T2118 oasc.SolrDeletionPolicy.onCommit SolrDeletionPolicy.onCommit: commits:num=1
[junit4:junit4] 2> commit{dir=RateLimitedDirectoryWrapper(NRTCachingDirectory(org.apache.lucene.store.NIOFSDirectory@/Users/jenkins/jenkins-slave/workspace/Lucene-Solr-trunk-MacOSX/solr/build/solr-core/test/J0/org.apache.solr.cloud.BasicDistributedZkTest-1359025192910/jetty4/index lockFactory=org.apache.lucene.store.NativeFSLockFactory@30cc4ec0; maxCacheMB=48.0 maxMergeSizeMB=4.0)),segFN=segments_1,generation=1,filenames=[segments_1]
[junit4:junit4] 2> 16827 T2118 oasc.SolrDeletionPolicy.updateCommits newest commit = 1[segments_1]
[junit4:junit4] 2> 16828 T2118 oasc.CachingDirectoryFactory.close Releasing directory:/Users/jenkins/jenkins-slave/workspace/Lucene-Solr-trunk-MacOSX/solr/build/solr-core/test/J0/./org.apache.solr.cloud.BasicDistributedZkTest-1359025192910/jetty4/index
[junit4:junit4] 2> 16828 T2118 oasc.SolrCore.initWriters created xml: solr.XMLResponseWriter
[junit4:junit4] 2> 16831 T2118 oasup.UpdateRequestProcessorChain.init inserting DistributedUpdateProcessorFactory into updateRequestProcessorChain "dedupe"
[junit4:junit4] 2> 16831 T2118 oasup.UpdateRequestProcessorChain.init inserting DistributedUpdateProcessorFactory into updateRequestProcessorChain "dedupe-allfields"
[junit4:junit4] 2> 16832 T2118 oasup.UpdateRequestProcessorChain.init inserting DistributedUpdateProcessorFactory into updateRequestProcessorChain "stored_sig"
[junit4:junit4] 2> 16832 T2118 oasup.UpdateRequestProcessorChain.init inserting DistributedUpdateProcessorFactory into updateRequestProcessorChain "uniq-fields"
[junit4:junit4] 2> 16833 T2118 oasup.UpdateRequestProcessorChain.init inserting DistributedUpdateProcessorFactory into updateRequestProcessorChain "distrib-dup-test-chain-implicit"
[junit4:junit4] 2> 16834 T2118 oasc.RequestHandlers.initHandlersFromConfig adding lazy requestHandler: solr.ReplicationHandler
[junit4:junit4] 2> 16834 T2118 oasc.RequestHandlers.initHandlersFromConfig created /replication: solr.ReplicationHandler
[junit4:junit4] 2> 16835 T2118 oasc.RequestHandlers.initHandlersFromConfig created standard: solr.StandardRequestHandler
[junit4:junit4] 2> 16835 T2118 oasc.RequestHandlers.initHandlersFromConfig created /get: solr.RealTimeGetHandler
[junit4:junit4] 2> 16836 T2118 oasc.RequestHandlers.initHandlersFromConfig created dismax: solr.SearchHandler
[junit4:junit4] 2> 16837 T2118 oasc.RequestHandlers.initHandlersFromConfig created mock: org.apache.solr.core.MockQuerySenderListenerReqHandler
[junit4:junit4] 2> 16838 T2118 oasc.RequestHandlers.initHandlersFromConfig created /admin/: org.apache.solr.handler.admin.AdminHandlers
[junit4:junit4] 2> 16838 T2118 oasc.RequestHandlers.initHandlersFromConfig created defaults: solr.StandardRequestHandler
[junit4:junit4] 2> 16838 T2118 oasc.RequestHandlers.initHandlersFromConfig adding lazy requestHandler: solr.StandardRequestHandler
[junit4:junit4] 2> 16839 T2118 oasc.RequestHandlers.initHandlersFromConfig created lazy: solr.StandardRequestHandler
[junit4:junit4] 2> 16839 T2118 oasc.RequestHandlers.initHandlersFromConfig created /update: solr.UpdateRequestHandler
[junit4:junit4] 2> 16840 T2118 oasc.RequestHandlers.initHandlersFromConfig created /terms: org.apache.solr.handler.component.SearchHandler
[junit4:junit4] 2> 16841 T2118 oasc.RequestHandlers.initHandlersFromConfig created spellCheckCompRH: org.apache.solr.handler.component.SearchHandler
[junit4:junit4] 2> 16841 T2118 oasc.RequestHandlers.initHandlersFromConfig created spellCheckCompRH_Direct: org.apache.solr.handler.component.SearchHandler
[junit4:junit4] 2> 16842 T2118 oasc.RequestHandlers.initHandlersFromConfig created spellCheckWithWordbreak: org.apache.solr.handler.component.SearchHandler
[junit4:junit4] 2> 16842 T2118 oasc.RequestHandlers.initHandlersFromConfig created spellCheckWithWordbreak_Direct: org.apache.solr.handler.component.SearchHandler
[junit4:junit4] 2> 16843 T2118 oasc.RequestHandlers.initHandlersFromConfig created spellCheckCompRH1: org.apache.solr.handler.component.SearchHandler
[junit4:junit4] 2> 16843 T2118 oasc.RequestHandlers.initHandlersFromConfig created mltrh: org.apache.solr.handler.component.SearchHandler
[junit4:junit4] 2> 16846 T2118 oasc.RequestHandlers.initHandlersFromConfig created tvrh: org.apache.solr.handler.component.SearchHandler
[junit4:junit4] 2> 16850 T2118 oasc.RequestHandlers.initHandlersFromConfig created /mlt: solr.MoreLikeThisHandler
[junit4:junit4] 2> 16854 T2118 oasc.RequestHandlers.initHandlersFromConfig created /debug/dump: solr.DumpRequestHandler
[junit4:junit4] 2> 16860 T2118 oashl.XMLLoader.init xsltCacheLifetimeSeconds=60
[junit4:junit4] 2> 16863 T2118 oasc.SolrCore.initDeprecatedSupport WARNING solrconfig.xml uses deprecated <admin/gettableFiles>, Please update your config to use the ShowFileRequestHandler.
[junit4:junit4] 2> 16865 T2118 oasc.SolrCore.initDeprecatedSupport WARNING adding ShowFileRequestHandler with hidden files: [SCHEMA.XML, OLD_SYNONYMS.TXT, STOPWORDS.TXT, PROTWORDS.TXT, OPEN-EXCHANGE-RATES.JSON, SYNONYMS.TXT, CURRENCY.XML, MAPPING-ISOLATIN1ACCENT.TXT]
[junit4:junit4] 2> 16868 T2118 oasc.CachingDirectoryFactory.close Releasing directory:/Users/jenkins/jenkins-slave/workspace/Lucene-Solr-trunk-MacOSX/solr/build/solr-core/test/J0/./org.apache.solr.cloud.BasicDistributedZkTest-1359025192910/jetty4
[junit4:junit4] 2> 16869 T2118 oass.SolrIndexSearcher.<init> Opening Searcher@375084cc main
[junit4:junit4] 2> 16871 T2118 oasu.CommitTracker.<init> Hard AutoCommit: disabled
[junit4:junit4] 2> 16871 T2118 oasu.CommitTracker.<init> Soft AutoCommit: disabled
[junit4:junit4] 2> 16872 T2118 oashc.SpellCheckComponent.inform Initializing spell checkers
[junit4:junit4] 2> 16877 T2118 oass.DirectSolrSpellChecker.init init: {name=direct,classname=DirectSolrSpellChecker,field=lowerfilt,minQueryLength=3}
[junit4:junit4] 2> 16918 T2119 oasc.SolrCore.registerSearcher [collection1] Registered new searcher Searcher@375084cc main{StandardDirectoryReader(segments_1:1)}
[junit4:junit4] 2> 16925 T2118 oasc.ZkController.publish publishing core=collection1 state=down
[junit4:junit4] 2> 16925 T2118 oasc.ZkController.publish numShards not found on descriptor - reading it from system property
[junit4:junit4] 2> 17601 T2053 oascc.ZkStateReader.updateClusterState Updating cloud state from ZooKeeper...
[junit4:junit4] 2> 17602 T2053 oasc.Overseer$ClusterStateUpdater.updateState Update state numShards=2 message={
[junit4:junit4] 2> "operation":"state",
[junit4:junit4] 2> "numShards":"2",
[junit4:junit4] 2> "shard":null,
[junit4:junit4] 2> "roles":null,
[junit4:junit4] 2> "state":"down",
[junit4:junit4] 2> "core":"collection1",
[junit4:junit4] 2> "collection":"collection1",
[junit4:junit4] 2> "node_name":"127.0.0.1:50003_",
[junit4:junit4] 2> "base_url":"http://127.0.0.1:50003"}
[junit4:junit4] 2> 17602 T2053 oasc.Overseer$ClusterStateUpdater.updateState Collection already exists with numShards=2
[junit4:junit4] 2> 17603 T2053 oasc.Overseer$ClusterStateUpdater.updateState Assigning new node to shard shard=shard2
[junit4:junit4] 2> 17616 T2086 oascc.ZkStateReader$2.process A cluster state change: WatchedEvent state:SyncConnected type:NodeDataChanged path:/clusterstate.json, has occurred - updating... (live nodes size: 5)
[junit4:junit4] 2> 17617 T2052 oascc.ZkStateReader$2.process A cluster state change: WatchedEvent state:SyncConnected type:NodeDataChanged path:/clusterstate.json, has occurred - updating... (live nodes size: 5)
[junit4:junit4] 2> 17617 T2101 oascc.ZkStateReader$2.process A cluster state change: WatchedEvent state:SyncConnected type:NodeDataChanged path:/clusterstate.json, has occurred - updating... (live nodes size: 5)
[junit4:junit4] 2> 17621 T2058 oascc.ZkStateReader$2.process A cluster state change: WatchedEvent state:SyncConnected type:NodeDataChanged path:/clusterstate.json, has occurred - updating... (live nodes size: 5)
[junit4:junit4] 2> 17622 T2117 oascc.ZkStateReader$2.process A cluster state change: WatchedEvent state:SyncConnected type:NodeDataChanged path:/clusterstate.json, has occurred - updating... (live nodes size: 5)
[junit4:junit4] 2> 17622 T2071 oascc.ZkStateReader$2.process A cluster state change: WatchedEvent state:SyncConnected type:NodeDataChanged path:/clusterstate.json, has occurred - updating... (live nodes size: 5)
[junit4:junit4] 2> 17928 T2118 oasc.CoreContainer.registerCore registering core: collection1
[junit4:junit4] 2> 17929 T2118 oasc.ZkController.register Register replica - core:collection1 address:http://127.0.0.1:50003 collection:collection1 shard:shard2
[junit4:junit4] 2> 17935 T2118 oasc.ZkController.register We are http://127.0.0.1:50003/collection1/ and leader is http://127.0.0.1:49996/collection1/
[junit4:junit4] 2> 17935 T2118 oasc.ZkController.register No LogReplay needed for core=collection1 baseURL=http://127.0.0.1:50003
[junit4:junit4] 2> 17936 T2118 oasc.ZkController.checkRecovery Core needs to recover:collection1
[junit4:junit4] 2> 17936 T2118 oasu.DefaultSolrCoreState.doRecovery Running recovery - first canceling any ongoing recovery
[junit4:junit4] 2> ASYNC NEW_CORE C156 name=collection1 org.apache.solr.core.SolrCore@39176005 url=http://127.0.0.1:50003/collection1 node=127.0.0.1:50003_ C156_STATE=coll:collection1 core:collection1 props:{shard=null, roles=null, state=down, core=collection1, collection=collection1, node_name=127.0.0.1:50003_, base_url=http://127.0.0.1:50003}
[junit4:junit4] 2> 17937 T2120 C156 P50003 oasc.RecoveryStrategy.run Starting recovery process. core=collection1 recoveringAfterStartup=true
[junit4:junit4] 2> 17937 T2120 C156 P50003 oasc.RecoveryStrategy.doRecovery ###### startupVersions=[]
[junit4:junit4] 2> 17937 T2120 C156 P50003 oasc.ZkController.publish publishing core=collection1 state=recovering
[junit4:junit4] 2> 17938 T2120 C156 P50003 oasc.ZkController.publish numShards not found on descriptor - reading it from system property
[junit4:junit4] 2> 17940 T2120 C156 P50003 oascsi.HttpClientUtil.createClient Creating new http client, config:maxConnections=128&maxConnectionsPerHost=32&followRedirects=false
[junit4:junit4] 2> 17958 T2118 oascc.ZkStateReader.updateClusterState Updating cloud state from ZooKeeper...
[junit4:junit4] 2> 17960 T2030 oass.SolrDispatchFilter.init user.dir=/Users/jenkins/jenkins-slave/workspace/Lucene-Solr-trunk-MacOSX/solr/build/solr-core/test/J0
[junit4:junit4] 2> 17960 T2030 oass.SolrDispatchFilter.init SolrDispatchFilter.init() done
[junit4:junit4] 2> 17960 T2030 oascsi.HttpClientUtil.createClient Creating new http client, config:maxConnections=128&maxConnectionsPerHost=32&followRedirects=false
[junit4:junit4] 2> 17974 T2030 oascc.ZkStateReader.updateClusterState Updating cloud state from ZooKeeper...
[junit4:junit4] 2> 17976 T2030 oasc.AbstractDistribZkTestBase.waitForRecoveriesToFinish Wait for recoveries to finish - collection: collection1 failOnTimeout:true timeout (sec):230
[junit4:junit4] 2> 17976 T2030 oascc.ZkStateReader.updateClusterState Updating cloud state from ZooKeeper...
[junit4:junit4] 2> C155_STATE=coll:collection1 core:collection1 props:{shard=shard1, roles=null, state=recovering, core=collection1, collection=collection1, node_name=127.0.0.1:49999_, base_url=http://127.0.0.1:49999}
[junit4:junit4] 2> 18276 T2104 C155 P49999 oasc.RecoveryStrategy.doRecovery Attempting to PeerSync from http://127.0.0.1:49993/collection1/ core=collection1 - recoveringAfterStartup=true
[junit4:junit4] 2> 18276 T2104 C155 P49999 oasu.PeerSync.sync PeerSync: core=collection1 url=http://127.0.0.1:49999 START replicas=[http://127.0.0.1:49993/collection1/] nUpdates=100
[junit4:junit4] 2> 18278 T2104 C155 P49999 oasu.PeerSync.sync WARNING no frame of reference to tell of we've missed updates
[junit4:junit4] 2> 18282 T2104 C155 P49999 oasc.RecoveryStrategy.doRecovery PeerSync Recovery was not successful - trying replication. core=collection1
[junit4:junit4] 2> 18283 T2104 C155 P49999 oasc.RecoveryStrategy.doRecovery Starting Replication Recovery. core=collection1
[junit4:junit4] 2> 18284 T2104 C155 P49999 oasc.RecoveryStrategy.doRecovery Begin buffering updates. core=collection1
[junit4:junit4] 2> 18284 T2104 C155 P49999 oasu.UpdateLog.bufferUpdates Starting to buffer updates. FSUpdateLog{state=ACTIVE, tlog=null}
[junit4:junit4] 2> 18285 T2104 C155 P49999 oasc.RecoveryStrategy.replicate Attempting to replicate from http://127.0.0.1:49993/collection1/. core=collection1
[junit4:junit4] 2> 18285 T2104 C155 P49999 oascsi.HttpClientUtil.createClient Creating new http client, config:maxConnections=128&maxConnectionsPerHost=32&followRedirects=false
[junit4:junit4] 2> ASYNC NEW_CORE C157 name=collection1 org.apache.solr.core.SolrCore@1c15725 url=http://127.0.0.1:49993/collection1 node=127.0.0.1:49993_ C157_STATE=coll:collection1 core:collection1 props:{shard=shard1, roles=null, state=active, core=collection1, collection=collection1, node_name=127.0.0.1:49993_, base_url=http://127.0.0.1:49993, leader=true}
[junit4:junit4] 2> 18296 T2063 C157 P49993 REQ /get {getVersions=100&distrib=false&wt=javabin&qt=/get&version=2} status=0 QTime=0
[junit4:junit4] 2> 18297 T2061 C157 P49993 oasu.DirectUpdateHandler2.commit start commit{,optimize=false,openSearcher=false,waitSearcher=true,expungeDeletes=false,softCommit=false}
[junit4:junit4] 2> 18299 T2061 C157 P49993 oasc.CachingDirectoryFactory.close Releasing directory:/Users/jenkins/jenkins-slave/workspace/Lucene-Solr-trunk-MacOSX/solr/build/solr-core/test/J0/./org.apache.solr.cloud.BasicDistributedZkTest-1359025192910/jetty1
[junit4:junit4] 2> 18302 T2061 C157 P49993 oasc.SolrDeletionPolicy.onInit SolrDeletionPolicy.onInit: commits:num=1
[junit4:junit4] 2> commit{dir=RateLimitedDirectoryWrapper(NRTCachingDirectory(org.apache.lucene.store.NIOFSDirectory@/Users/jenkins/jenkins-slave/workspace/Lucene-Solr-trunk-MacOSX/solr/build/solr-core/test/J0/org.apache.solr.cloud.BasicDistributedZkTest-1359025192910/jetty1/index lockFactory=org.apache.lucene.store.NativeFSLockFactory@6d2ece4b; maxCacheMB=48.0 maxMergeSizeMB=4.0)),segFN=segments_1,generation=1,filenames=[segments_1]
[junit4:junit4] 2> 18302 T2061 C157 P49993 oasc.SolrDeletionPolicy.updateCommits newest commit = 1[segments_1]
[junit4:junit4] 2> 18305 T2061 C157 P49993 oasc.SolrDeletionPolicy.onCommit SolrDeletionPolicy.onCommit: commits:num=2
[junit4:junit4] 2> commit{dir=RateLimitedDirectoryWrapper(NRTCachingDirectory(org.apache.lucene.store.NIOFSDirectory@/Users/jenkins/jenkins-slave/workspace/Lucene-Solr-trunk-MacOSX/solr/build/solr-core/test/J0/org.apache.solr.cloud.BasicDistributedZkTest-1359025192910/jetty1/index lockFactory=org.apache.lucene.store.NativeFSLockFactory@6d2ece4b; maxCacheMB=48.0 maxMergeSizeMB=4.0)),segFN=segments_1,generation=1,filenames=[segments_1]
[junit4:junit4] 2> commit{dir=RateLimitedDirectoryWrapper(NRTCachingDirectory(org.apache.lucene.store.NIOFSDirectory@/Users/jenkins/jenkins-slave/workspace/Lucene-Solr-trunk-MacOSX/solr/build/solr-core/test/J0/org.apache.solr.cloud.BasicDistributedZkTest-1359025192910/jetty1/index lockFactory=org.apache.lucene.store.NativeFSLockFactory@6d2ece4b; maxCacheMB=48.0 maxMergeSizeMB=4.0)),segFN=segments_2,generation=2,filenames=[segments_2]
[junit4:junit4] 2> 18306 T2061 C157 P49993 oasc.SolrDeletionPolicy.updateCommits newest commit = 2[segments_2]
[junit4:junit4] 2> 18306 T2061 C157 P49993 oasc.CachingDirectoryFactory.close Releasing directory:/Users/jenkins/jenkins-slave/workspace/Lucene-Solr-trunk-MacOSX/solr/build/solr-core/test/J0/./org.apache.solr.cloud.BasicDistributedZkTest-1359025192910/jetty1
[junit4:junit4] 2> 18307 T2061 C157 P49993 oass.SolrIndexSearcher.<init> Opening Searcher@35d38d34 realtime
[junit4:junit4] 2> 18307 T2061 C157 P49993 oasu.DirectUpdateHandler2.commit end_commit_flush
[junit4:junit4] 2> 18308 T2061 C157 P49993 /update {waitSearcher=true&openSearcher=false&commit=true&wt=javabin&commit_end_point=true&version=2&softCommit=false} {commit=} 0 11
[junit4:junit4] 2> 18309 T2104 C155 P49999 oash.ReplicationHandler.inform Commits will be reserved for 10000
[junit4:junit4] 2> 18309 T2104 C155 P49999 oash.SnapPuller.<init> No value set for 'pollInterval'. Timer Task not started.
[junit4:junit4] 2> 18314 T2064 C157 P49993 oash.ReplicationHandler.inform Commits will be reserved for 10000
[junit4:junit4] 2> 18314 T2064 C157 P49993 REQ /replication {command=indexversion&qt=/replication&wt=javabin&version=2} status=0 QTime=1
[junit4:junit4] 2> 18315 T2104 C155 P49999 oash.SnapPuller.fetchLatestIndex Master's generation: 2
[junit4:junit4] 2> 18315 T2104 C155 P49999 oash.SnapPuller.fetchLatestIndex Slave's generation: 1
[junit4:junit4] 2> 18315 T2104 C155 P49999 oash.SnapPuller.fetchLatestIndex Starting replication process
[junit4:junit4] 2> 18318 T2065 C157 P49993 oasc.CachingDirectoryFactory.close Releasing directory:/Users/jenkins/jenkins-slave/workspace/Lucene-Solr-trunk-MacOSX/solr/build/solr-core/test/J0/./org.apache.solr.cloud.BasicDistributedZkTest-1359025192910/jetty1
[junit4:junit4] 2> 18319 T2065 C157 P49993 oasc.CachingDirectoryFactory.close Releasing directory:/Users/jenkins/jenkins-slave/workspace/Lucene-Solr-trunk-MacOSX/solr/build/solr-core/test/J0/./org.apache.solr.cloud.BasicDistributedZkTest-1359025192910/jetty1/index
[junit4:junit4] 2> 18319 T2065 C157 P49993 REQ /replication {command=filelist&qt=/replication&wt=javabin&generation=2&version=2} status=0 QTime=1
[junit4:junit4] 2> 18320 T2104 C155 P49999 oash.SnapPuller.fetchLatestIndex Number of files in latest index in master: 1
[junit4:junit4] 2> 18321 T2104 C155 P49999 oasc.CachingDirectoryFactory.get return new directory for /Users/jenkins/jenkins-slave/workspace/Lucene-Solr-trunk-MacOSX/solr/build/solr-core/test/J0/./org.apache.solr.cloud.BasicDistributedZkTest-1359025192910/jetty3/index.20130124130011221 forceNew:false
[junit4:junit4] 2> 18322 T2104 C155 P49999 oasc.CachingDirectoryFactory.close Releasing directory:/Users/jenkins/jenkins-slave/workspace/Lucene-Solr-trunk-MacOSX/solr/build/solr-core/test/J0/./org.apache.solr.cloud.BasicDistributedZkTest-1359025192910/jetty3
[junit4:junit4] 2> 18322 T2104 C155 P49999 oash.SnapPuller.fetchLatestIndex Starting download to RateLimitedDirectoryWrapper(NRTCachingDirectory(org.apache.lucene.store.NIOFSDirectory@/Users/jenkins/jenkins-slave/workspace/Lucene-Solr-trunk-MacOSX/solr/build/solr-core/test/J0/org.apache.solr.cloud.BasicDistributedZkTest-1359025192910/jetty3/index.20130124130011221 lockFactory=org.apache.lucene.store.NativeFSLockFactory@3c8f3375; maxCacheMB=48.0 maxMergeSizeMB=4.0)) fullCopy=true
[junit4:junit4] 2> 18325 T2066 C157 P49993 REQ /replication {file=segments_2&command=filecontent&checksum=true&wt=filestream&qt=/replication&generation=2} status=0 QTime=0
[junit4:junit4] 2> 18328 T2104 C155 P49999 oasc.CachingDirectoryFactory.close Releasing directory:/Users/jenkins/jenkins-slave/workspace/Lucene-Solr-trunk-MacOSX/solr/build/solr-core/test/J0/./org.apache.solr.cloud.BasicDistributedZkTest-1359025192910/jetty3/index
[junit4:junit4] 2> 18328 T2104 C155 P49999 oash.SnapPuller.fetchLatestIndex Total time taken for download : 0 secs
[junit4:junit4] 2> 18329 T2104 C155 P49999 oash.SnapPuller.modifyIndexProps New index installed. Updating index properties... index=index.20130124130011221
[junit4:junit4] 2> 18330 T2104 C155 P49999 oasc.CachingDirectoryFactory.close Releasing directory:/Users/jenkins/jenkins-slave/workspace/Lucene-Solr-trunk-MacOSX/solr/build/solr-core/test/J0/./org.apache.solr.cloud.BasicDistributedZkTest-1359025192910/jetty3
[junit4:junit4] 2> 18330 T2104 C155 P49999 oasc.CachingDirectoryFactory.close Releasing directory:/Users/jenkins/jenkins-slave/workspace/Lucene-Solr-trunk-MacOSX/solr/build/solr-core/test/J0/./org.apache.solr.cloud.BasicDistributedZkTest-1359025192910/jetty3
[junit4:junit4] 2> 18331 T2104 C155 P49999 oasc.SolrCore.getNewIndexDir New index directory detected: old=./org.apache.solr.cloud.BasicDistributedZkTest-1359025192910/jetty3/index/ new=./org.apache.solr.cloud.BasicDistributedZkTest-1359025192910/jetty3/index.20130124130011221
[junit4:junit4] 2> 18335 T2104 C155 P49999 oasc.SolrDeletionPolicy.onInit SolrDeletionPolicy.onInit: commits:num=1
[junit4:junit4] 2> commit{dir=RateLimitedDirectoryWrapper(NRTCachingDirectory(org.apache.lucene.store.NIOFSDirectory@/Users/jenkins/jenkins-slave/workspace/Lucene-Solr-trunk-MacOSX/solr/build/solr-core/test/J0/org.apache.solr.cloud.BasicDistributedZkTest-1359025192910/jetty3/index.20130124130011221 lockFactory=org.apache.lucene.store.NativeFSLockFactory@3c8f3375; maxCacheMB=48.0 maxMergeSizeMB=4.0)),segFN=segments_2,generation=2,filenames=[segments_2]
[junit4:junit4] 2> 18335 T2104 C155 P49999 oasc.SolrDeletionPolicy.updateCommits newest commit = 2[segments_2]
[junit4:junit4] 2> 18339 T2104 C155 P49999 oasc.CachingDirectoryFactory.close Releasing directory:/Users/jenkins/jenkins-slave/workspace/Lucene-Solr-trunk-MacOSX/solr/build/solr-core/test/J0/./org.apache.solr.cloud.BasicDistributedZkTest-1359025192910/jetty3
[junit4:junit4] 2> 18339 T2104 C155 P49999 oasu.DefaultSolrCoreState.newIndexWriter Creating new IndexWriter...
[junit4:junit4] 2> 18340 T2104 C155 P49999 oasu.DefaultSolrCoreState.newIndexWriter Waiting until IndexWriter is unused... core=collection1
[junit4:junit4] 2> 18340 T2104 C155 P49999 oasu.DefaultSolrCoreState.newIndexWriter Rollback old IndexWriter... core=collection1
[junit4:junit4] 2> 18341 T2104 C155 P49999 oasc.CachingDirectoryFactory.close Releasing directory:/Users/jenkins/jenkins-slave/workspace/Lucene-Solr-trunk-MacOSX/solr/build/solr-core/test/J0/./org.apache.solr.cloud.BasicDistributedZkTest-1359025192910/jetty3/index.20130124130011221
[junit4:junit4] 2> 18341 T2104 C155 P49999 oasc.CachingDirectoryFactory.close Releasing directory:/Users/jenkins/jenkins-slave/workspace/Lucene-Solr-trunk-MacOSX/solr/build/solr-core/test/J0/./org.apache.solr.cloud.BasicDistributedZkTest-1359025192910/jetty3
[junit4:junit4] 2> 18344 T2104 C155 P49999 oasc.SolrDeletionPolicy.onInit SolrDeletionPolicy.onInit: commits:num=1
[junit4:junit4] 2> commit{dir=RateLimitedDirectoryWrapper(NRTCachingDirectory(org.apache.lucene.store.NIOFSDirectory@/Users/jenkins/jenkins-slave/workspace/Lucene-Solr-trunk-MacOSX/solr/build/solr-core/test/J0/org.apache.solr.cloud.BasicDistributedZkTest-1359025192910/jetty3/index.20130124130011221 lockFactory=org.apache.lucene.store.NativeFSLockFactory@3c8f3375; maxCacheMB=48.0 maxMergeSizeMB=4.0)),segFN=segments_2,generation=2,filenames=[segments_2]
[junit4:junit4] 2> 18344 T2104 C155 P49999 oasc.SolrDeletionPolicy.updateCommits newest commit = 2[segments_2]
[junit4:junit4] 2> 18344 T2104 C155 P49999 oasu.DefaultSolrCoreState.newIndexWriter New IndexWriter is ready to be used.
[junit4:junit4] 2> 18345 T2104 C155 P49999 oasc.CachingDirectoryFactory.close Releasing directory:/Users/jenkins/jenkins-slave/workspace/Lucene-Solr-trunk-MacOSX/solr/build/solr-core/test/J0/./org.apache.solr.cloud.BasicDistributedZkTest-1359025192910/jetty3
[junit4:junit4] 2> 18345 T2104 C155 P49999 oass.SolrIndexSearcher.<init> Opening Searcher@256778c3 main
[junit4:junit4] 2> 18349 T2103 oasc.SolrCore.registerSearcher [collection1] Registered new searcher Searcher@256778c3 main{StandardDirectoryReader(segments_2:1:nrt)}
[junit4:junit4] 2> 18350 T2103 oasc.CachingDirectoryFactory.close Releasing directory:/Users/jenkins/jenkins-slave/workspace/Lucene-Solr-trunk-MacOSX/solr/build/solr-core/test/J0/./org.apache.solr.cloud.BasicDistributedZkTest-1359025192910/jetty3/index
[junit4:junit4] 2> 18351 T2104 C155 P49999 oasu.DirectUpdateHandler2.commit start commit{,optimize=false,openSearcher=false,waitSearcher=false,expungeDeletes=false,softCommit=false}
[junit4:junit4] 2> 18356 T2104 C155 P49999 oasc.SolrDeletionPolicy.onCommit SolrDeletionPolicy.onCommit: commits:num=2
[junit4:junit4] 2> commit{dir=RateLimitedDirectoryWrapper(NRTCachingDirectory(org.apache.lucene.store.NIOFSDirectory@/Users/jenkins/jenkins-slave/workspace/Lucene-Solr-trunk-MacOSX/solr/build/solr-core/test/J0/org.apache.solr.cloud.BasicDistributedZkTest-1359025192910/jetty3/index.20130124130011221 lockFactory=org.apache.lucene.store.NativeFSLockFactory@3c8f3375; maxCacheMB=48.0 maxMergeSizeMB=4.0)),segFN=segments_2,generation=2,filenames=[segments_2]
[junit4:junit4] 2> commit{dir=RateLimitedDirectoryWrapper(NRTCachingDirectory(org.apache.lucene.store.NIOFSDirectory@/Users/jenkins/jenkins-slave/workspace/Lucene-Solr-trunk-MacOSX/solr/build/solr-core/test/J0/org.apache.solr.cloud.BasicDistributedZkTest-1359025192910/jetty3/index.20130124130011221 lockFactory=org.apache.lucene.store.NativeFSLockFactory@3c8f3375; maxCacheMB=48.0 maxMergeSizeMB=4.0)),segFN=segments_3,generation=3,filenames=[segments_3]
[junit4:junit4] 2> 18356 T2104 C155 P49999 oasc.SolrDeletionPolicy.updateCommits newest commit = 3[segments_3]
[junit4:junit4] 2> 18357 T2104 C155 P49999 oasc.CachingDirectoryFactory.close Releasing directory:/Users/jenkins/jenkins-slave/workspace/Lucene-Solr-trunk-MacOSX/solr/build/solr-core/test/J0/./org.apache.solr.cloud.BasicDistributedZkTest-1359025192910/jetty3
[junit4:junit4] 2> 18358 T2104 C155 P49999 oasu.DirectUpdateHandler2.commit end_commit_flush
[junit4:junit4] 2> 18358 T2104 C155 P49999 oasc.CachingDirectoryFactory.close Releasing directory:/Users/jenkins/jenkins-slave/workspace/Lucene-Solr-trunk-MacOSX/solr/build/solr-core/test/J0/./org.apache.solr.cloud.BasicDistributedZkTest-1359025192910/jetty3/index.20130124130011221
[junit4:junit4] 2> 18358 T2104 C155 P49999 oasc.CachingDirectoryFactory.close Releasing directory:/Users/jenkins/jenkins-slave/workspace/Lucene-Solr-trunk-MacOSX/solr/build/solr-core/test/J0/./org.apache.solr.cloud.BasicDistributedZkTest-1359025192910/jetty3/index
[junit4:junit4] 2> 18358 T2104 C155 P49999 oasc.RecoveryStrategy.replay No replay needed. core=collection1
[junit4:junit4] 2> 18359 T2104 C155 P49999 oasc.RecoveryStrategy.doRecovery Replication Recovery was successful - registering as Active. core=collection1
[junit4:junit4] 2> 18359 T2104 C155 P49999 oasc.ZkController.publish publishing core=collection1 state=active
[junit4:junit4] 2> 18359 T2104 C155 P49999 oasc.ZkController.publish numShards not found on descriptor - reading it from system property
[junit4:junit4] 2> 18361 T2104 C155 P49999 oasc.RecoveryStrategy.doRecovery Finished recovery process. core=collection1
[junit4:junit4] 2> 18980 T2030 oascc.ZkStateReader.updateClusterState Updating cloud state from ZooKeeper...
[junit4:junit4] 2> 19134 T2053 oascc.ZkStateReader.updateClusterState Updating cloud state from ZooKeeper...
[junit4:junit4] 2> 19135 T2053 oasc.Overseer$ClusterStateUpdater.updateState Update state numShards=2 message={
[junit4:junit4] 2> "operation":"state",
[junit4:junit4] 2> "numShards":"2",
[junit4:junit4] 2> "shard":"shard2",
[junit4:junit4] 2> "roles":null,
[junit4:junit4] 2> "state":"recovering",
[junit4:junit4] 2> "core":"collection1",
[junit4:junit4] 2> "collection":"collection1",
[junit4:junit4] 2> "node_name":"127.0.0.1:50003_",
[junit4:junit4] 2> "base_url":"http://127.0.0.1:50003"}
[junit4:junit4] 2> 19141 T2053 oasc.Overseer$ClusterStateUpdater.updateState Update state numShards=2 message={
[junit4:junit4] 2> "operation":"state",
[junit4:junit4] 2> "numShards":"2",
[junit4:junit4] 2> "shard":"shard1",
[junit4:junit4] 2> "roles":null,
[junit4:junit4] 2> "state":"active",
[junit4:junit4] 2> "core":"collection1",
[junit4:junit4] 2> "collection":"collection1",
[junit4:junit4] 2> "node_name":"127.0.0.1:49999_",
[junit4:junit4] 2> "base_url":"http://127.0.0.1:49999"}
[junit4:junit4] 2> 19147 T2101 oascc.ZkStateReader$2.process A cluster state change: WatchedEvent state:SyncConnected type:NodeDataChanged path:/clusterstate.json, has occurred - updating... (live nodes size: 5)
[junit4:junit4] 2> 19148 T2117 oascc.ZkStateReader$2.process A cluster state change: WatchedEvent state:SyncConnected type:NodeDataChanged path:/clusterstate.json, has occurred - updating... (live nodes size: 5)
[junit4:junit4] 2> 19150 T2086 oascc.ZkStateReader$2.process A cluster state change: WatchedEvent state:SyncConnected type:NodeDataChanged path:/clusterstate.json, has occurred - updating... (live nodes size: 5)
[junit4:junit4] 2> 19156 T2058 oascc.ZkStateReader$2.process A cluster state change: WatchedEvent state:SyncConnected type:NodeDataChanged path:/clusterstate.json, has occurred - updating... (live nodes size: 5)
[junit4:junit4] 2> 19157 T2052 oascc.ZkStateReader$2.process A cluster state change: WatchedEvent state:SyncConnected type:NodeDataChanged path:/clusterstate.json, has occurred - updating... (live nodes size: 5)
[junit4:junit4] 2> 19157 T2071 oascc.ZkStateReader$2.process A cluster state change: WatchedEvent state:SyncConnected type:NodeDataChanged path:/clusterstate.json, has occurred - updating... (live nodes size: 5)
[junit4:junit4] 2> 19983 T2030 oascc.ZkStateReader.updateClusterState Updating cloud state from ZooKeeper...
[junit4:junit4] 2> 20987 T2030 oascc.ZkStateReader.updateClusterState Updating cloud state from ZooKeeper...
[junit4:junit4] 2> C156_STATE=coll:collection1 core:collection1 props:{shard=shard2, roles=null, state=recovering, core=collection1, collection=collection1, node_name=127.0.0.1:50003_, base_url=http://127.0.0.1:50003}
[junit4:junit4] 2> 21970 T2120 C156 P50003 oasc.RecoveryStrategy.doRecovery Attempting to PeerSync from http://127.0.0.1:49996/collection1/ core=collection1 - recoveringAfterStartup=true
[junit4:junit4] 2> 21971 T2120 C156 P50003 oasu.PeerSync.sync PeerSync: core=collection1 url=http://127.0.0.1:50003 START replicas=[http://127.0.0.1:49996/collection1/] nUpdates=100
[junit4:junit4] 2> 21972 T2120 C156 P50003 oasu.PeerSync.sync WARNING no frame of reference to tell of we've missed updates
[junit4:junit4] 2> 21972 T2120 C156 P50003 oasc.RecoveryStrategy.doRecovery PeerSync Recovery was not successful - trying replication. core=collection1
[junit4:junit4] 2> 21972 T2120 C156 P50003 oasc.RecoveryStrategy.doRecovery Starting Replication Recovery. core=collection1
[junit4:junit4] 2> 21973 T2120 C156 P50003 oasc.RecoveryStrategy.doRecovery Begin buffering updates. core=collection1
[junit4:junit4] 2> 21973 T2120 C156 P50003 oasu.UpdateLog.bufferUpdates Starting to buffer updates. FSUpdateLog{state=ACTIVE, tlog=null}
[junit4:junit4] 2> 21973 T2120 C156 P50003 oasc.RecoveryStrategy.replicate Attempting to replicate from http://127.0.0.1:49996/collection1/. core=collection1
[junit4:junit4] 2> 21974 T2120 C156 P50003 oascsi.HttpClientUtil.createClient Creating new http client, config:maxConnections=128&maxConnectionsPerHost=32&followRedirects=false
[junit4:junit4] 2> ASYNC NEW_CORE C158 name=collection1 org.apache.solr.core.SolrCore@7329a8ed url=http://127.0.0.1:49996/collection1 node=127.0.0.1:49996_ C158_STATE=coll:collection1 core:collection1 props:{shard=shard2, roles=null, state=active, core=collection1, collection=collection1, node_name=127.0.0.1:49996_, base_url=http://127.0.0.1:49996, leader=true}
[junit4:junit4] 2> 21997 T2080 C158 P49996 REQ /get {getVersions=100&distrib=false&wt=javabin&qt=/get&version=2} status=0 QTime=0
[junit4:junit4] 2> 22001 T2081 C158 P49996 oasu.DirectUpdateHandler2.commit start commit{,optimize=false,openSearcher=false,waitSearcher=true,expungeDeletes=false,softCommit=false}
[junit4:junit4] 2> 22002 T2081 C158 P49996 oasc.CachingDirectoryFactory.close Releasing directory:/Users/jenkins/jenkins-slave/workspace/Lucene-Solr-trunk-MacOSX/solr/build/solr-core/test/J0/./org.apache.solr.cloud.BasicDistributedZkTest-1359025192910/jetty2
[junit4:junit4] 2> 22006 T2081 C158 P49996 oasc.SolrDeletionPolicy.onInit SolrDeletionPolicy.onInit: commits:num=1
[junit4:junit4] 2> commit{dir=RateLimitedDirectoryWrapper(NRTCachingDirectory(org.apache.lucene.store.NIOFSDirectory@/Users/jenkins/jenkins-slave/workspace/Lucene-Solr-trunk-MacOSX/solr/build/solr-core/test/J0/org.apache.solr.cloud.BasicDistributedZkTest-1359025192910/jetty2/index lockFactory=org.apache.lucene.store.NativeFSLockFactory@4274ff2b; maxCacheMB=48.0 maxMergeSizeMB=4.0)),segFN=segments_1,generation=1,filenames=[segments_1]
[junit4:junit4] 2> 22009 T2081 C158 P49996 oasc.SolrDeletionPolicy.updateCommits newest commit = 1[segments_1]
[junit4:junit4] 2> 22016 T2030 oascc.ZkStateReader.updateClusterState Updating cloud state from ZooKeeper...
[junit4:junit4] 2> 22022 T2081 C158 P49996 oasc.SolrDeletionPolicy.onCommit SolrDeletionPolicy.onCommit: commits:num=2
[junit4:junit4] 2> commit{dir=RateLimitedDirectoryWrapper(NRTCachingDirectory(org.apache.lucene.store.NIOFSDirectory@/Users/jenkins/jenkins-slave/workspace/Lucene-Solr-trunk-MacOSX/solr/build/solr-core/test/J0/org.apache.solr.cloud.BasicDistributedZkTest-1359025192910/jetty2/index lockFactory=org.apache.lucene.store.NativeFSLockFactory@4274ff2b; maxCacheMB=48.0 maxMergeSizeMB=4.0)),segFN=segments_1,generation=1,filenames=[segments_1]
[junit4:junit4] 2> commit{dir=RateLimitedDirectoryWrapper(NRTCachingDirectory(org.apache.lucene.store.NIOFSDirectory@/Users/jenkins/jenkins-slave/workspace/Lucene-Solr-trunk-MacOSX/solr/build/solr-core/test/J0/org.apache.solr.cloud.BasicDistributedZkTest-1359025192910/jetty2/index lockFactory=org.apache.lucene.store.NativeFSLockFactory@4274ff2b; maxCacheMB=48.0 maxMergeSizeMB=4.0)),segFN=segments_2,generation=2,filenames=[segments_2]
[junit4:junit4] 2> 22022 T2081 C158 P49996 oasc.SolrDeletionPolicy.updateCommits newest commit = 2[segments_2]
[junit4:junit4] 2> 22023 T2081 C158 P49996 oasc.CachingDirectoryFactory.close Releasing directory:/Users/jenkins/jenkins-slave/workspace/Lucene-Solr-trunk-MacOSX/solr/build/solr-core/test/J0/./org.apache.solr.cloud.BasicDistributedZkTest-1359025192910/jetty2
[junit4:junit4] 2> 22024 T2081 C158 P49996 oass.SolrIndexSearcher.<init> Opening Searcher@21c63eac realtime
[junit4:junit4] 2> 22024 T2081 C158 P49996 oasu.DirectUpdateHandler2.commit end_commit_flush
[junit4:junit4] 2> 22025 T2081 C158 P49996 /update {waitSearcher=true&openSearcher=false&commit=true&wt=javabin&commit_end_point=true&version=2&softCommit=false} {commit=} 0 25
[junit4:junit4] 2> 22027 T2120 C156 P50003 oash.ReplicationHandler.inform Commits will be reserved for 10000
[junit4:junit4] 2> 22027 T2120 C156 P50003 oash.SnapPuller.<init> No value set for 'pollInterval'. Timer Task not started.
[junit4:junit4] 2> 22031 T2077 C158 P49996 oash.ReplicationHandler.inform Commits will be reserved for 10000
[junit4:junit4] 2> 22031 T2077 C158 P49996 REQ /replication {command=indexversion&qt=/replication&wt=javabin&version=2} status=0 QTime=1
[junit4:junit4] 2> 22032 T2120 C156 P50003 oash.SnapPuller.fetchLatestIndex Master's generation: 2
[junit4:junit4] 2> 22033 T2120 C156 P50003 oash.SnapPuller.fetchLatestIndex Slave's generation: 1
[junit4:junit4] 2> 22033 T2120 C156 P50003 oash.SnapPuller.fetchLatestIndex Starting replication process
[junit4:junit4] 2> 22036 T2078 C158 P49996 oasc.CachingDirectoryFactory.close Releasing directory:/Users/jenkins/jenkins-slave/workspace/Lucene-Solr-trunk-MacOSX/solr/build/solr-core/test/J0/./org.apache.solr.cloud.BasicDistributedZkTest-1359025192910/jetty2
[junit4:junit4] 2> 22037 T2078 C158 P49996 oasc.CachingDirectoryFactory.close Releasing directory:/Users/jenkins/jenkins-slave/workspace/Lucene-Solr-trunk-MacOSX/solr/build/solr-core/test/J0/./org.apache.solr.cloud.BasicDistributedZkTest-1359025192910/jetty2/index
[junit4:junit4] 2> 22037 T2078 C158 P49996 REQ /replication {command=filelist&qt=/replication&wt=javabin&generation=2&version=2} status=0 QTime=2
[junit4:junit4] 2> 22038 T2120 C156 P50003 oash.SnapPuller.fetchLatestIndex Number of files in latest index in master: 1
[junit4:junit4] 2> 22039 T2120 C156 P50003 oasc.CachingDirectoryFactory.get return new directory for /Users/jenkins/jenkins-slave/workspace/Lucene-Solr-trunk-MacOSX/solr/build/solr-core/test/J0/./org.apache.solr.cloud.BasicDistributedZkTest-1359025192910/jetty4/index.20130124130014939 forceNew:false
[junit4:junit4] 2> 22039 T2120 C156 P50003 oasc.CachingDirectoryFactory.close Releasing directory:/Users/jenkins/jenkins-slave/workspace/Lucene-Solr-trunk-MacOSX/solr/build/solr-core/test/J0/./org.apache.solr.cloud.BasicDistributedZkTest-1359025192910/jetty4
[junit4:junit4] 2> 22039 T2120 C156 P50003 oash.SnapPuller.fetchLatestIndex Starting download to RateLimitedDirectoryWrapper(NRTCachingDirectory(org.apache.lucene.store.NIOFSDirectory@/Users/jenkins/jenkins-slave/workspace/Lucene-Solr-trunk-MacOSX/solr/build/solr-core/test/J0/org.apache.solr.cloud.BasicDistributedZkTest-1359025192910/jetty4/index.20130124130014939 lockFactory=org.apache.lucene.store.NativeFSLockFactory@189957f3; maxCacheMB=48.0 maxMergeSizeMB=4.0)) fullCopy=true
[junit4:junit4] 2> 22043 T2079 C158 P49996 REQ /replication {file=segments_2&command=filecontent&checksum=true&wt=filestream&qt=/replication&generation=2} status=0 QTime=0
[junit4:junit4] 2> 22046 T2120 C156 P50003 oasc.CachingDirectoryFactory.close Releasing directory:/Users/jenkins/jenkins-slave/workspace/Lucene-Solr-trunk-MacOSX/solr/build/solr-core/test/J0/./org.apache.solr.cloud.BasicDistributedZkTest-1359025192910/jetty4/index
[junit4:junit4] 2> 22047 T2120 C156 P50003 oash.SnapPuller.fetchLatestIndex Total time taken for download : 0 secs
[junit4:junit4] 2> 22048 T2120 C156 P50003 oash.SnapPuller.modifyIndexProps New index installed. Updating index properties... index=index.20130124130014939
[junit4:junit4] 2> 22049 T2120 C156 P50003 oasc.CachingDirectoryFactory.close Releasing directory:/Users/jenkins/jenkins-slave/workspace/Lucene-Solr-trunk-MacOSX/solr/build/solr-core/test/J0/./org.apache.solr.cloud.BasicDistributedZkTest-1359025192910/jetty4
[junit4:junit4] 2> 22050 T2120 C156 P50003 oasc.CachingDirectoryFactory.close Releasing directory:/Users/jenkins/jenkins-slave/workspace/Lucene-Solr-trunk-MacOSX/solr/build/solr-core/test/J0/./org.apache.solr.cloud.BasicDistributedZkTest-1359025192910/jetty4
[junit4:junit4] 2> 22051 T2120 C156 P50003 oasc.SolrCore.getNewIndexDir New index directory detected: old=./org.apache.solr.cloud.BasicDistributedZkTest-1359025192910/jetty4/index/ new=./org.apache.solr.cloud.BasicDistributedZkTest-1359025192910/jetty4/index.20130124130014939
[junit4:junit4] 2> 22054 T2120 C156 P50003 oasc.SolrDeletionPolicy.onInit SolrDeletionPolicy.onInit: commits:num=1
[junit4:junit4] 2> commit{dir=RateLimitedDirectoryWrapper(NRTCachingDirectory(org.apache.lucene.store.NIOFSDirectory@/Users/jenkins/jenkins-slave/workspace/Lucene-Solr-trunk-MacOSX/solr/build/solr-core/test/J0/org.apache.solr.cloud.BasicDistributedZkTest-1359025192910/jetty4/index.20130124130014939 lockFactory=org.apache.lucene.store.NativeFSLockFactory@189957f3; maxCacheMB=48.0 maxMergeSizeMB=4.0)),segFN=segments_2,generation=2,filenames=[segments_2]
[junit4:junit4] 2> 22055 T2120 C156 P50003 oasc.SolrDeletionPolicy.updateCommits newest commit = 2[segments_2]
[junit4:junit4] 2> 22057 T2120 C156 P50003 oasc.CachingDirectoryFactory.close Releasing directory:/Users/jenkins/jenkins-slave/workspace/Lucene-Solr-trunk-MacOSX/solr/build/solr-core/test/J0/./org.apache.solr.cloud.BasicDistributedZkTest-1359025192910/jetty4
[junit4:junit4] 2> 22057 T2120 C156 P50003 oasu.DefaultSolrCoreState.newIndexWriter Creating new IndexWriter...
[junit4:junit4] 2> 22057 T2120 C156 P50003 oasu.DefaultSolrCoreState.newIndexWriter Waiting until IndexWriter is unused... core=collection1
[junit4:junit4] 2> 22058 T2120 C156 P50003 oasu.DefaultSolrCoreState.newIndexWriter Rollback old IndexWriter... core=collection1
[junit4:junit4] 2> 22059 T2120 C156 P50003 oasc.CachingDirectoryFactory.close Releasing directory:/Users/jenkins/jenkins-slave/workspace/Lucene-Solr-trunk-MacOSX/solr/build/solr-core/test/J0/./org.apache.solr.cloud.BasicDistributedZkTest-1359025192910/jetty4/index.20130124130014939
[junit4:junit4] 2> 22059 T2120 C156 P50003 oasc.CachingDirectoryFactory.close Releasing directory:/Users/jenkins/jenkins-slave/workspace/Lucene-Solr-trunk-MacOSX/solr/build/solr-core/test/J0/./org.apache.solr.cloud.BasicDistributedZkTest-1359025192910/jetty4
[junit4:junit4] 2> 22065 T2120 C156 P50003 oasc.SolrDeletionPolicy.onInit SolrDeletionPolicy.onInit: commits:num=1
[junit4:junit4] 2> commit{dir=RateLimitedDirectoryWrapper(NRTCachingDirectory(org.apache.lucene.store.NIOFSDirectory@/Users/jenkins/jenkins-slave/workspace/Lucene-Solr-trunk-MacOSX/solr/build/solr-core/test/J0/org.apache.solr.cloud.BasicDistributedZkTest-1359025192910/jetty4/index.20130124130014939 lockFactory=org.apache.lucene.store.NativeFSLockFactory@189957f3; maxCacheMB=48.0 maxMergeSizeMB=4.0)),segFN=segments_2,generation=2,filenames=[segments_2]
[junit4:junit4] 2> 22065 T2120 C156 P50003 oasc.SolrDeletionPolicy.updateCommits newest commit = 2[segments_2]
[junit4:junit4] 2> 22066 T2120 C156 P50003 oasu.DefaultSolrCoreState.newIndexWriter New IndexWriter is ready to be used.
[junit4:junit4] 2> 22066 T2120 C156 P50003 oasc.CachingDirectoryFactory.close Releasing directory:/Users/jenkins/jenkins-slave/workspace/Lucene-Solr-trunk-MacOSX/solr/build/solr-core/test/J0/./org.apache.solr.cloud.BasicDistributedZkTest-1359025192910/jetty4
[junit4:junit4] 2> 22067 T2120 C156 P50003 oass.SolrIndexSearcher.<init> Opening Searcher@15f18e5 main
[junit4:junit4] 2> 22070 T2119 oasc.SolrCore.registerSearcher [collection1] Registered new searcher Searcher@15f18e5 main{StandardDirectoryReader(segments_2:1:nrt)}
[junit4:junit4] 2> 22071 T2119 oasc.CachingDirectoryFactory.close Releasing directory:/Users/jenkins/jenkins-slave/workspace/Lucene-Solr-trunk-MacOSX/solr/build/solr-core/test/J0/./org.apache.solr.cloud.BasicDistributedZkTest-1359025192910/jetty4/index
[junit4:junit4] 2> 22071 T2120 C156 P50003 oasu.DirectUpdateHandler2.commit start commit{,optimize=false,openSearcher=false,waitSearcher=false,expungeDeletes=false,softCommit=false}
[junit4:junit4] 2> 22075 T2120 C156 P50003 oasc.SolrDeletionPolicy.onCommit SolrDeletionPolicy.onCommit: commits:num=2
[junit4:junit4] 2> commit{dir=RateLimitedDirectoryWrapper(NRTCachingDirectory(org.apache.lucene.store.NIOFSDirectory@/Users/jenkins/jenkins-slave/workspace/Lucene-Solr-trunk-MacOSX/solr/build/solr-core/test/J0/org.apache.solr.cloud.BasicDistributedZkTest-1359025192910/jetty4/index.20130124130014939 lockFactory=org.apache.lucene.store.NativeFSLockFactory@189957f3; maxCacheMB=48.0 maxMergeSizeMB=4.0)),segFN=segments_2,generation=2,filenames=[segments_2]
[junit4:junit4] 2> commit{dir=RateLimitedDirectoryWrapper(NRTCachingDirectory(org.apache.lucene.store.NIOFSDirectory@/Users/jenkins/jenkins-slave/workspace/Lucene-Solr-trunk-MacOSX/solr/build/solr-core/test/J0/org.apache.solr.cloud.BasicDistributedZkTest-1359025192910/jetty4/index.20130124130014939 lockFactory=org.apache.lucene.store.NativeFSLockFactory@189957f3; maxCacheMB=48.0 maxMergeSizeMB=4.0)),segFN=segments_3,generation=3,filenames=[segments_3]
[junit4:junit4] 2> 22075 T2120 C156 P50003 oasc.SolrDeletionPolicy.updateCommits newest commit = 3[segments_3]
[junit4:junit4] 2> 22076 T2120 C156 P50003 oasc.CachingDirectoryFactory.close Releasing directory:/Users/jenkins/jenkins-slave/workspace/Lucene-Solr-trunk-MacOSX/solr/build/solr-core/test/J0/./org.apache.solr.cloud.BasicDistributedZkTest-1359025192910/jetty4
[junit4:junit4] 2> 22077 T2120 C156 P50003 oasu.DirectUpdateHandler2.commit end_commit_flush
[junit4:junit4] 2> 22077 T2120 C156 P50003 oasc.CachingDirectoryFactory.close Releasing directory:/Users/jenkins/jenkins-slave/workspace/Lucene-Solr-trunk-MacOSX/solr/build/solr-core/test/J0/./org.apache.solr.cloud.BasicDistributedZkTest-1359025192910/jetty4/index.20130124130014939
[junit4:junit4] 2> 22077 T2120 C156 P50003 oasc.CachingDirectoryFactory.close Releasing directory:/Users/jenkins/jenkins-slave/workspace/Lucene-Solr-trunk-MacOSX/solr/build/solr-core/test/J0/./org.apache.solr.cloud.BasicDistributedZkTest-1359025192910/jetty4/index
[junit4:junit4] 2> 22078 T2120 C156 P50003 oasc.RecoveryStrategy.replay No replay needed. core=collection1
[junit4:junit4] 2> 22078 T2120 C156 P50003 oasc.RecoveryStrategy.doRecovery Replication Recovery was successful - registering as Active. core=collection1
[junit4:junit4] 2> 22078 T2120 C156 P50003 oasc.ZkController.publish publishing core=collection1 state=active
[junit4:junit4] 2> 22079 T2120 C156 P50003 oasc.ZkController.publish numShards not found on descriptor - reading it from system property
[junit4:junit4] 2> 22082 T2120 C156 P50003 oasc.RecoveryStrategy.doRecovery Finished recovery process. core=collection1
[junit4:junit4] 2> 22177 T2053 oascc.ZkStateReader.updateClusterState Updating cloud state from ZooKeeper...
[junit4:junit4] 2> 22178 T2053 oasc.Overseer$ClusterStateUpdater.updateState Update state numShards=2 message={
[junit4:junit4] 2> "operation":"state",
[junit4:junit4] 2> "numShards":"2",
[junit4:junit4] 2> "shard":"shard2",
[junit4:junit4] 2> "roles":null,
[junit4:junit4] 2> "state":"active",
[junit4:junit4] 2> "core":"collection1",
[junit4:junit4] 2> "collection":"collection1",
[junit4:junit4] 2> "node_name":"127.0.0.1:50003_",
[junit4:junit4] 2> "base_url":"http://127.0.0.1:50003"}
[junit4:junit4] 2> 22188 T2052 oascc.ZkStateReader$2.process A cluster state change: WatchedEvent state:SyncConnected type:NodeDataChanged path:/clusterstate.json, has occurred - updating... (live nodes size: 5)
[junit4:junit4] 2> 22189 T2058 oascc.ZkStateReader$2.process A cluster state change: WatchedEvent state:SyncConnected type:NodeDataChanged path:/clusterstate.json, has occurred - updating... (live nodes size: 5)
[junit4:junit4] 2> 22189 T2117 oascc.ZkStateReader$2.process A cluster state change: WatchedEvent state:SyncConnected type:NodeDataChanged path:/clusterstate.json, has occurred - updating... (live nodes size: 5)
[junit4:junit4] 2> 22193 T2086 oascc.ZkStateReader$2.process A cluster state change: WatchedEvent state:SyncConnected type:NodeDataChanged path:/clusterstate.json, has occurred - updating... (live nodes size: 5)
[junit4:junit4] 2> 22196 T2101 oascc.ZkStateReader$2.process A cluster state change: WatchedEvent state:SyncConnected type:NodeDataChanged path:/clusterstate.json, has occurred - updating... (live nodes size: 5)
[junit4:junit4] 2> 22200 T2071 oascc.ZkStateReader$2.process A cluster state change: WatchedEvent state:SyncConnected type:NodeDataChanged path:/clusterstate.json, has occurred - updating... (live nodes size: 5)
[junit4:junit4] 2> 23022 T2030 oascc.ZkStateReader.updateClusterState Updating cloud state from ZooKeeper...
[junit4:junit4] 2> 23023 T2030 oasc.AbstractDistribZkTestBase.waitForRecoveriesToFinish Recoveries finished - collection: collection1
[junit4:junit4] 2> ASYNC NEW_CORE C159 name=collection1 org.apache.solr.core.SolrCore@f9c25b3 url=http://127.0.0.1:49989/collection1 node=127.0.0.1:49989_ C159_STATE=coll:control_collection core:collection1 props:{shard=shard1, roles=null, state=active, core=collection1, collection=control_collection, node_name=127.0.0.1:49989_, base_url=http://127.0.0.1:49989, leader=true}
[junit4:junit4] 2> 23032 T2044 C159 P49989 oasc.CachingDirectoryFactory.close Releasing directory:/Users/jenkins/jenkins-slave/workspace/Lucene-Solr-trunk-MacOSX/solr/build/solr-core/test/J0/./org.apache.solr.cloud.BasicDistributedZkTest-1359025192910/control/data
[junit4:junit4] 2> 23034 T2044 C159 P49989 oasc.SolrDeletionPolicy.onInit SolrDeletionPolicy.onInit: commits:num=1
[junit4:junit4] 2> commit{dir=RateLimitedDirectoryWrapper(NRTCachingDirectory(org.apache.lucene.store.NIOFSDirectory@/Users/jenkins/jenkins-slave/workspace/Lucene-Solr-trunk-MacOSX/solr/build/solr-core/test/J0/org.apache.solr.cloud.BasicDistributedZkTest-1359025192910/control/data/index lockFactory=org.apache.lucene.store.NativeFSLockFactory@37e41851; maxCacheMB=48.0 maxMergeSizeMB=4.0)),segFN=segments_1,generation=1,filenames=[segments_1]
[junit4:junit4] 2> 23034 T2044 C159 P49989 oasc.SolrDeletionPolicy.updateCommits newest commit = 1[segments_1]
[junit4:junit4] 2> 23035 T2044 C159 P49989 oasc.CachingDirectoryFactory.close Releasing directory:/Users/jenkins/jenkins-slave/workspace/Lucene-Solr-trunk-MacOSX/solr/build/solr-core/test/J0/./org.apache.solr.cloud.BasicDistributedZkTest-1359025192910/control/data
[junit4:junit4] 2> 23035 T2044 C159 P49989 oass.SolrIndexSearcher.<init> Opening Searcher@6802192d realtime
[junit4:junit4] 2> 23036 T2044 C159 P49989 /update {wt=javabin&version=2} {deleteByQuery=*:* (-1425041224821112832)} 0 5
[junit4:junit4] 2> 23040 T2082 C158 P49996 oasc.CachingDirectoryFactory.close Releasing directory:/Users/jenkins/jenkins-slave/workspace/Lucene-Solr-trunk-MacOSX/solr/build/solr-core/test/J0/./org.apache.solr.cloud.BasicDistributedZkTest-1359025192910/jetty2
[junit4:junit4] 2> 23052 T2066 C157 P49993 oasc.CachingDirectoryFactory.close Releasing directory:/Users/jenkins/jenkins-slave/workspace/Lucene-Solr-trunk-MacOSX/solr/build/solr-core/test/J0/./org.apache.solr.cloud.BasicDistributedZkTest-1359025192910/jetty1
[junit4:junit4] 2> C155_STATE=coll:collection1 core:collection1 props:{shard=shard1, roles=null, state=active, core=collection1, collection=collection1, node_name=127.0.0.1:49999_, base_url=http://127.0.0.1:49999}
[junit4:junit4] 2> 23089 T2095 C155 P49999 oasc.CachingDirectoryFactory.close Releasing directory:/Users/jenkins/jenkins-slave/workspace/Lucene-Solr-trunk-MacOSX/solr/build/solr-core/test/J0/./org.apache.solr.cloud.BasicDistributedZkTest-1359025192910/jetty3
[junit4:junit4] 2> 23091 T2095 C155 P49999 /update {update.distrib=FROMLEADER&_version_=-1425041224842084352&update.from=http://127.0.0.1:49993/collection1/&wt=javabin&version=2} {deleteByQuery=*:* (-1425041224842084352)} 0 4
[junit4:junit4] 2> 23092 T2066 C157 P49993 /update {update.distrib=TOLEADER&wt=javabin&version=2} {deleteByQuery=*:* (-1425041224842084352)} 0 42
[junit4:junit4] 2> C156_STATE=coll:collection1 core:collection1 props:{shard=shard2, roles=null, state=active, core=collection1, collection=collection1, node_name=127.0.0.1:50003_, base_url=http://127.0.0.1:50003}
[junit4:junit4] 2> 23106 T2113 C156 P50003 oasc.CachingDirectoryFactory.close Releasing directory:/Users/jenkins/jenkins-slave/workspace/Lucene-Solr-trunk-MacOSX/solr/build/solr-core/test/J0/./org.apache.solr.cloud.BasicDistributedZkTest-1359025192910/jetty4
[junit4:junit4] 2> 23107 T2113 C156 P50003 /update {update.distrib=FROMLEADER&_version_=-1425041224829501440&update.from=http://127.0.0.1:49996/collection1/&wt=javabin&version=2} {deleteByQuery=*:* (-1425041224829501440)} 0 4
[junit4:junit4] 2> 23108 T2082 C158 P49996 /update {wt=javabin&version=2} {deleteByQuery=*:* (-1425041224829501440)} 0 70
[junit4:junit4] 2> 23118 T2045 C159 P49989 /update {wt=javabin&version=2} {add=[1 (1425041224907096064)]} 0 5
[junit4:junit4] 2> 23145 T2096 C155 P49999 /update {distrib.from=http://127.0.0.1:49993/collection1/&update.distrib=FROMLEADER&wt=javabin&version=2} {add=[1 (1425041224924921856)]} 0 5
[junit4:junit4] 2> 23147 T2063 C157 P49993 /update {distrib.from=http://127.0.0.1:49996/collection1/&update.distrib=TOLEADER&wt=javabin&version=2} {add=[1 (1425041224924921856)]} 0 17
[junit4:junit4] 2> 23148 T2077 C158 P
[...truncated too long message...]
hTestCase.testDistribSearch(BaseDistributedSearchTestCase.java:794)
[junit4:junit4] > at sun.reflect.NativeMethodAccessorImpl.invoke0(Native Method)
[junit4:junit4] > at sun.reflect.NativeMethodAccessorImpl.invoke(NativeMethodAccessorImpl.java:57)
[junit4:junit4] > at sun.reflect.DelegatingMethodAccessorImpl.invoke(DelegatingMethodAccessorImpl.java:43)
[junit4:junit4] > at java.lang.reflect.Method.invoke(Method.java:601)
[junit4:junit4] > at com.carrotsearch.randomizedtesting.RandomizedRunner.invoke(RandomizedRunner.java:1559)
[junit4:junit4] > at com.carrotsearch.randomizedtesting.RandomizedRunner.access$600(RandomizedRunner.java:79)
[junit4:junit4] > at com.carrotsearch.randomizedtesting.RandomizedRunner$6.evaluate(RandomizedRunner.java:737)
[junit4:junit4] > at com.carrotsearch.randomizedtesting.RandomizedRunner$7.evaluate(RandomizedRunner.java:773)
[junit4:junit4] > at com.carrotsearch.randomizedtesting.RandomizedRunner$8.evaluate(RandomizedRunner.java:787)
[junit4:junit4] > at com.carrotsearch.randomizedtesting.rules.SystemPropertiesRestoreRule$1.evaluate(SystemPropertiesRestoreRule.java:53)
[junit4:junit4] > at org.apache.lucene.util.TestRuleSetupTeardownChained$1.evaluate(TestRuleSetupTeardownChained.java:50)
[junit4:junit4] > at org.apache.lucene.util.TestRuleFieldCacheSanity$1.evaluate(TestRuleFieldCacheSanity.java:51)
[junit4:junit4] > at org.apache.lucene.util.AbstractBeforeAfterRule$1.evaluate(AbstractBeforeAfterRule.java:46)
[junit4:junit4] > at com.carrotsearch.randomizedtesting.rules.SystemPropertiesInvariantRule$1.evaluate(SystemPropertiesInvariantRule.java:55)
[junit4:junit4] > at org.apache.lucene.util.TestRuleThreadAndTestName$1.evaluate(TestRuleThreadAndTestName.java:49)
[junit4:junit4] > at org.apache.lucene.util.TestRuleIgnoreAfterMaxFailures$1.evaluate(TestRuleIgnoreAfterMaxFailures.java:70)
[junit4:junit4] > at org.apache.lucene.util.TestRuleMarkFailure$1.evaluate(TestRuleMarkFailure.java:48)
[junit4:junit4] > at com.carrotsearch.randomizedtesting.rules.StatementAdapter.evaluate(StatementAdapter.java:36)
[junit4:junit4] > at com.carrotsearch.randomizedtesting.ThreadLeakControl$StatementRunner.run(ThreadLeakControl.java:358)
[junit4:junit4] > at com.carrotsearch.randomizedtesting.ThreadLeakControl.forkTimeoutingTask(ThreadLeakControl.java:782)
[junit4:junit4] > at com.carrotsearch.randomizedtesting.ThreadLeakControl$3.evaluate(ThreadLeakControl.java:442)
[junit4:junit4] > at com.carrotsearch.randomizedtesting.RandomizedRunner.runSingleTest(RandomizedRunner.java:746)
[junit4:junit4] > at com.carrotsearch.randomizedtesting.RandomizedRunner$3.evaluate(RandomizedRunner.java:648)
[junit4:junit4] > at com.carrotsearch.randomizedtesting.RandomizedRunner$4.evaluate(RandomizedRunner.java:682)
[junit4:junit4] > at com.carrotsearch.randomizedtesting.RandomizedRunner$5.evaluate(RandomizedRunner.java:693)
[junit4:junit4] > at com.carrotsearch.randomizedtesting.rules.StatementAdapter.evaluate(StatementAdapter.java:36)
[junit4:junit4] > at com.carrotsearch.randomizedtesting.rules.SystemPropertiesRestoreRule$1.evaluate(SystemPropertiesRestoreRule.java:53)
[junit4:junit4] > at org.apache.lucene.util.AbstractBeforeAfterRule$1.evaluate(AbstractBeforeAfterRule.java:46)
[junit4:junit4] > at org.apache.lucene.util.TestRuleStoreClassName$1.evaluate(TestRuleStoreClassName.java:42)
[junit4:junit4] > at com.carrotsearch.randomizedtesting.rules.SystemPropertiesInvariantRule$1.evaluate(SystemPropertiesInvariantRule.java:55)
[junit4:junit4] > at com.carrotsearch.randomizedtesting.rules.NoShadowingOrOverridesOnMethodsRule$1.evaluate(NoShadowingOrOverridesOnMethodsRule.java:39)
[junit4:junit4] > at com.carrotsearch.randomizedtesting.rules.NoShadowingOrOverridesOnMethodsRule$1.evaluate(NoShadowingOrOverridesOnMethodsRule.java:39)
[junit4:junit4] > at com.carrotsearch.randomizedtesting.rules.StatementAdapter.evaluate(StatementAdapter.java:36)
[junit4:junit4] > at org.apache.lucene.util.TestRuleAssertionsRequired$1.evaluate(TestRuleAssertionsRequired.java:43)
[junit4:junit4] > at org.apache.lucene.util.TestRuleMarkFailure$1.evaluate(TestRuleMarkFailure.java:48)
[junit4:junit4] > at org.apache.lucene.util.TestRuleIgnoreAfterMaxFailures$1.evaluate(TestRuleIgnoreAfterMaxFailures.java:70)
[junit4:junit4] > at org.apache.lucene.util.TestRuleIgnoreTestSuites$1.evaluate(TestRuleIgnoreTestSuites.java:55)
[junit4:junit4] > at com.carrotsearch.randomizedtesting.rules.StatementAdapter.evaluate(StatementAdapter.java:36)
[junit4:junit4] > at com.carrotsearch.randomizedtesting.ThreadLeakControl$StatementRunner.run(ThreadLeakControl.java:358)
[junit4:junit4] > at java.lang.Thread.run(Thread.java:722)
[junit4:junit4] 2> 390279 T2030 oas.SolrTestCaseJ4.deleteCore ###deleteCore
[junit4:junit4] 2> NOTE: test params are: codec=Lucene41: {n_f1=PostingsFormat(name=Asserting), foo_b=PostingsFormat(name=MockRandom), cat=Pulsing41(freqCutoff=1 minBlockSize=65 maxBlockSize=224), foo_d=MockVariableIntBlock(baseBlockSize=85), foo_f=PostingsFormat(name=MockRandom), n_tl1=PostingsFormat(name=Asserting), n_d1=Pulsing41(freqCutoff=1 minBlockSize=65 maxBlockSize=224), rnd_b=MockVariableIntBlock(baseBlockSize=85), intDefault=PostingsFormat(name=Asserting), n_td1=PostingsFormat(name=Asserting), timestamp=Pulsing41(freqCutoff=1 minBlockSize=65 maxBlockSize=224), id=MockVariableIntBlock(baseBlockSize=85), range_facet_sl=MockVariableIntBlock(baseBlockSize=85), range_facet_si=Pulsing41(freqCutoff=1 minBlockSize=65 maxBlockSize=224), oddField_s=MockVariableIntBlock(baseBlockSize=85), sequence_i=MockVariableIntBlock(baseBlockSize=85), name=MockVariableIntBlock(baseBlockSize=85), foo_i=PostingsFormat(name=Asserting), regex_dup_B_s=Pulsing41(freqCutoff=1 minBlockSize=65 maxBlockSize=224), multiDefault=Pulsing41(freqCutoff=1 minBlockSize=65 maxBlockSize=224), n_tf1=Pulsing41(freqCutoff=1 minBlockSize=65 maxBlockSize=224), n_dt1=PostingsFormat(name=Asserting), genre_s=MockVariableIntBlock(baseBlockSize=85), author_t=PostingsFormat(name=Asserting), n_ti1=MockVariableIntBlock(baseBlockSize=85), range_facet_l=Pulsing41(freqCutoff=1 minBlockSize=65 maxBlockSize=224), text=PostingsFormat(name=MockRandom), _version_=PostingsFormat(name=Asserting), val_i=MockVariableIntBlock(baseBlockSize=85), SubjectTerms_mfacet=PostingsFormat(name=Asserting), series_t=PostingsFormat(name=Asserting), a_t=Pulsing41(freqCutoff=1 minBlockSize=65 maxBlockSize=224), n_tdt1=PostingsFormat(name=Asserting), regex_dup_A_s=PostingsFormat(name=MockRandom), price=PostingsFormat(name=MockRandom), other_tl1=PostingsFormat(name=Asserting), n_l1=Pulsing41(freqCutoff=1 minBlockSize=65 maxBlockSize=224), a_si=PostingsFormat(name=Asserting), inStock=PostingsFormat(name=MockRandom)}, sim=DefaultSimilarity, locale=sr_ME, timezone=Europe/Riga
[junit4:junit4] 2> NOTE: Mac OS X 10.8.2 x86_64/Oracle Corporation 1.7.0_10 (64-bit)/cpus=2,threads=1,free=92296928,total=194502656
[junit4:junit4] 2> NOTE: All tests run in this JVM: [SolrPluginUtilsTest, RAMDirectoryFactoryTest, HighlighterTest, AnalysisAfterCoreReloadTest, TestComponentsName, IndexBasedSpellCheckerTest, TestStressLucene, TestFastLRUCache, FullSolrCloudDistribCmdsTest, TestPartialUpdateDeduplication, TestPostingsSolrHighlighter, BasicDistributedZk2Test, TestStressReorder, OpenExchangeRatesOrgProviderTest, TestLazyCores, DebugComponentTest, TestSort, TestSolrJ, SOLR749Test, TestReplicationHandler, TestQuerySenderNoQuery, CoreContainerCoreInitFailuresTest, UUIDFieldTest, DisMaxRequestHandlerTest, DirectUpdateHandlerTest, TestUpdate, DateFieldTest, OverseerCollectionProcessorTest, TestRangeQuery, UpdateParamsTest, ScriptEngineTest, CSVRequestHandlerTest, DistributedQueryElevationComponentTest, TestSolrQueryParser, DateMathParserTest, BasicZkTest, TestLuceneMatchVersion, SyncSliceTest, SpellCheckCollatorTest, TestStressRecovery, TestPerFieldSimilarity, FastVectorHighlighterTest, TestPropInject, TestZkChroot, TestSolr4Spatial, MoreLikeThisHandlerTest, NoCacheHeaderTest, SuggesterTSTTest, TestDistributedSearch, TestDocumentBuilder, SimplePostToolTest, FileBasedSpellCheckerTest, TestFoldingMultitermQuery, ResponseLogComponentTest, SampleTest, SearchHandlerTest, EchoParamsTest, PathHierarchyTokenizerFactoryTest, SolrRequestParserTest, TestCharFilters, TestSolrXMLSerializer, CollectionsAPIDistributedZkTest, TestDefaultSimilarityFactory, ZkSolrClientTest, TestSolrIndexConfig, ClusterStateUpdateTest, AlternateDirectoryTest, TestJmxIntegration, ConvertedLegacyTest, XmlUpdateRequestHandlerTest, TestTrie, SolrCmdDistributorTest, TestRealTimeGet, BasicDistributedZkTest]
[junit4:junit4] Completed in 390.75s, 1 test, 1 failure <<< FAILURES!
[...truncated 530 lines...]
BUILD FAILED
/Users/jenkins/jenkins-slave/workspace/Lucene-Solr-trunk-MacOSX/build.xml:346: The following error occurred while executing this line:
/Users/jenkins/jenkins-slave/workspace/Lucene-Solr-trunk-MacOSX/build.xml:39: The following error occurred while executing this line:
/Users/jenkins/jenkins-slave/workspace/Lucene-Solr-trunk-MacOSX/solr/build.xml:178: The following error occurred while executing this line:
/Users/jenkins/jenkins-slave/workspace/Lucene-Solr-trunk-MacOSX/solr/common-build.xml:428: The following error occurred while executing this line:
/Users/jenkins/jenkins-slave/workspace/Lucene-Solr-trunk-MacOSX/lucene/common-build.xml:1176: The following error occurred while executing this line:
/Users/jenkins/jenkins-slave/workspace/Lucene-Solr-trunk-MacOSX/lucene/common-build.xml:841: There were test failures: 247 suites, 1032 tests, 1 failure, 14 ignored (3 assumptions)
Total time: 68 minutes 3 seconds
Build step 'Invoke Ant' marked build as failure
Archiving artifacts
Recording test results
Description set: Java: 64bit/jdk1.7.0 -XX:+UseConcMarkSweepGC
Email was triggered for: Failure
Sending email for trigger: Failure