You are viewing a plain text version of this content. The canonical link for it is here.
Posted to cactus-dev@jakarta.apache.org by Vincent Massol <vm...@apache.org> on 2003/04/30 12:16:35 UTC

[GUMP] Build Failure - jakarta-cactus-sample-servlet-12

----------------------------------------------------
This email is autogenerated from the output from:
<http://cvs.apache.org/builds/gump/2003-04-30/jakarta-cactus-sample-servlet-12.html>
----------------------------------------------------

Buildfile: samples/servlet/build.xml

init.display:
     [echo] ----- Cactus Servlet Sample 20030430 -----

     [echo] java.class.path = /home/rubys/jakarta/xml-commons/java/external/build/xml-apis.jar:/home/rubys/jakarta/xml-xerces2/java/build/xmlParserAPIs.jar:/home/rubys/jakarta/xml-xerces2/java/build/xercesImpl.jar:.:/usr/java/j2sdk1.4.1_02/lib/tools.jar:/usr/java/j2sdk1.4.1_02/jre/lib/rt.jar:/usr/java/j2sdk1.4.1_02/lib/tools.jar:/home/rubys/jakarta/ant/dist/lib/ant.jar:/home/rubys/jakarta/ant/dist/lib/ant-jmf.jar:/home/rubys/jakarta/ant/dist/lib/ant-junit.jar:/home/rubys/jakarta/ant/dist/lib/ant-stylebook.jar:/home/rubys/jakarta/ant/dist/lib/ant-swing.jar:/home/rubys/jakarta/ant/dist/lib/ant-trax.jar:/home/rubys/jakarta/ant/dist/lib/ant-xalan2.jar:/home/rubys/jakarta/ant/dist/lib/nodeps.jar:/home/rubys/jakarta/jakarta-tomcat/build/tomcat/lib/common/tomcat_core.jar:/home/rubys/jakarta/jakarta-tomcat/build/tomcat/lib/common/core_util.jar:/home/rubys/jakarta/jakarta-tomcat/build/tomcat/lib/container/container_util.jar:/home/rubys/jakarta/jakarta-tomcat/build/tomcat/lib/container/tomcat_modules.jar:/home/rubys/jakarta/jakarta-tomcat/build/tomcat/lib/tomcat.jar:/home/rubys/jakarta/jakarta-tomcat/build/tomcat/lib/common/tomcat-util.jar:/home/rubys/jakarta/jakarta-tomcat/build/tomcat/lib/container/facade22.jar:/home/rubys/jakarta/jakarta-tomcat/build/tomcat/lib/container/jasper.jar:/opt/aspectj1.0/lib/aspectjtools.jar:/opt/aspectj1.0/lib/aspectjrt.jar:/opt/aspectj1.0/lib/aspectj-ant.jar:/home/rubys/jakarta/jakarta-cactus/integration/ant/dist-12/bin/cactus-integration-ant/lib/client/cactus-integration-ant-20030430.jar:/home/rubys/jakarta/jakarta-servletapi/dist/lib/servlet.jar:/home/rubys/jakarta/jakarta-log4j/log4j-20030430.jar:/home/rubys/jakarta/jakarta-log4j/log4j-lf5-20030430.jar:/home/rubys/jakarta/jakarta-log4j/log4j-chainsaw-20030430.jar:/home/rubys/jakarta/jakarta-commons/logging/dist/commons-logging.jar:/home/rubys/jakarta/jakarta-commons/logging/dist/commons-logging-api.jar:/home/rubys/jakarta/jakarta-commons/httpclient/dist/commons-httpclient.jar:/home/rubys/jakarta/httpunit/lib/httpunit.jar:/home/rubys/jakarta/dist/junit/junit.jar:/home/rubys/jakarta/jakarta-taglibs/dist/standard/lib/jstl.jar:/home/rubys/jakarta/jakarta-taglibs/dist/standard/lib/standard.jar:/home/rubys/jakarta/jakarta-cactus/framework/dist-12/lib/cactus-framework.jar:/home/rubys/jakarta/jakarta-cactus/anttasks/dist/lib/cactus-anttasks.jar:/home/rubys/jakarta/jakarta-cactus/samples/servlet/target-12/sample/target/classes/java:/home/rubys/jakarta/jakarta-cactus/samples/servlet/target-12/sample/target/cactus/classes:/home/rubys/jakarta/jakarta-cactus/samples/servlet/target-12/sample/target/conf/client"

     [echo] java.home = /usr/java/j2sdk1.4.1_02/jre
     [echo] user.home = /home/rubys
     [echo] ant.home = ${ant.home}


init.j2ee.dependent:

init.j2ee.find:
     [echo] j2ee.api = 12

init.j2ee:

init.properties.target.j2ee:

init.properties.target.noj2ee:

init.properties.target:

init.properties.dist.j2ee:

init.properties.dist.noj2ee:

init.properties.dist:

init.properties.release.j2ee:

init.properties.release.noj2ee:

init.properties.release:

init.properties.artifact:

init.properties:

init.common:

properties:

check.properties:
[checkProperty] j2ee.jar = [/home/rubys/jakarta/jakarta-servletapi/dist/lib/servlet.jar]
[checkProperty] jstl.jar = [/home/rubys/jakarta/jakarta-taglibs/dist/standard/lib/jstl.jar]
[checkProperty] standard.jar = [/home/rubys/jakarta/jakarta-taglibs/dist/standard/lib/standard.jar]

init:
     [echo] cactus.port (optional) = 8082
     [echo] clover.enable (optional) = ${clover.enable}

init.checkstyle.check:

init.checkstyle:

checkstyle:

sample.main:
    [mkdir] Created dir: /home/rubys/jakarta/jakarta-cactus/samples/servlet/target-12/sample/lib
    [mkdir] Created dir: /home/rubys/jakarta/jakarta-cactus/samples/servlet/target-12/sample/build
    [mkdir] Created dir: /home/rubys/jakarta/jakarta-cactus/samples/servlet/target-12/sample/src/java
    [mkdir] Created dir: /home/rubys/jakarta/jakarta-cactus/samples/servlet/target-12/sample/src/test-cactus
    [mkdir] Created dir: /home/rubys/jakarta/jakarta-cactus/samples/servlet/target-12/sample/src/webapp
    [mkdir] Created dir: /home/rubys/jakarta/jakarta-cactus/samples/servlet/target-12/sample/build/cactus-integration-ant
     [copy] Copying 55 files to /home/rubys/jakarta/jakarta-cactus/samples/servlet/target-12/sample/build/cactus-integration-ant
     [copy] Copying 5 files to /home/rubys/jakarta/jakarta-cactus/samples/servlet/target-12/sample/src/java
     [copy] Copying 26 files to /home/rubys/jakarta/jakarta-cactus/samples/servlet/target-12/sample/src/test-cactus
     [copy] Copying 2 files to /home/rubys/jakarta/jakarta-cactus/samples/servlet/target-12/sample
     [copy] Replacing: @version@ -> 20030430
     [copy] Replacing: @year@ -> 2000-2003
     [copy] Replacing: @version@ -> 20030430
     [copy] Replacing: @version@ -> 20030430
     [copy] Copying 3 files to /home/rubys/jakarta/jakarta-cactus/samples/servlet/target-12/sample/src/webapp
     [copy] Copying 1 file to /home/rubys/jakarta/jakarta-cactus/samples/servlet/target-12/sample/lib
     [copy] Copying 1 file to /home/rubys/jakarta/jakarta-cactus/samples/servlet/target-12/sample/lib
     [copy] Copying 1 file to /home/rubys/jakarta/jakarta-cactus/samples/servlet/target-12/sample/lib
     [copy] Copying 1 file to /home/rubys/jakarta/jakarta-cactus/samples/servlet/target-12/sample

sample.replace:

sample.replace.12:

sample.clover:

sample.noclover:

sample:

prepare.dist:
    [mkdir] Created dir: /home/rubys/jakarta/jakarta-cactus/samples/servlet/dist-12/bin
     [copy] Copying 95 files to /home/rubys/jakarta/jakarta-cactus/samples/servlet/dist-12/bin/cactus-sample-servlet
     [copy] Copied 6 empty directories to /home/rubys/jakarta/jakarta-cactus/samples/servlet/dist-12/bin/cactus-sample-servlet

test.prepare.clover:

test.prepare.noclover:

test:
     [java] Buildfile: samples/servlet/target-12/sample/build.xml

     [java] display.properties:
     [java]      [echo] ----- Cactus Servlet Sample 20030430 -----

     [java]      [echo] java.class.path = /home/rubys/jakarta/xml-commons/java/external/build/xml-apis.jar:/home/rubys/jakarta/xml-xerces2/java/build/xmlParserAPIs.jar:/home/rubys/jakarta/xml-xerces2/java/build/xercesImpl.jar:/home/rubys/jakarta/jakarta-cactus:/usr/java/j2sdk1.4.1_02/lib/tools.jar:/usr/java/j2sdk1.4.1_02/jre/lib/rt.jar:/home/rubys/jakarta/ant/dist/lib/ant.jar:/home/rubys/jakarta/ant/dist/lib/ant-jmf.jar:/home/rubys/jakarta/ant/dist/lib/ant-junit.jar:/home/rubys/jakarta/ant/dist/lib/ant-stylebook.jar:/home/rubys/jakarta/ant/dist/lib/ant-swing.jar:/home/rubys/jakarta/ant/dist/lib/ant-trax.jar:/home/rubys/jakarta/ant/dist/lib/ant-xalan2.jar:/home/rubys/jakarta/ant/dist/lib/nodeps.jar:/home/rubys/jakarta/jakarta-tomcat/build/tomcat/lib/common/tomcat_core.jar:/home/rubys/jakarta/jakarta-tomcat/build/tomcat/lib/common/core_util.jar:/home/rubys/jakarta/jakarta-tomcat/build/tomcat/lib/container/container_util.jar:/home/rubys/jakarta/jakarta-tomcat/build/tomcat/lib/container/tomcat_modules.jar:/home/rubys/jakarta/jakarta-tomcat/build/tomcat/lib/tomcat.jar:/home/rubys/jakarta/jakarta-tomcat/build/tomcat/lib/common/tomcat-util.jar:/home/rubys/jakarta/jakarta-tomcat/build/tomcat/lib/container/facade22.jar:/home/rubys/jakarta/jakarta-tomcat/build/tomcat/lib/container/jasper.jar:/opt/aspectj1.0/lib/aspectjtools.jar:/opt/aspectj1.0/lib/aspectjrt.jar:/opt/aspectj1.0/lib/aspectj-ant.jar:/home/rubys/jakarta/jakarta-cactus/integration/ant/dist-12/bin/cactus-integration-ant/lib/client/cactus-integration-ant-20030430.jar:/home/rubys/jakarta/jakarta-servletapi/dist/lib/servlet.jar:/home/rubys/jakarta/jakarta-log4j/log4j-20030430.jar:/home/rubys/jakarta/jakarta-log4j/log4j-lf5-20030430.jar:/home/rubys/jakarta/jakarta-log4j/log4j-chainsaw-20030430.jar:/home/rubys/jakarta/jakarta-commons/logging/dist/commons-logging.jar:/home/rubys/jakarta/jakarta-commons/logging/dist/commons-logging-api.jar:/home/rubys/jakarta/jakarta-commons/httpclient/dist/commons-httpclient.jar:/home/rubys/jakarta/httpunit/lib/httpunit.jar:/home/rubys/jakarta/dist/junit/junit.jar:/home/rubys/jakarta/jakarta-taglibs/dist/standard/lib/jstl.jar:/home/rubys/jakarta/jakarta-taglibs/dist/standard/lib/standard.jar:/home/rubys/jakarta/jakarta-cactus/framework/dist-12/lib/cactus-framework.jar:/home/rubys/jakarta/jakarta-cactus/anttasks/dist/lib/cactus-anttasks.jar:/home/rubys/jakarta/jakarta-cactus/samples/servlet/target-12/sample/target/classes/java:/home/rubys/jakarta/jakarta-cactus/samples/servlet/target-12/sample/target/cactus/classes:/home/rubys/jakarta/jakarta-cactus/samples/servlet/target-12/sample/target/conf/client

     [java]      [echo] java.home = /usr/java/j2sdk1.4.1_02/jre
     [java]      [echo] user.home = /home/rubys
     [java]      [echo] ant.home = ${ant.home}

     [java]      [echo] servlet.jar = /home/rubys/jakarta/jakarta-servletapi/dist/lib/servlet.jar
     [java]      [echo] jstl.jar = /home/rubys/jakarta/jakarta-taglibs/dist/standard/lib/jstl.jar
     [java]      [echo] standard.jar = /home/rubys/jakarta/jakarta-taglibs/dist/standard/lib/standard.jar

     [java]      [echo] cactus.port (optional) = 8082


     [java] check.properties:

     [java] init:

     [java] compile.java:
     [java]     [javac] Compiling 4 source files to /home/rubys/jakarta/jakarta-cactus/samples/servlet/target-12/sample/target/classes/java

     [java] compile.cactus:

     [java] cactus.compile:
     [java]     [javac] Compiling 26 source files to /home/rubys/jakarta/jakarta-cactus/samples/servlet/target-12/sample/target/cactus/classes
     [java]     [javac] Note: /home/rubys/jakarta/jakarta-cactus/samples/servlet/target-12/sample/src/test-cactus/org/apache/cactus/sample/TestSampleServlet.java uses or overrides a deprecated API.
     [java]     [javac] Note: Recompile with -deprecation for details.

     [java] compile:

     [java] war:
     [java]       [war] Building war: /home/rubys/jakarta/jakarta-cactus/samples/servlet/target-12/sample/target/sample-servlet.war

     [java] test:

     [java] cactus.init:

     [java] cactus.check.tomcat4x:

     [java]      [echo] ******************************************************
     [java]      [echo] WARNING : The 'cactus.home.tomcat4x' property has not
     [java]      [echo] been set. No test will be run on that servlet engine.
     [java]      [echo] ******************************************************


     [java] cactus.setup.tomcat4x:

     [java] cactus.war:
     [java]     [unwar] Expanding: /home/rubys/jakarta/jakarta-cactus/samples/servlet/target-12/sample/target/sample-servlet.war into /home/rubys/jakarta/jakarta-cactus/samples/servlet/target-12/sample/target/cactus/cactustest

     [java] cactus.war.merge.check:

     [java] cactus.war.merge.yes:
     [java] [webxmlmerge] Merged 2 servlet definitions into the descriptor
     [java]      [move] Moving 1 files to /home/rubys/jakarta/jakarta-cactus/samples/servlet/target-12/sample/target/cactus/cactustest/WEB-INF

     [java] cactus.war.merge.no:

     [java] cactus.war.merge:
     [java]      [copy] Copying 1 file to /home/rubys/jakarta/jakarta-cactus/samples/servlet/target-12/sample/target/cactus/cactustest/WEB-INF/classes

     [java] cactus.compile:

     [java] cactus.copyclasses:
     [java]      [copy] Copying 28 files to /home/rubys/jakarta/jakarta-cactus/samples/servlet/target-12/sample/target/cactus/cactustest/WEB-INF/classes
     [java]      [copy] Copying 1 file to /home/rubys/jakarta/jakarta-cactus/samples/servlet/target-12/sample/target/cactus/cactustest/WEB-INF/lib
     [java]      [copy] Copying 1 file to /home/rubys/jakarta/jakarta-cactus/samples/servlet/target-12/sample/target/cactus/cactustest/WEB-INF/lib
     [java]      [copy] Copying 1 file to /home/rubys/jakarta/jakarta-cactus/samples/servlet/target-12/sample/target/cactus/cactustest/WEB-INF/lib
     [java]      [copy] Copying 1 file to /home/rubys/jakarta/jakarta-cactus/samples/servlet/target-12/sample/target/cactus/cactustest/WEB-INF/lib
     [java]      [copy] Copying 1 file to /home/rubys/jakarta/jakarta-cactus/samples/servlet/target-12/sample/target/cactus/cactustest/WEB-INF/lib
     [java]      [copy] Copying 1 file to /home/rubys/jakarta/jakarta-cactus/samples/servlet/target-12/sample/target/cactus/cactustest/WEB-INF/lib
     [java]      [copy] Copying 1 file to /home/rubys/jakarta/jakarta-cactus/samples/servlet/target-12/sample/target/cactus/cactustest

     [java] cactus.deploy.tomcat4x:

     [java] cactus.run.tomcat4x:

     [java] cactus.init:

     [java] cactus.check.resin2x:

     [java]      [echo] ******************************************************
     [java]      [echo] WARNING : The 'cactus.home.resin2x' property has not
     [java]      [echo] been set. No test will be run on that servlet engine.
     [java]      [echo] ******************************************************


     [java] cactus.setup.resin2x:

     [java] cactus.war:
     [java]     [unwar] Expanding: /home/rubys/jakarta/jakarta-cactus/samples/servlet/target-12/sample/target/sample-servlet.war into /home/rubys/jakarta/jakarta-cactus/samples/servlet/target-12/sample/target/cactus/cactustest

     [java] cactus.war.merge.check:

     [java] cactus.war.merge.yes:
     [java] [webxmlmerge] Merged 2 servlet definitions into the descriptor
     [java]      [move] Moving 1 files to /home/rubys/jakarta/jakarta-cactus/samples/servlet/target-12/sample/target/cactus/cactustest/WEB-INF

     [java] cactus.war.merge.no:

     [java] cactus.war.merge:

     [java] cactus.compile:

     [java] cactus.copyclasses:

     [java] cactus.deploy.resin2x:

     [java] cactus.run.resin2x:

     [java] cactus.init:

     [java] cactus.check.orion1x:

     [java]      [echo] ******************************************************
     [java]      [echo] WARNING : The 'cactus.home.orion1x' property has not
     [java]      [echo] been set. No test will be run on that servlet engine.
     [java]      [echo] ******************************************************


     [java] cactus.setup.orion1x:

     [java] cactus.war:
     [java]     [unwar] Expanding: /home/rubys/jakarta/jakarta-cactus/samples/servlet/target-12/sample/target/sample-servlet.war into /home/rubys/jakarta/jakarta-cactus/samples/servlet/target-12/sample/target/cactus/cactustest

     [java] cactus.war.merge.check:

     [java] cactus.war.merge.yes:
     [java] [webxmlmerge] Merged 2 servlet definitions into the descriptor
     [java]      [move] Moving 1 files to /home/rubys/jakarta/jakarta-cactus/samples/servlet/target-12/sample/target/cactus/cactustest/WEB-INF

     [java] cactus.war.merge.no:

     [java] cactus.war.merge:

     [java] cactus.compile:

     [java] cactus.copyclasses:

     [java] cactus.deploy.orion1x:

     [java] cactus.run.orion1x:

     [java] cactus.init:

     [java] cactus.check.weblogic6x:

     [java]      [echo] ******************************************************
     [java]      [echo] WARNING : The 'cactus.home.weblogic6x' property has not
     [java]      [echo] been set. No test will be run on that servlet engine.
     [java]      [echo] ******************************************************


     [java] cactus.setup.weblogic6x:

     [java] cactus.war:
     [java]     [unwar] Expanding: /home/rubys/jakarta/jakarta-cactus/samples/servlet/target-12/sample/target/sample-servlet.war into /home/rubys/jakarta/jakarta-cactus/samples/servlet/target-12/sample/target/cactus/cactustest

     [java] cactus.war.merge.check:

     [java] cactus.war.merge.yes:
     [java] [webxmlmerge] Merged 2 servlet definitions into the descriptor
     [java]      [move] Moving 1 files to /home/rubys/jakarta/jakarta-cactus/samples/servlet/target-12/sample/target/cactus/cactustest/WEB-INF

     [java] cactus.war.merge.no:

     [java] cactus.war.merge:

     [java] cactus.compile:

     [java] cactus.copyclasses:

     [java] cactus.deploy.weblogic6x:

     [java] cactus.run.weblogic6x:

     [java] cactus.check.weblogic7x:

     [java]      [echo] ******************************************************
     [java]      [echo] WARNING : The 'cactus.home.weblogic7x' property has not
     [java]      [echo] been set. No test will be run on that servlet engine.
     [java]      [echo] ******************************************************


     [java] cactus.init:

     [java] cactus.setup.weblogic7x:

     [java] cactus.war:
     [java]     [unwar] Expanding: /home/rubys/jakarta/jakarta-cactus/samples/servlet/target-12/sample/target/sample-servlet.war into /home/rubys/jakarta/jakarta-cactus/samples/servlet/target-12/sample/target/cactus/cactustest

     [java] cactus.war.merge.check:

     [java] cactus.war.merge.yes:
     [java] [webxmlmerge] Merged 2 servlet definitions into the descriptor
     [java]      [move] Moving 1 files to /home/rubys/jakarta/jakarta-cactus/samples/servlet/target-12/sample/target/cactus/cactustest/WEB-INF

     [java] cactus.war.merge.no:

     [java] cactus.war.merge:

     [java] cactus.compile:

     [java] cactus.copyclasses:

     [java] cactus.deploy.weblogic7x:

     [java] cactus.run.weblogic7x:

     [java] cactus.init:

     [java] cactus.check.tomcat3x:

     [java] cactus.setup.tomcat3x:
     [java]     [mkdir] Created dir: /home/rubys/jakarta/jakarta-cactus/samples/servlet/target-12/sample/target/cactus/tomcat3x/conf
     [java]     [mkdir] Created dir: /home/rubys/jakarta/jakarta-cactus/samples/servlet/target-12/sample/target/cactus/tomcat3x/work
     [java]     [mkdir] Created dir: /home/rubys/jakarta/jakarta-cactus/samples/servlet/target-12/sample/target/cactus/tomcat3x/webapps
     [java]      [copy] Copying 3 files to /home/rubys/jakarta/jakarta-cactus/samples/servlet/target-12/sample/target/cactus/tomcat3x/conf
     [java]      [copy] Replacing: @cactus.port@ -> 8082

     [java] cactus.war:
     [java]     [unwar] Expanding: /home/rubys/jakarta/jakarta-cactus/samples/servlet/target-12/sample/target/sample-servlet.war into /home/rubys/jakarta/jakarta-cactus/samples/servlet/target-12/sample/target/cactus/cactustest

     [java] cactus.war.merge.check:

     [java] cactus.war.merge.yes:
     [java] [webxmlmerge] Merged 2 servlet definitions into the descriptor
     [java]      [move] Moving 1 files to /home/rubys/jakarta/jakarta-cactus/samples/servlet/target-12/sample/target/cactus/cactustest/WEB-INF

     [java] cactus.war.merge.no:

     [java] cactus.war.merge:

     [java] cactus.compile:

     [java] cactus.copyclasses:

     [java] cactus.deploy.tomcat3x:
     [java]      [copy] Copying 46 files to /home/rubys/jakarta/jakarta-cactus/samples/servlet/target-12/sample/target/cactus/tomcat3x/webapps/cactustest

     [java] cactus.run.tomcat3x:

     [java] cactus.runservertests.task.tomcat3x:

     [java] cactus.runservertests.target.tomcat3x:

     [java] cactus.check.tomcat3x:

     [java] cactus.start.tomcat3x:
     [java]      [java] 1 [main] INFO SessionIdGenerator  - Opening /dev/urandom
     [java]      [java] 328 [main] INFO ServerXmlReader  - Config=$TOMCAT_HOME/conf/server.xml
     [java]      [java] 330 [main] INFO PathSetter  - install=/home/rubys/jakarta/jakarta-tomcat/build/tomcat
     [java]      [java] 331 [main] INFO PathSetter  - home=/home/rubys/jakarta/jakarta-cactus/samples/servlet/target-12/sample/target/cactus/tomcat3x
     [java]      [java] 335 [main] INFO AutoWebApp  - Auto-Adding DEFAULT:/cactustest
     [java]      [java] 349 [main] INFO ContextManager  - Tomcat configured and in stable state 
     [java]      [java] 358 [main] INFO WorkDirSetup  - Creating work dir /home/rubys/jakarta/jakarta-cactus/samples/servlet/target-12/sample/target/cactus/tomcat3x/work/DEFAULT/cactustest
     [java]      [java] 395 [main] INFO ContextManager  - Adding  DEFAULT:/cactustest
     [java]      [java] 398 [main] INFO Ctx(/cactustest)   - Validating web.xml
     [java]      [java] 445 [main] INFO xml.XmlMapper  - Can't find resource for entity: -//Sun Microsystems, Inc.//DTD Web Application 2.3//EN --> http://java.sun.com/dtd/web-app_2_3.dtd "null"
     [java]      [java] EmbededTomcat: Init time 2538
     [java]      [java] 1279 [main] INFO Http10Interceptor  - Starting on 8082
     [java]      [java] 1289 [main] INFO Ajp12Interceptor  - Starting on 8777
     [java]      [java] EmbededTomcat: Startup time 125

     [java] cactus.test:
     [java]      [copy] Copying 1 file to /home/rubys/jakarta/jakarta-cactus/samples/servlet/target-12/sample/target/cactus/conf
     [java]     [mkdir] Created dir: /home/rubys/jakarta/jakarta-cactus/samples/servlet/target-12/sample/target/cactus/test-cactus-reports

     [java] cactus.test.text:
     [java]     [junit] Running org.apache.cactus.sample.TestAll
     [java]     [junit] 0 [main] INFO httpclient.HttpMethod  - Redirect requested but followRedirects is disabled
     [java]      [java] 9163 [Thread-12] INFO Ctx(/cactustest)   - Compiling: /test/test.jsp to test.test_0
     [java]      [java] 11014 [Thread-9] INFO Ctx(/cactustest)   - Compiling: /jspRedirector.jsp to jspRedirector_0
     [java]     [junit] 2748 [main] WARN httpclient.HttpMethod  - Cookie rejected: "$Version=0; responsecookie=this is a response cookie; $Domain=jakarta.apache.org". Illegal domain attribute "jakarta.apache.org". Domain of origin: "localhost"
     [java]     [junit] Tests run: 69, Failures: 4, Errors: 0, Time elapsed: 8.225 sec
     [java]     [junit] Testsuite: org.apache.cactus.sample.TestAll
     [java]     [junit] Tests run: 69, Failures: 4, Errors: 0, Time elapsed: 8.225 sec
     [java]     [junit] ------------- Standard Error -----------------
     [java]     [junit] Unable to find scripting engine factory class com.meterware.httpunit.javascript.JavaScriptEngineFactory
     [java]     [junit] java.lang.ClassNotFoundException: com.meterware.httpunit.javascript.JavaScriptEngineFactory
     [java]     [junit] JavaScript execution disabled
     [java]     [junit] ------------- ---------------- ---------------

     [java]     [junit] Testcase: testLongProcess took 3.451 sec
     [java]     [junit] Testcase: testLotsOfData took 0.136 sec
     [java]     [junit] Testcase: testGlobalBeginEnd took 0.055 sec
     [java]     [junit] Testcase: testAssertionFailedError took 0.138 sec
     [java]     [junit] Testcase: testExceptionNotSerializable took 0.058 sec
     [java]     [junit] Testcase: testExceptionSerializable took 0.025 sec
     [java]     [junit] Testcase: testComparisonFailure took 0.022 sec
     [java]     [junit] Testcase: testSetUp took 0.039 sec
     [java]     [junit] Testcase: testTearDown took 0.017 sec
     [java]     [junit] Testcase: testSimulatedURLBasics took 0.031 sec
     [java]     [junit] Testcase: testSimulatedURL1 took 0.021 sec
     [java]     [junit] Testcase: testSimulatedURL2 took 0.019 sec
     [java]     [junit] Testcase: testSimulatedURL3 took 0.017 sec
     [java]     [junit] Testcase: testSimulatedURL4 took 0.032 sec
     [java]     [junit] Testcase: testSimulatedURL5 took 0.028 sec
     [java]     [junit] Testcase: testTearDown took 0.024 sec
     [java]     [junit] Testcase: testBasicAuthentication took 0.039 sec
     [java]     [junit] Testcase: testHttpUnitGetText took 0.122 sec
     [java]     [junit] Testcase: testResponseAddHeadersHttpUnit took 0.032 sec
     [java]     [junit] Testcase: testRedirectorOverride1 took 0.03 sec
     [java]     [junit] Testcase: testRedirectorOverride2 took 0.023 sec
     [java]     [junit] Testcase: testRedirectorOverride3 took 0.015 sec
     [java]     [junit] Testcase: testMultiValueParameters took 0.032 sec
     [java]     [junit] Testcase: testSeveralParameters took 0.105 sec
     [java]     [junit] Testcase: testNoAutomaticSessionCreation took 0.022 sec
     [java]     [junit] Testcase: testVerifyJsessionid took 0.027 sec
     [java]     [junit] Testcase: testCreateSessionCookie took 0.037 sec
     [java]     [junit] 	FAILED
     [java]     [junit] A session should have been created prior to this request
     [java]     [junit] junit.framework.AssertionFailedError: A session should have been created prior to this request
     [java]     [junit] 	at org.apache.cactus.sample.unit.TestHttpSession.testCreateSessionCookie(Unknown Source)
     [java]     [junit] 	at sun.reflect.NativeMethodAccessorImpl.invoke0(Native Method)
     [java]     [junit] 	at sun.reflect.NativeMethodAccessorImpl.invoke(NativeMethodAccessorImpl.java:39)
     [java]     [junit] 	at sun.reflect.DelegatingMethodAccessorImpl.invoke(DelegatingMethodAccessorImpl.java:25)
     [java]     [junit] 	at org.apache.cactus.AbstractWebServerTestCase.runServerTest(AbstractWebServerTestCase.java:179)
     [java]     [junit] 	at org.apache.cactus.AbstractWebServerTestCase.runBareServerTest(AbstractWebServerTestCase.java:137)
     [java]     [junit] 	at org.apache.cactus.server.AbstractWebTestCaller.doTest(AbstractWebTestCaller.java:157)
     [java]     [junit] 	at org.apache.cactus.server.AbstractWebTestController.handleRequest$ajcPostAround7(AbstractWebTestController.java;org/apache/cactus/util/log/LogAspect.aj(1k):130)
     [java]     [junit] 	at org.apache.cactus.server.AbstractWebTestController.handleRequest$ajcPostAround7$ajcVoidWrapper(AbstractWebTestController.java;org/apache/cactus/util/log/LogAspect.aj(1k))
     [java]     [junit] 	at org.apache.cactus.server.AbstractWebTestController.handleRequest(AbstractWebTestController.java;org/apache/cactus/util/log/LogAspect.aj(1k):1145)
     [java]     [junit] 	at org.apache.cactus.server.ServletTestRedirector.doPost$ajcPostAround10(ServletTestRedirector.java;org/apache/cactus/util/log/LogAspect.aj(1k):125)
     [java]     [junit] 	at org.apache.cactus.server.ServletTestRedirector.doPost$ajcPostAround10$ajcVoidWrapper(ServletTestRedirector.java;org/apache/cactus/util/log/LogAspect.aj(1k))
     [java]     [junit] 	at org.apache.cactus.server.ServletTestRedirector.doPost(ServletTestRedirector.java;org/apache/cactus/util/log/LogAspect.aj(1k):1145)
     [java]     [junit] 	at org.apache.cactus.server.ServletTestRedirector.doGet$ajcPostAround6(ServletTestRedirector.java;org/apache/cactus/util/log/LogAspect.aj(1k):96)
     [java]     [junit] 	at org.apache.cactus.server.ServletTestRedirector.doGet$ajcPostAround6$ajcVoidWrapper(ServletTestRedirector.java;org/apache/cactus/util/log/LogAspect.aj(1k))
     [java]     [junit] 	at org.apache.cactus.server.ServletTestRedirector.doGet(ServletTestRedirector.java;org/apache/cactus/util/log/LogAspect.aj(1k):1145)
     [java]     [junit] 	at javax.servlet.http.HttpServlet.service(HttpServlet.java)
     [java]     [junit] 	at javax.servlet.http.HttpServlet.service(HttpServlet.java)
     [java]     [junit] 	at org.apache.tomcat.facade.ServletHandler.doService(ServletHandler.java:570)
     [java]     [junit] 	at org.apache.tomcat.core.Handler.invoke(Handler.java:322)
     [java]     [junit] 	at org.apache.tomcat.core.Handler.service(Handler.java:235)
     [java]     [junit] 	at org.apache.tomcat.facade.ServletHandler.service(ServletHandler.java:481)
     [java]     [junit] 	at org.apache.tomcat.core.ContextManager.internalService(ContextManager.java:917)
     [java]     [junit] 	at org.apache.tomcat.core.ContextManager.service(ContextManager.java:833)
     [java]     [junit] 	at org.apache.tomcat.modules.server.Http10Interceptor.processConnection(Http10Interceptor.java:176)
     [java]     [junit] 	at org.apache.tomcat.util.net.TcpWorkerThread.runIt(PoolTcpEndpoint.java:565)
     [java]     [junit] 	at org.apache.tomcat.util.threads.ThreadPool$ControlRunnable.run(ThreadPool.java:619)
     [java]     [junit] 	at java.lang.Thread.run(Thread.java:536)

     [java]     [junit] Testcase: testCreateSessionCookieTestcase: testWriteOutputStream took 0.036 sec
     [java]     [junit] Testcase: testGetResponseAsStringMultiLines took 0.015 sec
     [java]     [junit] Testcase: testGetResponseAsStringArrayMultiLines took 0.017 sec
     [java]     [junit] Testcase: testGetReader took 0.018 sec
     [java]     [junit] Testcase: testSetContentType took 0.02 sec
     [java]     [junit] Testcase: testRedirect took 0.065 sec
     [java]     [junit] Testcase: testStatusCode took 0.018 sec
     [java]     [junit] Testcase: testCookieEncoding took 0.045 sec
     [java]     [junit] 	FAILED
     [java]     [junit] No cookie named 'testcookie' found
     [java]     [junit] junit.framework.AssertionFailedError: No cookie named 'testcookie' found
     [java]     [junit] 	at org.apache.cactus.sample.unit.TestCookie.testCookieEncoding(Unknown Source)
     [java]     [junit] 	at sun.reflect.NativeMethodAccessorImpl.invoke0(Native Method)
     [java]     [junit] 	at sun.reflect.NativeMethodAccessorImpl.invoke(NativeMethodAccessorImpl.java:39)
     [java]     [junit] 	at sun.reflect.DelegatingMethodAccessorImpl.invoke(DelegatingMethodAccessorImpl.java:25)
     [java]     [junit] 	at org.apache.cactus.AbstractWebServerTestCase.runServerTest(AbstractWebServerTestCase.java:179)
     [java]     [junit] 	at org.apache.cactus.AbstractWebServerTestCase.runBareServerTest(AbstractWebServerTestCase.java:137)
     [java]     [junit] 	at org.apache.cactus.server.AbstractWebTestCaller.doTest(AbstractWebTestCaller.java:157)
     [java]     [junit] 	at org.apache.cactus.server.AbstractWebTestController.handleRequest$ajcPostAround7(AbstractWebTestController.java;org/apache/cactus/util/log/LogAspect.aj(1k):130)
     [java]     [junit] 	at org.apache.cactus.server.AbstractWebTestController.handleRequest$ajcPostAround7$ajcVoidWrapper(AbstractWebTestController.java;org/apache/cactus/util/log/LogAspect.aj(1k))
     [java]     [junit] 	at org.apache.cactus.server.AbstractWebTestController.handleRequest(AbstractWebTestController.java;org/apache/cactus/util/log/LogAspect.aj(1k):1145)
     [java]     [junit] 	at org.apache.cactus.server.ServletTestRedirector.doPost$ajcPostAround10(ServletTestRedirector.java;org/apache/cactus/util/log/LogAspect.aj(1k):125)
     [java]     [junit] 	at org.apache.cactus.server.ServletTestRedirector.doPost$ajcPostAround10$ajcVoidWrapper(ServletTestRedirector.java;org/apache/cactus/util/log/LogAspect.aj(1k))
     [java]     [junit] 	at org.apache.cactus.server.ServletTestRedirector.doPost(ServletTestRedirector.java;org/apache/cactus/util/log/LogAspect.aj(1k):1145)
     [java]     [junit] 	at org.apache.cactus.server.ServletTestRedirector.doGet$ajcPostAround6(ServletTestRedirector.java;org/apache/cactus/util/log/LogAspect.aj(1k):96)
     [java]     [junit] 	at org.apache.cactus.server.ServletTestRedirector.doGet$ajcPostAround6$ajcVoidWrapper(ServletTestRedirector.java;org/apache/cactus/util/log/LogAspect.aj(1k))
     [java]     [junit] 	at org.apache.cactus.server.ServletTestRedirector.doGet(ServletTestRedirector.java;org/apache/cactus/util/log/LogAspect.aj(1k):1145)
     [java]     [junit] 	at javax.servlet.http.HttpServlet.service(HttpServlet.java)
     [java]     [junit] 	at javax.servlet.http.HttpServlet.service(HttpServlet.java)
     [java]     [junit] 	at org.apache.tomcat.facade.ServletHandler.doService(ServletHandler.java:570)
     [java]     [junit] 	at org.apache.tomcat.core.Handler.invoke(Handler.java:322)
     [java]     [junit] 	at org.apache.tomcat.core.Handler.service(Handler.java:235)
     [java]     [junit] 	at org.apache.tomcat.facade.ServletHandler.service(ServletHandler.java:481)
     [java]     [junit] 	at org.apache.tomcat.core.ContextManager.internalService(ContextManager.java:917)
     [java]     [junit] 	at org.apache.tomcat.core.ContextManager.service(ContextManager.java:833)
     [java]     [junit] 	at org.apache.tomcat.modules.server.Http10Interceptor.processConnection(Http10Interceptor.java:176)
     [java]     [junit] 	at org.apache.tomcat.util.net.TcpWorkerThread.runIt(PoolTcpEndpoint.java:565)
     [java]     [junit] 	at org.apache.tomcat.util.threads.ThreadPool$ControlRunnable.run(ThreadPool.java:619)
     [java]     [junit] 	at java.lang.Thread.run(Thread.java:536)

     [java]     [junit] Testcase: testCookieEncodingTestcase: testGetRequestDispatcherFromNamedDispatcherOK took 1.549 sec
     [java]     [junit] Testcase: testGetRequestDispatcherFromNamedDispatcherInvalid took 0.017 sec
     [java]     [junit] Testcase: testGetRequestDispatcherFromRequest1 took 0.025 sec
     [java]     [junit] Testcase: testGetRequestDispatcherFromRequest2 took 0.013 sec
     [java]     [junit] Testcase: testSendMultivaluedHeader took 0.019 sec
     [java]     [junit] Testcase: testSetContentTypeHeader took 0.063 sec
     [java]     [junit] Testcase: testResponseAddHeaders took 0.018 sec
     [java]     [junit] Testcase: testGetPathTranslated took 0.039 sec
     [java]     [junit] Testcase: testSendUserData took 0.015 sec
     [java]     [junit] Testcase: testRemoteClientCheck took 0.013 sec
     [java]     [junit] Testcase: testSetConfigParameter took 0.024 sec
     [java]     [junit] Testcase: testGetServletName took 0.018 sec
     [java]     [junit] Testcase: testGetLogs took 0.069 sec
     [java]     [junit] Testcase: testXXX took 0.016 sec
     [java]     [junit] Testcase: testOut took 0.596 sec
     [java]     [junit] Testcase: testReadServletOutputStream took 0.019 sec
     [java]     [junit] Testcase: testPostMethod took 0.022 sec
     [java]     [junit] Testcase: testGetMethod took 0.012 sec
     [java]     [junit] Testcase: testSetAttribute took 0.014 sec
     [java]     [junit] Testcase: testSetRequestAttribute took 0.012 sec
     [java]     [junit] Testcase: testSendParams took 0.015 sec
     [java]     [junit] Testcase: testSendHeader took 0.013 sec
     [java]     [junit] Testcase: testSendCookie took 0.016 sec
     [java]     [junit] 	FAILED
     [java]     [junit] Cannot find [testcookie] cookie in request
     [java]     [junit] junit.framework.AssertionFailedError: Cannot find [testcookie] cookie in request
     [java]     [junit] 	at org.apache.cactus.sample.TestSampleServlet.testSendCookie(Unknown Source)
     [java]     [junit] 	at sun.reflect.NativeMethodAccessorImpl.invoke0(Native Method)
     [java]     [junit] 	at sun.reflect.NativeMethodAccessorImpl.invoke(NativeMethodAccessorImpl.java:39)
     [java]     [junit] 	at sun.reflect.DelegatingMethodAccessorImpl.invoke(DelegatingMethodAccessorImpl.java:25)
     [java]     [junit] 	at org.apache.cactus.AbstractWebServerTestCase.runServerTest(AbstractWebServerTestCase.java:179)
     [java]     [junit] 	at org.apache.cactus.AbstractWebServerTestCase.runBareServerTest(AbstractWebServerTestCase.java:137)
     [java]     [junit] 	at org.apache.cactus.server.AbstractWebTestCaller.doTest(AbstractWebTestCaller.java:157)
     [java]     [junit] 	at org.apache.cactus.server.AbstractWebTestController.handleRequest$ajcPostAround7(AbstractWebTestController.java;org/apache/cactus/util/log/LogAspect.aj(1k):130)
     [java]     [junit] 	at org.apache.cactus.server.AbstractWebTestController.handleRequest$ajcPostAround7$ajcVoidWrapper(AbstractWebTestController.java;org/apache/cactus/util/log/LogAspect.aj(1k))
     [java]     [junit] 	at org.apache.cactus.server.AbstractWebTestController.handleRequest(AbstractWebTestController.java;org/apache/cactus/util/log/LogAspect.aj(1k):1145)
     [java]     [junit] 	at org.apache.cactus.server.ServletTestRedirector.doPost$ajcPostAround10(ServletTestRedirector.java;org/apache/cactus/util/log/LogAspect.aj(1k):125)
     [java]     [junit] 	at org.apache.cactus.server.ServletTestRedirector.doPost$ajcPostAround10$ajcVoidWrapper(ServletTestRedirector.java;org/apache/cactus/util/log/LogAspect.aj(1k))
     [java]     [junit] 	at org.apache.cactus.server.ServletTestRedirector.doPost(ServletTestRedirector.java;org/apache/cactus/util/log/LogAspect.aj(1k):1145)
     [java]     [junit] 	at org.apache.cactus.server.ServletTestRedirector.doGet$ajcPostAround6(ServletTestRedirector.java;org/apache/cactus/util/log/LogAspect.aj(1k):96)
     [java]     [junit] 	at org.apache.cactus.server.ServletTestRedirector.doGet$ajcPostAround6$ajcVoidWrapper(ServletTestRedirector.java;org/apache/cactus/util/log/LogAspect.aj(1k))
     [java]     [junit] 	at org.apache.cactus.server.ServletTestRedirector.doGet(ServletTestRedirector.java;org/apache/cactus/util/log/LogAspect.aj(1k):1145)
     [java]     [junit] 	at javax.servlet.http.HttpServlet.service(HttpServlet.java)
     [java]     [junit] 	at javax.servlet.http.HttpServlet.service(HttpServlet.java)
     [java]     [junit] 	at org.apache.tomcat.facade.ServletHandler.doService(ServletHandler.java:570)
     [java]     [junit] 	at org.apache.tomcat.core.Handler.invoke(Handler.java:322)
     [java]     [junit] 	at org.apache.tomcat.core.Handler.service(Handler.java:235)
     [java]     [junit] 	at org.apache.tomcat.facade.ServletHandler.service(ServletHandler.java:481)
     [java]     [junit] 	at org.apache.tomcat.core.ContextManager.internalService(ContextManager.java:917)
     [java]     [junit] 	at org.apache.tomcat.core.ContextManager.service(ContextManager.java:833)
     [java]     [junit] 	at org.apache.tomcat.modules.server.Http10Interceptor.processConnection(Http10Interceptor.java:176)
     [java]     [junit] 	at org.apache.tomcat.util.net.TcpWorkerThread.runIt(PoolTcpEndpoint.java:565)
     [java]     [junit] 	at org.apache.tomcat.util.threads.ThreadPool$ControlRunnable.run(ThreadPool.java:619)
     [java]     [junit] 	at java.lang.Thread.run(Thread.java:536)

     [java]     [junit] Testcase: testSendCookieTestcase: testSendMultipleCookies took 0.019 sec
     [java]     [junit] 	FAILED
     [java]     [junit] null
     [java]     [junit] junit.framework.AssertionFailedError
     [java]     [junit] 	at org.apache.cactus.sample.TestSampleServlet.testSendMultipleCookies(Unknown Source)
     [java]     [junit] 	at sun.reflect.NativeMethodAccessorImpl.invoke0(Native Method)
     [java]     [junit] 	at sun.reflect.NativeMethodAccessorImpl.invoke(NativeMethodAccessorImpl.java:39)
     [java]     [junit] 	at sun.reflect.DelegatingMethodAccessorImpl.invoke(DelegatingMethodAccessorImpl.java:25)
     [java]     [junit] 	at org.apache.cactus.AbstractWebServerTestCase.runServerTest(AbstractWebServerTestCase.java:179)
     [java]     [junit] 	at org.apache.cactus.AbstractWebServerTestCase.runBareServerTest(AbstractWebServerTestCase.java:137)
     [java]     [junit] 	at org.apache.cactus.server.AbstractWebTestCaller.doTest(AbstractWebTestCaller.java:157)
     [java]     [junit] 	at org.apache.cactus.server.AbstractWebTestController.handleRequest$ajcPostAround7(AbstractWebTestController.java;org/apache/cactus/util/log/LogAspect.aj(1k):130)
     [java]     [junit] 	at org.apache.cactus.server.AbstractWebTestController.handleRequest$ajcPostAround7$ajcVoidWrapper(AbstractWebTestController.java;org/apache/cactus/util/log/LogAspect.aj(1k))
     [java]     [junit] 	at org.apache.cactus.server.AbstractWebTestController.handleRequest(AbstractWebTestController.java;org/apache/cactus/util/log/LogAspect.aj(1k):1145)
     [java]     [junit] 	at org.apache.cactus.server.ServletTestRedirector.doPost$ajcPostAround10(ServletTestRedirector.java;org/apache/cactus/util/log/LogAspect.aj(1k):125)
     [java]     [junit] 	at org.apache.cactus.server.ServletTestRedirector.doPost$ajcPostAround10$ajcVoidWrapper(ServletTestRedirector.java;org/apache/cactus/util/log/LogAspect.aj(1k))
     [java]     [junit] 	at org.apache.cactus.server.ServletTestRedirector.doPost(ServletTestRedirector.java;org/apache/cactus/util/log/LogAspect.aj(1k):1145)
     [java]     [junit] 	at org.apache.cactus.server.ServletTestRedirector.doGet$ajcPostAround6(ServletTestRedirector.java;org/apache/cactus/util/log/LogAspect.aj(1k):96)
     [java]     [junit] 	at org.apache.cactus.server.ServletTestRedirector.doGet$ajcPostAround6$ajcVoidWrapper(ServletTestRedirector.java;org/apache/cactus/util/log/LogAspect.aj(1k))
     [java]     [junit] 	at org.apache.cactus.server.ServletTestRedirector.doGet(ServletTestRedirector.java;org/apache/cactus/util/log/LogAspect.aj(1k):1145)
     [java]     [junit] 	at javax.servlet.http.HttpServlet.service(HttpServlet.java)
     [java]     [junit] 	at javax.servlet.http.HttpServlet.service(HttpServlet.java)
     [java]     [junit] 	at org.apache.tomcat.facade.ServletHandler.doService(ServletHandler.java:570)
     [java]     [junit] 	at org.apache.tomcat.core.Handler.invoke(Handler.java:322)
     [java]     [junit] 	at org.apache.tomcat.core.Handler.service(Handler.java:235)
     [java]     [junit] 	at org.apache.tomcat.facade.ServletHandler.service(ServletHandler.java:481)
     [java]     [junit] 	at org.apache.tomcat.core.ContextManager.internalService(ContextManager.java:917)
     [java]     [junit] 	at org.apache.tomcat.core.ContextManager.service(ContextManager.java:833)
     [java]     [junit] 	at org.apache.tomcat.modules.server.Http10Interceptor.processConnection(Http10Interceptor.java:176)
     [java]     [junit] 	at org.apache.tomcat.util.net.TcpWorkerThread.runIt(PoolTcpEndpoint.java:565)
     [java]     [junit] 	at org.apache.tomcat.util.threads.ThreadPool$ControlRunnable.run(ThreadPool.java:619)
     [java]     [junit] 	at java.lang.Thread.run(Thread.java:536)

     [java]     [junit] Testcase: testSendMultipleCookiesTestcase: testReceiveHeader took 0.013 sec
     [java]     [junit] Testcase: testReceiveCookie took 0.023 sec
     [java]     [junit] Testcase: testRequestDispatcherForward took 0.015 sec
     [java]     [junit] Testcase: testRequestDispatcherInclude took 0.013 sec
     [java]     [junit] Testcase: testServletConfig took 0.019 sec
     [java]     [junit] Testcase: testDoStartTag took 0.089 sec
     [java]     [junit] Testcase: testDoStartTagInclude took 0.023 sec
     [java]     [junit] Testcase: testDoEndTagContinue took 0.016 sec
     [java]     [junit] Testcase: testDoEndTagStop took 0.016 sec
     [java]     [junit] Testcase: testReplacement took 0.027 sec
     [java]     [junit] TEST org.apache.cactus.sample.TestAll FAILED

     [java] cactus.test.check.result:

     [java] cactus.check.tomcat3x:

     [java] cactus.stop.tomcat3x:
     [java]      [java] Stopping Tomcat.
     [java]      [java] Stopping tomcat on :8777 null
     [java]      [java] Stop reaper 
     [java]      [java] 13162 [Thread-17] INFO ContextManager  - Exiting
     [java]      [java] 13167 [Thread-8] ERROR net.PoolTcpEndpoint  - Caught exception trying to unlock accept.
     [java]      [java] java.net.ConnectException: Connection refused
     [java]      [java] 	at java.net.PlainSocketImpl.socketConnect(Native Method)
     [java]      [java] 	at java.net.PlainSocketImpl.doConnect(PlainSocketImpl.java:305)
     [java]      [java] 	at java.net.PlainSocketImpl.connectToAddress(PlainSocketImpl.java:171)
     [java]      [java] 	at java.net.PlainSocketImpl.connect(PlainSocketImpl.java:158)
     [java]      [java] 	at java.net.Socket.connect(Socket.java:426)
     [java]      [java] 	at java.net.Socket.connect(Socket.java:376)
     [java]      [java] 	at java.net.Socket.<init>(Socket.java:291)
     [java]      [java] 	at java.net.Socket.<init>(Socket.java:119)
     [java]      [java] 	at org.apache.tomcat.util.net.PoolTcpEndpoint.closeServerSocket(PoolTcpEndpoint.java:326)
     [java]      [java] 	at org.apache.tomcat.util.net.PoolTcpEndpoint.acceptSocket(PoolTcpEndpoint.java:397)
     [java]      [java] 	at org.apache.tomcat.util.net.TcpWorkerThread.runIt(PoolTcpEndpoint.java:529)
     [java]      [java] 	at org.apache.tomcat.util.threads.ThreadPool$ControlRunnable.run(ThreadPool.java:619)
     [java]      [java] 	at java.lang.Thread.run(Thread.java:536)
     [java]      [java] 13170 [Thread-8] ERROR net.PoolTcpEndpoint  - Caught exception trying to close socket.
     [java]      [java] java.lang.NullPointerException
     [java]      [java] 	at org.apache.tomcat.util.net.PoolTcpEndpoint.closeServerSocket(PoolTcpEndpoint.java:338)
     [java]      [java] 	at org.apache.tomcat.util.net.PoolTcpEndpoint.acceptSocket(PoolTcpEndpoint.java:397)
     [java]      [java] 	at org.apache.tomcat.util.net.TcpWorkerThread.runIt(PoolTcpEndpoint.java:529)
     [java]      [java] 	at org.apache.tomcat.util.threads.ThreadPool$ControlRunnable.run(ThreadPool.java:619)
     [java]      [java] 	at java.lang.Thread.run(Thread.java:536)
     [java]      [java] 13171 [Thread-8] WARN net.PoolTcpEndpoint  - Reinitializing ServerSocket
     [java]      [java] 13172 [Thread-16] ERROR net.PoolTcpEndpoint  - Caught exception trying to unlock accept.
     [java]      [java] java.net.ConnectException: Connection refused
     [java]      [java] 	at java.net.PlainSocketImpl.socketConnect(Native Method)
     [java]      [java] 	at java.net.PlainSocketImpl.doConnect(PlainSocketImpl.java:305)
     [java]      [java] 	at java.net.PlainSocketImpl.connectToAddress(PlainSocketImpl.java:171)
     [java]      [java] 	at java.net.PlainSocketImpl.connect(PlainSocketImpl.java:158)
     [java]      [java] 	at java.net.Socket.connect(Socket.java:426)
     [java]      [java] 	at java.net.Socket.connect(Socket.java:376)
     [java]      [java] 	at java.net.Socket.<init>(Socket.java:291)
     [java]      [java] 	at java.net.Socket.<init>(Socket.java:119)
     [java]      [java] 	at org.apache.tomcat.util.net.PoolTcpEndpoint.closeServerSocket(PoolTcpEndpoint.java:326)
     [java]      [java] 	at org.apache.tomcat.util.net.PoolTcpEndpoint.acceptSocket(PoolTcpEndpoint.java:397)
     [java]      [java] 	at org.apache.tomcat.util.net.TcpWorkerThread.runIt(PoolTcpEndpoint.java:529)
     [java]      [java] 	at org.apache.tomcat.util.threads.ThreadPool$ControlRunnable.run(ThreadPool.java:619)
     [java]      [java] 	at java.lang.Thread.run(Thread.java:536)
     [java]      [java] 13172 [Thread-16] ERROR net.PoolTcpEndpoint  - Caught exception trying to close socket.
     [java]      [java] java.lang.NullPointerException
     [java]      [java] 	at org.apache.tomcat.util.net.PoolTcpEndpoint.closeServerSocket(PoolTcpEndpoint.java:338)
     [java]      [java] 	at org.apache.tomcat.util.net.PoolTcpEndpoint.acceptSocket(PoolTcpEndpoint.java:397)
     [java]      [java] 	at org.apache.tomcat.util.net.TcpWorkerThread.runIt(PoolTcpEndpoint.java:529)
     [java]      [java] 	at org.apache.tomcat.util.threads.ThreadPool$ControlRunnable.run(ThreadPool.java:619)
     [java]      [java] 	at java.lang.Thread.run(Thread.java:536)
     [java]      [java] 13187 [Thread-16] WARN net.PoolTcpEndpoint  - Reinitializing ServerSocket

     [java] BUILD FAILED
     [java] /home/rubys/jakarta/jakarta-cactus/samples/servlet/target-12/sample/build/cactus-integration-ant/scripts/build-share.xml:285: There were test failures

     [java] Total time: 28 seconds

BUILD FAILED
/home/rubys/jakarta/jakarta-cactus/samples/servlet/build.xml:313: Java returned: 1

Total time: 38 seconds

---------------------------------------------------------------------
To unsubscribe, e-mail: cactus-dev-unsubscribe@jakarta.apache.org
For additional commands, e-mail: cactus-dev-help@jakarta.apache.org