You are viewing a plain text version of this content. The canonical link for it is here.
Posted to notifications@qpid.apache.org by Apache Jenkins Server <je...@builds.apache.org> on 2024/01/01 05:45:34 UTC
Build failed in Jenkins: Qpid » Qpid-Broker-J-7.1.x-TestMatrix » JDK 1.8 (latest),java-mms.1-0 #48
See <https://ci-builds.apache.org/job/Qpid/job/Qpid-Broker-J-7.1.x-TestMatrix/jdk=JDK%201.8%20(latest),profile=java-mms.1-0/48/display/redirect>
Changes:
------------------------------------------
[...truncated 756.64 KB...]
[INFO] --- enforcer:3.0.0-M2:enforce (enforce-versions-standard-properties) @ qpid-java-doc ---
[INFO]
[INFO] --- enforcer:3.0.0-M2:enforce (enforce-enableAmqp0x) @ qpid-java-doc ---
[INFO]
[INFO] --- jacoco:0.8.2:prepare-agent (default-prepare-agent) @ qpid-java-doc ---
[INFO] argLine set to "-javaagent:/home/jenkins/.m2/repository/org/jacoco/org.jacoco.agent/0.8.2/org.jacoco.agent-0.8.2-runtime.jar=destfile=<https://ci-builds.apache.org/job/Qpid/job/Qpid-Broker-J-7.1.x-TestMatrix/jdk=JDK%201.8%20(latest),profile=java-mms.1-0/ws/doc/target/jacoco.exec"> -Xmx512m
[INFO]
[INFO] --- remote-resources:1.5:process (process-resource-bundles) @ qpid-java-doc ---
[INFO]
[INFO] --- site:3.7.1:attach-descriptor (attach-descriptor) @ qpid-java-doc ---
[INFO] No site descriptor found: nothing to attach.
[INFO]
[INFO] --- assembly:3.0.0:single (default) @ qpid-java-doc ---
[INFO] Assemblies have been skipped per configuration of the skipAssembly parameter.
[INFO]
[INFO] ----------------< org.apache.qpid:qpid-java-doc-broker >----------------
[INFO] Building Apache Qpid Broker-J Docbook 7.1.13-SNAPSHOT [47/48]
[INFO] from doc/java-broker/pom.xml
[INFO] --------------------------------[ jar ]---------------------------------
[INFO]
[INFO] --- clean:3.1.0:clean (default-clean) @ qpid-java-doc-broker ---
[INFO]
[INFO] --- buildnumber:1.4:create (default) @ qpid-java-doc-broker ---
[INFO] Executing: /bin/sh -c cd '<https://ci-builds.apache.org/job/Qpid/job/Qpid-Broker-J-7.1.x-TestMatrix/jdk=JDK%201.8%20(latest),profile=java-mms.1-0/ws/doc/java-broker'> && 'git' 'rev-parse' '--verify' 'HEAD'
[INFO] Working directory: <https://ci-builds.apache.org/job/Qpid/job/Qpid-Broker-J-7.1.x-TestMatrix/jdk=JDK%201.8%20(latest),profile=java-mms.1-0/ws/doc/java-broker>
[INFO] Storing buildNumber: ae4b01187a9748e2c705f0dd24b62cb6022dcd05 at timestamp: 1704087912637
[WARNING] Cannot get the branch information from the git repository:
Detecting the current branch failed: fatal: ref HEAD is not a symbolic ref
[INFO] Executing: /bin/sh -c cd '<https://ci-builds.apache.org/job/Qpid/job/Qpid-Broker-J-7.1.x-TestMatrix/jdk=JDK%201.8%20(latest),profile=java-mms.1-0/ws/doc/java-broker'> && 'git' 'rev-parse' '--verify' 'HEAD'
[INFO] Working directory: <https://ci-builds.apache.org/job/Qpid/job/Qpid-Broker-J-7.1.x-TestMatrix/jdk=JDK%201.8%20(latest),profile=java-mms.1-0/ws/doc/java-broker>
[INFO] Storing buildScmBranch: UNKNOWN
[INFO]
[INFO] --- antrun:1.8:run (output-test-properties) @ qpid-java-doc-broker ---
[INFO] Executing tasks
main:
[echo] Qpid Test Profile Properties
[echo] [profile] java-mms.1-0
[echo] [profile.broker.version] 1.0
[echo] [profile.virtualhostnode.type] Memory
[echo] [profile.virtualhostnode.context.blueprint] {"type":"ProvidedStore","globalAddressDomains":"${qpid.globalAddressDomains}"}
[echo] [profile.test_receive_timeout] 3000
[INFO] Executed tasks
[INFO]
[INFO] --- enforcer:3.0.0-M2:enforce (enforce-maven-version) @ qpid-java-doc-broker ---
[INFO]
[INFO] --- enforcer:3.0.0-M2:enforce (enforce-minimum-versions) @ qpid-java-doc-broker ---
[INFO]
[INFO] --- enforcer:3.0.0-M2:enforce (enforce-versions-standard-properties) @ qpid-java-doc-broker ---
[INFO]
[INFO] --- enforcer:3.0.0-M2:enforce (enforce-enableAmqp0x) @ qpid-java-doc-broker ---
[INFO]
[INFO] --- jacoco:0.8.2:prepare-agent (default-prepare-agent) @ qpid-java-doc-broker ---
[INFO] argLine set to "-javaagent:/home/jenkins/.m2/repository/org/jacoco/org.jacoco.agent/0.8.2/org.jacoco.agent-0.8.2-runtime.jar=destfile=<https://ci-builds.apache.org/job/Qpid/job/Qpid-Broker-J-7.1.x-TestMatrix/jdk=JDK%201.8%20(latest),profile=java-mms.1-0/ws/doc/java-broker/target/jacoco.exec"> -Xmx512m
[INFO]
[INFO] --- resources:3.1.0:copy-resources (filter-docbook-sources) @ qpid-java-doc-broker ---
[INFO] Using 'UTF-8' encoding to copy filtered resources.
[INFO] Copying 77 resources
[INFO]
[INFO] --- remote-resources:1.5:process (process-resource-bundles) @ qpid-java-doc-broker ---
[INFO]
[INFO] --- resources:3.1.0:resources (default-resources) @ qpid-java-doc-broker ---
[WARNING] Parameter 'resources' is read-only, must not be used in configuration
[INFO] Using 'UTF-8' encoding to copy filtered resources.
[INFO] Copying 77 resources
[INFO]
[INFO] --- compiler:3.7.0:compile (default-compile) @ qpid-java-doc-broker ---
[INFO] No sources to compile
[INFO]
[INFO] --- resources:3.1.0:testResources (default-testResources) @ qpid-java-doc-broker ---
[INFO] Using 'UTF-8' encoding to copy filtered resources.
[INFO] Copying 77 resources
[INFO]
[INFO] --- compiler:3.7.0:testCompile (default-testCompile) @ qpid-java-doc-broker ---
[INFO] No sources to compile
[INFO]
[INFO] --- surefire:2.22.0:test (default-test) @ qpid-java-doc-broker ---
[INFO] No tests to run.
[INFO] No tests to run.
[INFO]
[INFO] --- jar:3.1.0:jar (default-jar) @ qpid-java-doc-broker ---
[WARNING] JAR will be empty - no content was marked for inclusion!
[INFO] Building jar: <https://ci-builds.apache.org/job/Qpid/job/Qpid-Broker-J-7.1.x-TestMatrix/jdk=JDK%201.8%20(latest),profile=java-mms.1-0/ws/doc/java-broker/target/qpid-java-doc-broker-7.1.13-SNAPSHOT.jar>
[INFO]
[INFO] --- site:3.7.1:attach-descriptor (attach-descriptor) @ qpid-java-doc-broker ---
[INFO] Skipping because packaging 'jar' is not pom.
[INFO]
[INFO] --- assembly:3.0.0:single (default) @ qpid-java-doc-broker ---
[INFO] Assemblies have been skipped per configuration of the skipAssembly parameter.
[INFO]
[INFO] --------------< org.apache.qpid:qpid-java-doc-perftests >---------------
[INFO] Building Apache Qpid Broker-J Performance Test Docbook 7.1.13-SNAPSHOT [48/48]
[INFO] from doc/java-perftests/pom.xml
[INFO] --------------------------------[ jar ]---------------------------------
[INFO]
[INFO] --- clean:3.1.0:clean (default-clean) @ qpid-java-doc-perftests ---
[INFO]
[INFO] --- buildnumber:1.4:create (default) @ qpid-java-doc-perftests ---
[INFO] Executing: /bin/sh -c cd '<https://ci-builds.apache.org/job/Qpid/job/Qpid-Broker-J-7.1.x-TestMatrix/jdk=JDK%201.8%20(latest),profile=java-mms.1-0/ws/doc/java-perftests'> && 'git' 'rev-parse' '--verify' 'HEAD'
[INFO] Working directory: <https://ci-builds.apache.org/job/Qpid/job/Qpid-Broker-J-7.1.x-TestMatrix/jdk=JDK%201.8%20(latest),profile=java-mms.1-0/ws/doc/java-perftests>
[INFO] Storing buildNumber: ae4b01187a9748e2c705f0dd24b62cb6022dcd05 at timestamp: 1704087913643
[WARNING] Cannot get the branch information from the git repository:
Detecting the current branch failed: fatal: ref HEAD is not a symbolic ref
[INFO] Executing: /bin/sh -c cd '<https://ci-builds.apache.org/job/Qpid/job/Qpid-Broker-J-7.1.x-TestMatrix/jdk=JDK%201.8%20(latest),profile=java-mms.1-0/ws/doc/java-perftests'> && 'git' 'rev-parse' '--verify' 'HEAD'
[INFO] Working directory: <https://ci-builds.apache.org/job/Qpid/job/Qpid-Broker-J-7.1.x-TestMatrix/jdk=JDK%201.8%20(latest),profile=java-mms.1-0/ws/doc/java-perftests>
[INFO] Storing buildScmBranch: UNKNOWN
[INFO]
[INFO] --- antrun:1.8:run (output-test-properties) @ qpid-java-doc-perftests ---
[INFO] Executing tasks
main:
[echo] Qpid Test Profile Properties
[echo] [profile] java-mms.1-0
[echo] [profile.broker.version] 1.0
[echo] [profile.virtualhostnode.type] Memory
[echo] [profile.virtualhostnode.context.blueprint] {"type":"ProvidedStore","globalAddressDomains":"${qpid.globalAddressDomains}"}
[echo] [profile.test_receive_timeout] 3000
[INFO] Executed tasks
[INFO]
[INFO] --- enforcer:3.0.0-M2:enforce (enforce-maven-version) @ qpid-java-doc-perftests ---
[INFO]
[INFO] --- enforcer:3.0.0-M2:enforce (enforce-minimum-versions) @ qpid-java-doc-perftests ---
[INFO]
[INFO] --- enforcer:3.0.0-M2:enforce (enforce-versions-standard-properties) @ qpid-java-doc-perftests ---
[INFO]
[INFO] --- enforcer:3.0.0-M2:enforce (enforce-enableAmqp0x) @ qpid-java-doc-perftests ---
[INFO]
[INFO] --- jacoco:0.8.2:prepare-agent (default-prepare-agent) @ qpid-java-doc-perftests ---
[INFO] argLine set to "-javaagent:/home/jenkins/.m2/repository/org/jacoco/org.jacoco.agent/0.8.2/org.jacoco.agent-0.8.2-runtime.jar=destfile=<https://ci-builds.apache.org/job/Qpid/job/Qpid-Broker-J-7.1.x-TestMatrix/jdk=JDK%201.8%20(latest),profile=java-mms.1-0/ws/doc/java-perftests/target/jacoco.exec"> -Xmx512m
[INFO]
[INFO] --- resources:3.1.0:copy-resources (filter-docbook-sources) @ qpid-java-doc-perftests ---
[INFO] Using 'UTF-8' encoding to copy filtered resources.
[INFO] Copying 1 resource
[INFO]
[INFO] --- remote-resources:1.5:process (process-resource-bundles) @ qpid-java-doc-perftests ---
[INFO]
[INFO] --- resources:3.1.0:resources (default-resources) @ qpid-java-doc-perftests ---
[WARNING] Parameter 'resources' is read-only, must not be used in configuration
[INFO] Using 'UTF-8' encoding to copy filtered resources.
[INFO] Copying 1 resource
[INFO]
[INFO] --- compiler:3.7.0:compile (default-compile) @ qpid-java-doc-perftests ---
[INFO] Loaded from the build cache
[INFO]
[INFO] --- resources:3.1.0:testResources (default-testResources) @ qpid-java-doc-perftests ---
[INFO] Using 'UTF-8' encoding to copy filtered resources.
[INFO] Copying 1 resource
[INFO]
[INFO] --- compiler:3.7.0:testCompile (default-testCompile) @ qpid-java-doc-perftests ---
[INFO] Loaded from the build cache
[INFO]
[INFO] --- surefire:2.22.0:test (default-test) @ qpid-java-doc-perftests ---
[INFO] No tests to run.
[INFO] Loaded from the build cache
[INFO]
[INFO] --- jar:3.1.0:jar (default-jar) @ qpid-java-doc-perftests ---
[WARNING] JAR will be empty - no content was marked for inclusion!
[INFO] Building jar: <https://ci-builds.apache.org/job/Qpid/job/Qpid-Broker-J-7.1.x-TestMatrix/jdk=JDK%201.8%20(latest),profile=java-mms.1-0/ws/doc/java-perftests/target/qpid-java-doc-perftests-7.1.13-SNAPSHOT.jar>
[INFO]
[INFO] --- site:3.7.1:attach-descriptor (attach-descriptor) @ qpid-java-doc-perftests ---
[INFO] Skipping because packaging 'jar' is not pom.
[INFO]
[INFO] --- assembly:3.0.0:single (default) @ qpid-java-doc-perftests ---
[INFO] Assemblies have been skipped per configuration of the skipAssembly parameter.
[INFO] ------------------------------------------------------------------------
[INFO] Reactor Summary for Apache Qpid Broker-J Parent 7.1.13-SNAPSHOT:
[INFO]
[INFO] Apache Qpid Broker-J Parent ........................ SUCCESS [ 5.475 s]
[INFO] Apache Qpid Broker-J Code Generation ............... SUCCESS [ 5.024 s]
[INFO] Apache Qpid Broker-J Test Utilities ................ SUCCESS [ 1.615 s]
[INFO] Apache Qpid Broker-J Core .......................... SUCCESS [04:41 min]
[INFO] Apache Qpid Broker-J LogBack Logging Plug-in ....... SUCCESS [ 14.301 s]
[INFO] Apache Qpid Broker-J Access Control Plug-in ........ SUCCESS [ 12.837 s]
[INFO] Apache Qpid Broker-J AMQP 0-10 Protocol Plug-in .... SUCCESS [ 14.333 s]
[INFO] Apache Qpid Broker-J AMQP 0-8 Protocol Plug-in ..... SUCCESS [ 13.735 s]
[INFO] Apache Qpid Broker-J AMQP 1-0 Protocol Plug-in ..... SUCCESS [ 27.663 s]
[INFO] Apache Qpid Broker-J AMQP 0-8 to 0-10 Message Conversion Plug-in SUCCESS [ 5.339 s]
[INFO] Apache Qpid Broker-J AMQP 0-8 to 1-0 Message Conversion Plug-in SUCCESS [ 8.626 s]
[INFO] Apache Qpid Broker-J AMQP 0-10 to 1-0 Message Conversion Plug-in SUCCESS [ 8.087 s]
[INFO] Apache Qpid Broker-J JDBC Message Store Plug-in .... SUCCESS [ 35.814 s]
[INFO] Apache Qpid Broker-J Derby Message Store Plug-in ... SUCCESS [ 4.043 s]
[INFO] Apache Qpid Broker-J JDBC Message Store Connection Pooling Plug-in SUCCESS [ 2.668 s]
[INFO] Apache Qpid Broker-J LogBack JDBC Logging Plug-in .. SUCCESS [ 12.326 s]
[INFO] Apache Qpid AMQP 1.0 JDBC Link Store Plug-in ....... SUCCESS [ 9.447 s]
[INFO] qpid-broker-plugins-prometheus-exporter ............ SUCCESS [ 5.962 s]
[INFO] Apache Qpid Broker-J HTTP Management Plug-in ....... SUCCESS [ 33.154 s]
[INFO] Apache Qpid Broker-J AMQP Management Protocol Plug-in SUCCESS [ 0.856 s]
[INFO] Apache Qpid Broker-J Memory Message Store Plug-in .. SUCCESS [ 0.724 s]
[INFO] Apache Qpid Broker-J WebSocket Plug-in ............. SUCCESS [ 0.814 s]
[INFO] Apache Qpid Broker-J BDB Message Store Plug-in ..... SUCCESS [ 10.110 s]
[INFO] Apache Qpid AMQP 1.0 BDB Link Store Plug-in ........ SUCCESS [ 2.735 s]
[INFO] Apache Qpid Broker-J ............................... SUCCESS [ 3.400 s]
[INFO] Apache Qpid Broker-J Bundles ....................... SUCCESS [ 10.594 s]
[INFO] Apache Qpid Broker-J Tools ......................... SUCCESS [ 0.658 s]
[INFO] Apache Qpid Broker-J System Test Parent ............ SUCCESS [ 0.261 s]
[INFO] Apache Qpid Broker-J System Test Utils ............. SUCCESS [ 0.929 s]
[INFO] Apache Qpid Broker-J JMS System Tests Core ......... SUCCESS [ 1.084 s]
[INFO] Apache Qpid Broker-J JMS 1.1 System Tests .......... SUCCESS [04:42 min]
[INFO] Apache Qpid Broker-J JMS 2.0 System Tests .......... SUCCESS [ 42.943 s]
[INFO] Apache Qpid Broker-J HTTP system tests ............. SUCCESS [01:24 min]
[INFO] Apache Qpid Broker-J Protocol Tests Core ........... SUCCESS [ 0.753 s]
[INFO] Apache Qpid Protocol Tests for AMQP 0-8,0-9,0-9-1 .. SUCCESS [ 42.478 s]
[INFO] Apache Qpid Protocol Tests for AMQP 0-10 ........... SUCCESS [ 30.594 s]
[INFO] Apache Qpid Protocol Tests for AMQP 1.0 ............ SUCCESS [01:29 min]
[INFO] Apache Qpid Broker-J System Tests Spawn Broker Admin SUCCESS [ 50.210 s]
[INFO] Apache Qpid Broker-J End to End Conversion Tests ... FAILURE [08:59 min]
[INFO] Apache Qpid Broker-J Performance Tests ............. SUCCESS [ 28.206 s]
[INFO] Apache Qpid Broker-J Performance Test System Tests . SUCCESS [ 25.398 s]
[INFO] Apache Qpid Broker-J Performance Tests Visualisation JFC SUCCESS [ 9.406 s]
[INFO] Apache Qpid Broker-J BDB Store System Tests ........ SUCCESS [ 7.949 s]
[INFO] Apache Qpid Joram JMS Tests ........................ SUCCESS [ 0.568 s]
[INFO] Apache Qpid Broker-J JMS TCK Configuration ......... SUCCESS [ 0.501 s]
[INFO] Apache Qpid Broker-J Docbook ....................... SUCCESS [ 0.148 s]
[INFO] Apache Qpid Broker-J Docbook ....................... SUCCESS [ 1.014 s]
[INFO] Apache Qpid Broker-J Performance Test Docbook ...... SUCCESS [ 0.178 s]
[INFO] ------------------------------------------------------------------------
[INFO] BUILD FAILURE
[INFO] ------------------------------------------------------------------------
[INFO] Total time: 29:32 min
[INFO] Finished at: 2024-01-01T05:45:13Z
[INFO] ------------------------------------------------------------------------
[INFO] 771 goals, 768 executed, 3 from cache
[INFO] Cleaning up the local build cache...
[INFO] Deleted 41 unused files from the local build cache in 0.029s
[INFO] ------------------------------------------------------------------------
[INFO]
[INFO] Publishing build scan...
[INFO] https://ge.apache.org/s/xp2gg2lquhqi6
[INFO]
[ERROR] Failed to execute goal org.apache.maven.plugins:maven-surefire-plugin:2.22.0:test (default-test) on project qpid-systests-end-to-end-conversion-tests: There are test failures.
[ERROR]
[ERROR] Please refer to <https://ci-builds.apache.org/job/Qpid/job/Qpid-Broker-J-7.1.x-TestMatrix/jdk=JDK%201.8%20(latest),profile=java-mms.1-0/48/artifact/systests/end-to-end-conversion-tests/target/surefire-reports/java-mms.1-0> for the individual test results.
[ERROR] Please refer to dump files (if any exist) [date]-jvmRun[N].dump, [date].dumpstream and [date]-jvmRun[N].dumpstream.
[ERROR] -> [Help 1]
[ERROR]
[ERROR] To see the full stack trace of the errors, re-run Maven with the -e switch.
[ERROR] Re-run Maven using the -X switch to enable full debug logging.
[ERROR]
[ERROR] For more information about the errors and possible solutions, please read the following articles:
[ERROR] [Help 1] http://cwiki.apache.org/confluence/display/MAVEN/MojoFailureException
[ERROR]
[ERROR] After correcting the problems, you can resume the build with the command
[ERROR] mvn <args> -rf :qpid-systests-end-to-end-conversion-tests
Build step 'Invoke top-level Maven targets' marked build as failure
Archiving artifacts
Recording test results
[Checks API] No suitable checks publisher found.